EESchema Schematic File Version 4
LIBS:pqws-power-hw-cache
EELAYER 30 0
EELAYER END
$Descr A4 11693 8268
encoding utf-8
Sheet 2 4
Title ""
Date ""
Rev ""
Comp ""
Comment1 ""
Comment2 ""
Comment3 ""
Comment4 ""
$EndDescr
Text Notes 3750 3100 0    50   ~ 0
VinMin = 3.0V\nVinMax = 9.0V\nVout = 3.3V\nIout = 1.0A
Connection ~ 7450 3450
Wire Wire Line
	7450 3750 7450 3450
Wire Wire Line
	7450 3450 7850 3450
Wire Wire Line
	7850 3450 7950 3450
Connection ~ 7850 3450
Wire Wire Line
	7850 3750 7850 3450
Wire Wire Line
	7850 4150 7850 4050
Wire Wire Line
	7450 4050 7450 4150
$Comp
L Device:C C204
U 1 1 5B136D58
P 7850 3900
AR Path="/5AEF6EAE/5B136D58" Ref="C204"  Part="1" 
AR Path="/5AF27103/5B136D58" Ref="C304"  Part="1" 
AR Path="/5AF2724B/5B136D58" Ref="C404"  Part="1" 
AR Path="/5AF2724F/5B136D58" Ref="C504"  Part="1" 
F 0 "C204" H 7965 3946 50  0000 L CNN
F 1 "47uF" H 7965 3855 50  0000 L CNN
F 2 "Capacitor_SMD:C_1206_3216Metric_Pad1.39x1.80mm_HandSolder" H 7888 3750 50  0001 C CNN
F 3 "~" H 7850 3900 50  0001 C CNN
F 4 "EMK316BBJ476ML-T" H 7850 3900 50  0001 C CNN "Part Number"
F 5 "" H 0   0   50  0001 C CNN "Part Number #2"
	1    7850 3900
	1    0    0    -1  
$EndComp
$Comp
L Device:C C203
U 1 1 5B136D57
P 7450 3900
AR Path="/5AEF6EAE/5B136D57" Ref="C203"  Part="1" 
AR Path="/5AF27103/5B136D57" Ref="C303"  Part="1" 
AR Path="/5AF2724B/5B136D57" Ref="C403"  Part="1" 
AR Path="/5AF2724F/5B136D57" Ref="C503"  Part="1" 
F 0 "C203" H 7565 3946 50  0000 L CNN
F 1 "10uF" H 7565 3855 50  0000 L CNN
F 2 "Capacitor_SMD:C_0603_1608Metric_Pad0.99x1.00mm_HandSolder" H 7488 3750 50  0001 C CNN
F 3 "~" H 7450 3900 50  0001 C CNN
F 4 "ZRB18AR61C106ME01L" H 7450 3900 50  0001 C CNN "Part Number"
F 5 "" H 0   0   50  0001 C CNN "Part Number #2"
	1    7450 3900
	1    0    0    -1  
$EndComp
Wire Wire Line
	6300 4100 6300 4150
$Comp
L power:GND #PWR0206
U 1 1 5B136D56
P 6300 4150
AR Path="/5AEF6EAE/5B136D56" Ref="#PWR0206"  Part="1" 
AR Path="/5AF27103/5B136D56" Ref="#PWR0306"  Part="1" 
AR Path="/5AF2724B/5B136D56" Ref="#PWR0406"  Part="1" 
AR Path="/5AF2724F/5B136D56" Ref="#PWR0506"  Part="1" 
F 0 "#PWR0206" H 6300 3900 50  0001 C CNN
F 1 "GND" H 6305 3977 50  0000 C CNN
F 2 "" H 6300 4150 50  0001 C CNN
F 3 "" H 6300 4150 50  0001 C CNN
	1    6300 4150
	1    0    0    -1  
$EndComp
Wire Wire Line
	6650 3450 7000 3450
Connection ~ 6650 3450
Wire Wire Line
	6650 3800 6650 3450
Wire Wire Line
	6650 4400 6650 4100
Wire Wire Line
	6050 4400 6650 4400
Wire Wire Line
	6050 4050 6050 4400
Wire Wire Line
	6050 3750 6300 3750
Wire Wire Line
	6300 3750 6300 3800
$Comp
L Device:R R203
U 1 1 5B136D55
P 6300 3950
AR Path="/5AEF6EAE/5B136D55" Ref="R203"  Part="1" 
AR Path="/5AF27103/5B136D55" Ref="R303"  Part="1" 
AR Path="/5AF2724B/5B136D55" Ref="R403"  Part="1" 
AR Path="/5AF2724F/5B136D55" Ref="R503"  Part="1" 
F 0 "R203" H 6230 3904 50  0000 R CNN
F 1 "100K" H 6230 3995 50  0000 R CNN
F 2 "Resistor_SMD:R_0603_1608Metric_Pad0.99x1.00mm_HandSolder" V 6230 3950 50  0001 C CNN
F 3 "~" H 6300 3950 50  0001 C CNN
F 4 "ERJ-PB3B1003V" H 0   0   50  0001 C CNN "Part Number"
F 5 "" H 0   0   50  0001 C CNN "Part Number #2"
	1    6300 3950
	-1   0    0    1   
$EndComp
Wire Wire Line
	6300 3450 6650 3450
Connection ~ 6300 3450
Connection ~ 6300 3750
$Comp
L Device:R R202
U 1 1 5B136D54
P 6300 3600
AR Path="/5AEF6EAE/5B136D54" Ref="R202"  Part="1" 
AR Path="/5AF27103/5B136D54" Ref="R302"  Part="1" 
AR Path="/5AF2724B/5B136D54" Ref="R402"  Part="1" 
AR Path="/5AF2724F/5B136D54" Ref="R502"  Part="1" 
F 0 "R202" H 6230 3554 50  0000 R CNN
F 1 "309K" H 6230 3645 50  0000 R CNN
F 2 "Resistor_SMD:R_0603_1608Metric_Pad0.99x1.00mm_HandSolder" V 6230 3600 50  0001 C CNN
F 3 "~" H 6300 3600 50  0001 C CNN
F 4 "CR0603-FX-3093ELF" H 0   0   50  0001 C CNN "Part Number"
	1    6300 3600
	-1   0    0    1   
$EndComp
$Comp
L Device:R R204
U 1 1 5AEE2BFB
P 6650 3950
AR Path="/5AEF6EAE/5AEE2BFB" Ref="R204"  Part="1" 
AR Path="/5AF27103/5AEE2BFB" Ref="R304"  Part="1" 
AR Path="/5AF2724B/5AEE2BFB" Ref="R404"  Part="1" 
AR Path="/5AF2724F/5AEE2BFB" Ref="R504"  Part="1" 
F 0 "R204" H 6580 3904 50  0000 R CNN
F 1 "102K" H 6580 3995 50  0000 R CNN
F 2 "Resistor_SMD:R_0603_1608Metric_Pad0.99x1.00mm_HandSolder" V 6580 3950 50  0001 C CNN
F 3 "~" H 6650 3950 50  0001 C CNN
F 4 "CRCW0603102KFKEA" H 0   0   50  0001 C CNN "Part Number"
	1    6650 3950
	-1   0    0    1   
$EndComp
$Comp
L power:GND #PWR0203
U 1 1 5AEE20D5
P 5250 4150
AR Path="/5AEF6EAE/5AEE20D5" Ref="#PWR0203"  Part="1" 
AR Path="/5AF27103/5AEE20D5" Ref="#PWR0303"  Part="1" 
AR Path="/5AF2724B/5AEE20D5" Ref="#PWR0403"  Part="1" 
AR Path="/5AF2724F/5AEE20D5" Ref="#PWR0503"  Part="1" 
F 0 "#PWR0203" H 5250 3900 50  0001 C CNN
F 1 "GND" H 5255 3977 50  0000 C CNN
F 2 "" H 5250 4150 50  0001 C CNN
F 3 "" H 5250 4150 50  0001 C CNN
	1    5250 4150
	1    0    0    -1  
$EndComp
Wire Wire Line
	5650 4350 5650 4450
Wire Wire Line
	4650 4150 4650 4200
$Comp
L power:GND #PWR0202
U 1 1 5AEE0F73
P 4650 4200
AR Path="/5AEF6EAE/5AEE0F73" Ref="#PWR0202"  Part="1" 
AR Path="/5AF27103/5AEE0F73" Ref="#PWR0302"  Part="1" 
AR Path="/5AF2724B/5AEE0F73" Ref="#PWR0402"  Part="1" 
AR Path="/5AF2724F/5AEE0F73" Ref="#PWR0502"  Part="1" 
F 0 "#PWR0202" H 4650 3950 50  0001 C CNN
F 1 "GND" H 4655 4027 50  0000 C CNN
F 2 "" H 4650 4200 50  0001 C CNN
F 3 "" H 4650 4200 50  0001 C CNN
	1    4650 4200
	1    0    0    -1  
$EndComp
Wire Wire Line
	4650 3850 5250 3850
Wire Wire Line
	3700 4150 3700 4200
$Comp
L Device:C C202
U 1 1 5AEDFBC2
P 4650 4000
AR Path="/5AEF6EAE/5AEDFBC2" Ref="C202"  Part="1" 
AR Path="/5AF27103/5AEDFBC2" Ref="C302"  Part="1" 
AR Path="/5AF2724B/5AEDFBC2" Ref="C402"  Part="1" 
AR Path="/5AF2724F/5AEDFBC2" Ref="C502"  Part="1" 
F 0 "C202" H 4765 4046 50  0000 L CNN
F 1 "100nF" H 4765 3955 50  0000 L CNN
F 2 "Capacitor_SMD:C_0603_1608Metric_Pad0.99x1.00mm_HandSolder" H 4688 3850 50  0001 C CNN
F 3 "~" H 4650 4000 50  0001 C CNN
F 4 "VJ0603V104ZXQPW1BC" H 4650 4000 50  0001 C CNN "Part Number"
	1    4650 4000
	1    0    0    -1  
$EndComp
$Comp
L power:GND #PWR0204
U 1 1 5B136D4F
P 5650 4450
AR Path="/5AEF6EAE/5B136D4F" Ref="#PWR0204"  Part="1" 
AR Path="/5AF27103/5B136D4F" Ref="#PWR0304"  Part="1" 
AR Path="/5AF2724B/5B136D4F" Ref="#PWR0404"  Part="1" 
AR Path="/5AF2724F/5B136D4F" Ref="#PWR0504"  Part="1" 
F 0 "#PWR0204" H 5650 4200 50  0001 C CNN
F 1 "GND" H 5655 4277 50  0000 C CNN
F 2 "" H 5650 4450 50  0001 C CNN
F 3 "" H 5650 4450 50  0001 C CNN
	1    5650 4450
	1    0    0    -1  
$EndComp
$Comp
L Device:C C201
U 1 1 5AEDF595
P 3700 4000
AR Path="/5AEF6EAE/5AEDF595" Ref="C201"  Part="1" 
AR Path="/5AF27103/5AEDF595" Ref="C301"  Part="1" 
AR Path="/5AF2724B/5AEDF595" Ref="C401"  Part="1" 
AR Path="/5AF2724F/5AEDF595" Ref="C501"  Part="1" 
F 0 "C201" H 3815 4046 50  0000 L CNN
F 1 "33uF" H 3815 3955 50  0000 L CNN
F 2 "Capacitor_SMD:C_1206_3216Metric_Pad1.39x1.80mm_HandSolder" H 3738 3850 50  0001 C CNN
F 3 "~" H 3700 4000 50  0001 C CNN
F 4 "C3216JB1E336M160AC" H 3700 4000 50  0001 C CNN "Part Number"
F 5 "" H 0   50  50  0001 C CNN "Part Number #2"
	1    3700 4000
	1    0    0    -1  
$EndComp
$Comp
L Device:R R201
U 1 1 5AEDF4B6
P 4800 3750
AR Path="/5AEF6EAE/5AEDF4B6" Ref="R201"  Part="1" 
AR Path="/5AF27103/5AEDF4B6" Ref="R301"  Part="1" 
AR Path="/5AF2724B/5AEDF4B6" Ref="R401"  Part="1" 
AR Path="/5AF2724F/5AEDF4B6" Ref="R501"  Part="1" 
F 0 "R201" V 4593 3750 50  0000 C CNN
F 1 "10K" V 4684 3750 50  0000 C CNN
F 2 "Resistor_SMD:R_0603_1608Metric_Pad0.99x1.00mm_HandSolder" V 4730 3750 50  0001 C CNN
F 3 "~" H 4800 3750 50  0001 C CNN
F 4 "RE0603BRE0710KL" H 0   50  50  0001 C CNN "Part Number"
	1    4800 3750
	0    1    1    0   
$EndComp
Wire Wire Line
	5250 2800 5250 3350
Wire Wire Line
	5500 2800 5250 2800
Wire Wire Line
	6050 2800 6050 3350
Wire Wire Line
	5800 2800 6050 2800
$Comp
L Device:L_Core_Ferrite L201
U 1 1 5AEDF1CF
P 5650 2800
AR Path="/5AEF6EAE/5AEDF1CF" Ref="L201"  Part="1" 
AR Path="/5AF27103/5AEDF1CF" Ref="L301"  Part="1" 
AR Path="/5AF2724B/5AEDF1CF" Ref="L401"  Part="1" 
AR Path="/5AF2724F/5AEDF1CF" Ref="L501"  Part="1" 
F 0 "L201" V 5875 2800 50  0000 C CNN
F 1 "1.4uH" V 5784 2800 50  0000 C CNN
F 2 "Inductor_SMD:L_Coilcraft_XxL4020" H 5650 2800 50  0001 C CNN
F 3 "~" H 5650 2800 50  0001 C CNN
F 4 "XFL4020-152MEB" V 5650 2800 50  0001 C CNN "Part Number"
	1    5650 2800
	0    -1   -1   0   
$EndComp
$Comp
L lsf-kicad:TPS63070RNM U201
U 1 1 5AEBA648
P 5650 3750
AR Path="/5AEF6EAE/5AEBA648" Ref="U201"  Part="1" 
AR Path="/5AF27103/5AEBA648" Ref="U301"  Part="1" 
AR Path="/5AF2724B/5AEBA648" Ref="U401"  Part="1" 
AR Path="/5AF2724F/5AEBA648" Ref="U501"  Part="1" 
AR Path="/5AEBA648" Ref="U201"  Part="1" 
F 0 "U201" H 5650 4531 50  0000 C CNN
F 1 "TPS63070RNM" H 5650 4440 50  0000 C CNN
F 2 "lsf-kicad-lib:VQFN-15_2.5x3_Pitch0.5mm" H 5650 3750 50  0001 C CNN
F 3 "http://www.ti.com/lit/ds/symlink/tps63070.pdf" H 5650 3750 50  0001 C CNN
F 4 "TPS63070RNM" H 0   0   50  0001 C CNN "Part Number"
	1    5650 3750
	1    0    0    -1  
$EndComp
$Comp
L power:GND #PWR0205
U 1 1 5B136D5B
P 6150 4000
AR Path="/5AEF6EAE/5B136D5B" Ref="#PWR0205"  Part="1" 
AR Path="/5AF27103/5B136D5B" Ref="#PWR0305"  Part="1" 
AR Path="/5AF2724B/5B136D5B" Ref="#PWR0405"  Part="1" 
AR Path="/5AF2724F/5B136D5B" Ref="#PWR0505"  Part="1" 
F 0 "#PWR0205" H 6150 3750 50  0001 C CNN
F 1 "GND" H 6155 3827 50  0000 C CNN
F 2 "" H 6150 4000 50  0001 C CNN
F 3 "" H 6150 4000 50  0001 C CNN
	1    6150 4000
	1    0    0    -1  
$EndComp
Wire Wire Line
	6050 3850 6150 3850
Wire Wire Line
	6150 3850 6150 4000
Wire Wire Line
	6050 3450 6300 3450
Text HLabel 7950 3450 2    50   Input ~ 0
V_Out
Text HLabel 3700 3450 0    50   Input ~ 0
U_V_Bus
$Comp
L Jumper:SolderJumper_2_Open JP201
U 1 1 5AF26373
P 7700 3200
AR Path="/5AEF6EAE/5AF26373" Ref="JP201"  Part="1" 
AR Path="/5AF27103/5AF26373" Ref="JP301"  Part="1" 
AR Path="/5AF2724B/5AF26373" Ref="JP401"  Part="1" 
AR Path="/5AF2724F/5AF26373" Ref="JP501"  Part="1" 
F 0 "JP201" H 7700 3405 50  0000 C CNN
F 1 "bypass" H 7700 3314 50  0000 C CNN
F 2 "Jumper:SolderJumper-2_P1.3mm_Open_Pad1.0x1.5mm" H 7700 3200 50  0001 C CNN
F 3 "~" H 7700 3200 50  0001 C CNN
	1    7700 3200
	1    0    0    -1  
$EndComp
Wire Wire Line
	7850 3200 7850 3450
Text HLabel 7550 3200 0    50   Input ~ 0
U_V_Bus
$Comp
L Device:Jumper_NC_Dual JP202
U 1 1 5B0D82DE
P 5000 4600
F 0 "JP202" V 5046 4702 50  0000 L CNN
F 1 "PWM/PSM" V 4955 4702 50  0000 L CNN
F 2 "Jumper:SolderJumper-3_P1.3mm_Open_Pad1.0x1.5mm_NumberLabels" H 5000 4600 50  0001 C CNN
F 3 "~" H 5000 4600 50  0001 C CNN
	1    5000 4600
	0    -1   -1   0   
$EndComp
Wire Wire Line
	5250 4050 5250 4150
Wire Wire Line
	4950 3750 5000 3750
Wire Wire Line
	5150 3950 5150 4600
Wire Wire Line
	5150 4600 5100 4600
Wire Wire Line
	5150 3950 5250 3950
Wire Wire Line
	5000 4350 5000 3750
Connection ~ 5000 3750
Wire Wire Line
	5000 3750 5250 3750
$Comp
L power:GND #PWR0115
U 1 1 5B0DC68D
P 5000 4950
F 0 "#PWR0115" H 5000 4700 50  0001 C CNN
F 1 "GND" H 5005 4777 50  0000 C CNN
F 2 "" H 5000 4950 50  0001 C CNN
F 3 "" H 5000 4950 50  0001 C CNN
	1    5000 4950
	1    0    0    -1  
$EndComp
Wire Wire Line
	5000 4950 5000 4850
Text Notes 4500 4800 0    50   ~ 0
Short 2-3
Text Label 5250 3100 0    50   ~ 0
L1
Text Label 6050 3100 0    50   ~ 0
L2
$Comp
L Device:C C205
U 1 1 5B0D63C5
P 4150 4000
F 0 "C205" H 4035 3954 50  0000 R CNN
F 1 "100pF" H 4035 4045 50  0000 R CNN
F 2 "Capacitor_SMD:C_0603_1608Metric_Pad0.99x1.00mm_HandSolder" H 4188 3850 50  0001 C CNN
F 3 "~" H 4150 4000 50  0001 C CNN
F 4 "0603YC101K4T2A" H 0   50  50  0001 C CNN "Part Number"
	1    4150 4000
	-1   0    0    1   
$EndComp
$Comp
L Device:C C206
U 1 1 5B0D6366
P 7000 3900
F 0 "C206" H 6885 3854 50  0000 R CNN
F 1 "100pF" H 6885 3945 50  0000 R CNN
F 2 "Capacitor_SMD:C_0603_1608Metric_Pad0.99x1.00mm_HandSolder" H 7038 3750 50  0001 C CNN
F 3 "~" H 7000 3900 50  0001 C CNN
F 4 "0603YC101K4T2A" H 0   0   50  0001 C CNN "Part Number"
	1    7000 3900
	-1   0    0    1   
$EndComp
Wire Wire Line
	3700 3450 3950 3450
Wire Wire Line
	3700 3450 3700 3850
Wire Wire Line
	4150 3850 4150 3450
Connection ~ 4150 3450
Wire Wire Line
	4650 3750 4650 3450
Wire Wire Line
	4150 3450 3950 3450
Connection ~ 4650 3450
Wire Wire Line
	7000 4050 7000 4150
Wire Wire Line
	7000 3750 7000 3450
Connection ~ 7000 3450
Wire Wire Line
	7000 3450 7450 3450
Text Label 6100 3750 0    50   ~ 0
FB
Text Label 6100 3850 0    50   ~ 0
FB2
Text Label 5050 3850 0    50   ~ 0
VAUX
Text Label 5150 4600 0    50   ~ 0
PS
Text Label 6450 4400 0    50   ~ 0
PG
Wire Wire Line
	5750 4700 5750 4350
Wire Wire Line
	4150 4200 4150 4150
$Comp
L Device:Net-Tie_2 NT201
U 1 1 5B0F2E2C
P 6700 5050
F 0 "NT201" H 6700 5228 50  0000 C CNN
F 1 "GND" H 6700 5137 50  0000 C CNN
F 2 "NetTie:NetTie-2_SMD_Pad0.5mm" H 6700 5050 50  0001 C CNN
F 3 "~" H 6700 5050 50  0001 C CNN
	1    6700 5050
	1    0    0    -1  
$EndComp
$Comp
L power:GND #PWR0126
U 1 1 5B0F3393
P 6550 5050
F 0 "#PWR0126" H 6550 4800 50  0001 C CNN
F 1 "GND" H 6555 4877 50  0000 C CNN
F 2 "" H 6550 5050 50  0001 C CNN
F 3 "" H 6550 5050 50  0001 C CNN
	1    6550 5050
	1    0    0    -1  
$EndComp
Wire Wire Line
	6550 5050 6600 5050
Wire Wire Line
	6800 5050 6850 5050
$Comp
L power:GNDA #PWR0120
U 1 1 5B15C5E4
P 3700 4200
F 0 "#PWR0120" H 3700 3950 50  0001 C CNN
F 1 "GNDA" H 3705 4027 50  0000 C CNN
F 2 "" H 3700 4200 50  0001 C CNN
F 3 "" H 3700 4200 50  0001 C CNN
	1    3700 4200
	1    0    0    -1  
$EndComp
$Comp
L power:GNDA #PWR0121
U 1 1 5B15C803
P 4150 4200
F 0 "#PWR0121" H 4150 3950 50  0001 C CNN
F 1 "GNDA" H 4155 4027 50  0000 C CNN
F 2 "" H 4150 4200 50  0001 C CNN
F 3 "" H 4150 4200 50  0001 C CNN
	1    4150 4200
	1    0    0    -1  
$EndComp
$Comp
L power:GNDA #PWR0122
U 1 1 5B15C82C
P 7000 4150
F 0 "#PWR0122" H 7000 3900 50  0001 C CNN
F 1 "GNDA" H 7005 3977 50  0000 C CNN
F 2 "" H 7000 4150 50  0001 C CNN
F 3 "" H 7000 4150 50  0001 C CNN
	1    7000 4150
	1    0    0    -1  
$EndComp
$Comp
L power:GNDA #PWR0123
U 1 1 5B15C909
P 7450 4150
F 0 "#PWR0123" H 7450 3900 50  0001 C CNN
F 1 "GNDA" H 7455 3977 50  0000 C CNN
F 2 "" H 7450 4150 50  0001 C CNN
F 3 "" H 7450 4150 50  0001 C CNN
	1    7450 4150
	1    0    0    -1  
$EndComp
$Comp
L power:GNDA #PWR0124
U 1 1 5B15C932
P 7850 4150
F 0 "#PWR0124" H 7850 3900 50  0001 C CNN
F 1 "GNDA" H 7855 3977 50  0000 C CNN
F 2 "" H 7850 4150 50  0001 C CNN
F 3 "" H 7850 4150 50  0001 C CNN
	1    7850 4150
	1    0    0    -1  
$EndComp
$Comp
L power:GNDA #PWR0125
U 1 1 5B15CB5A
P 6850 5050
F 0 "#PWR0125" H 6850 4800 50  0001 C CNN
F 1 "GNDA" H 6855 4877 50  0000 C CNN
F 2 "" H 6850 5050 50  0001 C CNN
F 3 "" H 6850 5050 50  0001 C CNN
	1    6850 5050
	1    0    0    -1  
$EndComp
$Comp
L power:GNDA #PWR01
U 1 1 5B15CDDC
P 5750 4700
F 0 "#PWR01" H 5750 4450 50  0001 C CNN
F 1 "GNDA" H 5755 4527 50  0000 C CNN
F 2 "" H 5750 4700 50  0001 C CNN
F 3 "" H 5750 4700 50  0001 C CNN
	1    5750 4700
	1    0    0    -1  
$EndComp
$Comp
L power:PWR_FLAG #FLG0104
U 1 1 5B17BE17
P 3950 3450
F 0 "#FLG0104" H 3950 3525 50  0001 C CNN
F 1 "PWR_FLAG" H 3950 3624 50  0000 C CNN
F 2 "" H 3950 3450 50  0001 C CNN
F 3 "~" H 3950 3450 50  0001 C CNN
	1    3950 3450
	1    0    0    -1  
$EndComp
Connection ~ 3950 3450
Wire Wire Line
	5650 3150 4650 3150
Wire Wire Line
	4650 3150 4650 3450
Wire Wire Line
	4150 3450 4650 3450
$EndSCHEMATC
