<?xml version="1.0" encoding="iso-8859-1"?>
<!-- Uploaded to: SVG Repo, www.svgrepo.com, Generator: SVG Repo Mixer Tools -->
<svg fill="#000000" height="800px" id="Layer_1" version="1.1" viewBox="0 0 512 512" width="800px"
     xml:space="preserve" xmlns="http://www.w3.org/2000/svg">
<g>
	<g>
		<path d="M324.438,242.659h-4.678c-5.771,0-10.449,4.678-10.449,10.449c0,5.771,4.678,10.449,10.449,10.449h4.678
			c5.771,0,10.449-4.678,10.449-10.449C334.887,247.338,330.209,242.659,324.438,242.659z"/>
	</g>
</g>
  <g>
	<g>
		<path d="M449.284,242.659h-91.043c-5.771,0-10.449,4.678-10.449,10.449c0,5.771,4.678,10.449,10.449,10.449h91.043
			c5.771,0,10.449-4.678,10.449-10.449C459.733,247.338,455.055,242.659,449.284,242.659z"/>
	</g>
</g>
  <g>
	<g>
		<path d="M511.017,233.709c-2.219-16.704-17.158-29.789-34.008-29.789H286.776c-17.285,0-31.347,14.062-31.347,31.347v44.992
			c0,17.285,14.062,31.347,31.347,31.347h93.931c3.253,0,4.855,1.164,5.035,1.552c0.015,0.067,0.012,0.353-0.154,0.848
			c-10.898,24.254-28.416,44.962-50.677,59.899c-0.001,0-0.002,0.001-0.003,0.002c-23.464,15.74-50.749,24.059-78.905,24.059
			c-58.308,0-111.537-36.663-132.455-91.234c-0.001-0.002-0.001-0.004-0.002-0.007c-6.308-16.464-9.507-33.531-9.507-50.725
			c0-17.415,3.26-34.651,9.69-51.229c0.003-0.008,0.005-0.017,0.008-0.025c21.378-55.104,73.29-90.708,132.26-90.708
			c28.409,0,55.864,8.453,79.399,24.447c0.041,0.027,0.081,0.055,0.122,0.083l0.721,0.475c0.062,0.04,0.123,0.08,0.186,0.119
			c6.078,3.825,12.97,5.847,19.929,5.847c9.198,0,17.601-3.574,23.649-10.048l37.141-39.624c5.871-6.285,8.647-14.498,7.615-22.531
			c-0.992-7.719-5.425-14.71-12.218-19.324c-0.177-0.157-0.359-0.307-0.547-0.451C366.931,18.338,312.987,0,255.999,0
			C161.081,0,74.417,52.14,29.823,136.075c-0.006,0.012-0.01,0.023-0.017,0.034C10.308,172.826,0.001,214.283,0.001,256.002
			c0,41.938,10.399,83.575,30.071,120.415c0.001,0.002,0.002,0.005,0.004,0.008C74.746,460.051,161.313,512,255.997,512
			c60.952,0,120.029-21.84,166.356-61.5c0.013-0.01,0.025-0.019,0.038-0.029c56.948-48.771,89.608-119.653,89.608-194.471
			C511.999,241.271,511.057,234.011,511.017,233.709z M255.999,20.898c52.192,0,101.595,16.742,142.906,48.428
			c0,0,1.137,0.892,1.625,1.264c2.147,1.638,3.264,3.01,3.505,4.878c0.239,1.867-0.528,3.858-2.147,5.592l-37.141,39.624
			c-2.647,2.834-6.023,3.428-8.389,3.428c-2.941,0-6.033-0.917-8.717-2.584l-0.559-0.369c-26.998-18.33-58.493-28.018-91.082-28.018
			c-33.484,0-65.64,10.107-92.993,29.23c-22.822,15.956-40.985,37.189-53.117,61.953l-57.426-45.991
			C94.504,65.672,171.708,20.898,255.999,20.898z M20.899,256.002c0-34.078,7.503-67.955,21.757-98.751l58.966,47.224
			c-5.63,16.755-8.479,34.051-8.479,51.525c0,17.271,2.799,34.405,8.329,51.04l-58.662,48.071
			C28.455,324.228,20.899,290.23,20.899,256.002z M255.997,491.102c-84.1,0-161.232-44.636-203.325-117.055l57.042-46.744
			c12.082,24.829,30.216,46.129,53.042,62.152c27.407,19.24,59.651,29.41,93.248,29.41c29.745,0,58.637-8.084,84.036-23.452
			l58.901,47.174C358.027,473.955,307.745,491.102,255.997,491.102z M415.23,428.857l-57.359-45.938
			c20.26-16.25,36.362-37.002,46.947-60.72c0.077-0.172,0.149-0.347,0.216-0.523c2.712-7.082,1.95-14.512-2.09-20.383
			c-4.56-6.629-12.873-10.586-22.237-10.586h-93.931c-5.762,0-10.449-4.687-10.449-10.449v-44.992
			c0-5.762,4.687-10.449,10.449-10.449h190.232c6.257,0,12.469,5.442,13.29,11.618c0.007,0.063,0.802,6.434,0.802,19.564
			C491.101,321.832,463.545,384.336,415.23,428.857z"/>
	</g>
</g>
</svg>
