<?xml version="1.0" encoding="utf-8"?><!-- Uploaded to: SVG Repo, www.svgrepo.com, Generator: SVG Repo Mixer Tools -->
<svg fill="none" height="800px" viewBox="0 0 24 24" width="800px" xmlns="http://www.w3.org/2000/svg">
  <path
    d="M9.5 13.75C9.5 14.72 10.25 15.5 11.17 15.5H13.05C13.85 15.5 14.5 14.82 14.5 13.97C14.5 13.06 14.1 12.73 13.51 12.52L10.5 11.47C9.91 11.26 9.51001 10.94 9.51001 10.02C9.51001 9.17999 10.16 8.48999 10.96 8.48999H12.84C13.76 8.48999 14.51 9.26999 14.51 10.24"
    stroke="#292D32" stroke-linecap="round" stroke-linejoin="round" stroke-width="1.5"/>
  <path d="M12 7.5V16.5" stroke="#292D32" stroke-linecap="round" stroke-linejoin="round" stroke-width="1.5"/>
  <path d="M22 12C22 17.52 17.52 22 12 22C6.48 22 2 17.52 2 12C2 6.48 6.48 2 12 2" stroke="#292D32"
        stroke-linecap="round"
        stroke-linejoin="round" stroke-width="1.5"/>
  <path d="M17 3V7H21" stroke="#292D32" stroke-linecap="round" stroke-linejoin="round" stroke-width="1.5"/>
  <path d="M22 2L17 7" stroke="#292D32" stroke-linecap="round" stroke-linejoin="round" stroke-width="1.5"/>
</svg>
