{
  "httpservers": {
    "guestbook": {
      "package": "guestbook",
      "listen": {
        "host": ":7002"
      },
      "request": {
        "form": true
      },
      "response": {
        "write": true
      }
    }
  }
}
