GLOBAL_SIZE_0;GLOBAL_SIZE_1;GLOBAL_SIZE_2;LOCAL_SIZE_0;LOCAL_SIZE_1;LOCAL_SIZE_2;cost
64;64;16;4;16;2;12637482
32;8;32;16;1;4;2256740
1;32;8;1;8;1;34806371
32;8;1;1;1;1;62443111
1;4;256;1;4;2;14405630
8;256;4;1;16;1;48939259
4;1;1;2;1;1;2251364000
16;8;4;16;2;1;24356148
4;1;128;4;1;1;22858814
32;128;64;4;4;1;11308444
4;2;4;1;2;1;284509926
64;128;256;16;64;32;18446744073709551615
64;8;32;16;1;2;4075852
32;8;32;8;1;2;6941482
32;16;16;16;8;1;2003407
32;8;16;16;1;4;3566223
32;16;16;32;2;1;1965333
128;16;16;16;8;1;3880741
32;16;8;16;8;1;3685482
32;16;32;16;8;1;3395111
32;16;16;32;2;2;2013630
32;16;64;32;2;1;2812741
32;8;16;1;4;1;43698223
64;16;16;32;4;1;2439111
64;8;16;64;1;1;1994370
32;32;16;32;2;1;2019556
32;8;16;32;4;1;3507408
64;16;16;16;2;1;4530518
32;16;16;32;2;8;18446744073709551615
32;16;16;32;4;1;1947407
32;16;16;32;2;16;18446744073709551615
32;16;8;32;2;1;3542815
64;256;16;32;128;4;18446744073709551615
32;16;16;32;1;1;2377334
2;16;16;2;4;4;23016445
32;16;16;32;4;4;18446744073709551615
1;1;2;1;1;1;4161634815
128;64;2;4;4;1;12326667
32;16;8;32;4;1;3544592
32;16;16;32;4;16;18446744073709551615
32;16;8;16;4;1;3702223
16;16;16;16;4;1;3434518
32;16;128;32;4;1;2951408
8;16;1;1;8;1;82519407
32;1;16;32;1;8;26471704
256;16;1;32;4;1;4195259
32;16;16;32;4;8;18446744073709551615
32;4;16;32;1;1;6231407
64;32;16;32;2;1;2965630
32;32;16;1;2;1;41091408
16;32;4;16;16;4;18446744073709551615
32;256;128;1;16;2;31888889
128;8;64;2;4;1;21859407
4;1;1;2;1;1;2254090815
32;32;64;8;32;2;18446744073709551615
64;32;8;8;8;2;6681333
16;64;64;8;64;2;18446744073709551615
16;4;16;16;1;2;11772297
1;16;16;1;4;1;35799111
256;256;16;32;128;1;18446744073709551615
32;16;16;32;2;1;1978666
32;16;16;32;4;16;18446744073709551615
32;16;16;32;2;8;18446744073709551615
32;16;16;32;4;2;1898815
32;4;16;32;2;2;6448148
32;8;16;32;8;2;18446744073709551615
32;16;32;32;4;2;1719556
16;16;16;1;4;2;32898815
128;16;64;32;4;2;2871556
8;8;16;2;8;1;11867704
32;32;16;16;2;2;2811260
16;32;32;1;2;4;34498963
32;16;128;32;2;4;2613778
16;16;32;1;4;2;31621482
32;16;32;1;2;2;36774222
32;16;32;16;4;4;2919704
32;16;32;32;8;2;18446744073709551615
32;16;64;32;4;1;2911111
16;16;16;2;4;1;16948444
8;16;64;1;2;4;26788592
32;16;64;32;4;2;2583259
32;4;32;1;2;2;34684889
32;8;32;16;8;4;18446744073709551615
32;16;32;32;2;2;2348000
32;64;32;32;1;2;3143259
32;16;16;16;4;2;2033926
32;4;32;32;2;2;3289778
32;8;32;2;1;2;23873334
8;32;64;2;2;2;11307111
64;16;128;32;4;2;2751259
16;16;64;4;2;2;11326074
32;16;32;32;4;4;18446744073709551615
32;8;32;32;8;8;18446744073709551615
32;32;64;1;4;2;32237778
32;8;32;32;8;4;18446744073709551615
8;16;32;1;4;4;22757333
32;16;64;32;4;4;18446744073709551615
16;16;32;1;4;4;29797629
64;16;16;16;4;2;3666074
32;16;32;16;4;2;3506667
16;4;32;1;2;2;30200000
16;16;32;1;2;2;35660148
32;16;32;32;2;4;1760889
64;16;16;32;4;2;2240445
32;16;32;16;4;1;3571259
32;8;32;32;2;2;1957333
32;16;8;16;4;4;3676445
2;256;64;2;32;2;34743852
8;32;2;4;32;2;48360740
4;2;1;2;1;1;1136071260
128;4;256;1;2;8;31606815
8;16;32;8;4;2;3410518
32;8;32;32;8;2;18446744073709551615
32;16;32;1;4;2;33721778
32;16;32;32;8;1;2097185
128;64;8;64;2;1;4039407
64;32;128;16;2;16;18446744073709551615
32;16;32;8;4;2;4696593
32;1;32;32;1;2;12529333
32;32;16;32;2;4;1833333
64;16;32;16;4;1;3941186
8;16;32;4;4;2;5257629
8;32;2;1;2;2;21826815
128;1;8;2;1;1;24395111
1;8;256;1;8;4;21435704
1;1;2;1;1;2;4157268444
32;16;128;32;4;2;2582075
64;16;32;16;4;2;4249777
32;256;32;32;128;2;18446744073709551615
16;32;8;16;2;4;3454371
16;16;32;2;4;2;14741481
32;16;32;2;8;2;15960741
32;16;32;32;4;1;2182074
32;16;32;2;8;8;15739111
16;16;32;1;4;1;41760296
32;8;32;32;1;2;2028889
128;16;32;32;4;2;2940444
32;8;32;32;4;2;1895408
16;16;32;2;2;4;16953481
32;32;32;32;2;2;3004148
64;16;32;32;4;2;2958074
128;16;32;32;2;2;3151259
8;32;16;2;2;2;10736740
32;32;32;32;2;1;2709333
16;16;64;1;16;4;41298518
32;32;64;32;32;2;18446744073709551615
32;16;128;1;4;2;30950963
64;64;32;1;1;4;15234667
16;16;64;1;4;2;31330519
32;8;16;1;8;2;29160296
16;32;64;4;1;4;13435407
32;16;128;32;4;2;2581777
32;32;32;32;4;4;18446744073709551615
32;32;16;32;32;2;18446744073709551615
8;16;32;2;2;2;10534666
32;64;32;1;1;2;27947704
32;32;32;32;2;4;2629482
32;16;256;32;8;1;2616740
8;16;32;2;4;2;9288148
128;8;32;32;2;2;3259408
32;8;16;32;4;2;3436741
16;8;32;2;8;1;18715852
32;32;32;1;2;2;38686815
32;4;32;32;2;1;3292148
32;8;16;32;2;2;3605334
32;32;16;32;1;2;2158074
32;16;8;8;8;2;3552445
64;16;32;16;4;4;3627704
32;16;32;8;2;2;5928445
64;32;32;32;2;2;3217926
32;16;16;32;4;4;18446744073709551615
16;16;32;2;2;2;16840592
32;16;32;32;16;1;18446744073709551615
32;32;32;8;32;2;18446744073709551615
32;8;16;16;8;2;3674519
32;16;64;1;4;2;34580296
32;16;32;2;4;2;16006666
8;16;32;2;4;1;11693629
64;16;4;32;4;2;3549037
32;32;32;1;2;4;33241037
32;32;32;32;2;8;18446744073709551615
32;32;64;32;2;8;18446744073709551615
32;8;32;32;8;1;1922814
8;16;32;2;8;2;9665926
16;16;16;1;1;2;45687852
64;16;32;8;2;2;5788296
32;32;64;32;2;2;3128889
32;32;32;1;2;1;43392889
16;4;64;2;2;2;15664149
32;16;32;32;2;1;2140149
32;8;64;32;8;2;18446744073709551615
32;32;32;8;2;2;5745778
32;16;32;16;2;2;2940889
32;4;32;32;2;4;3375852
16;32;32;1;2;2;35464445
32;64;32;32;1;4;3165185
16;16;32;2;1;2;22004889
32;16;128;32;8;2;18446744073709551615
128;8;1;64;2;1;13865777
32;64;8;32;1;4;2344000
32;16;8;32;4;2;3493630
32;32;32;16;2;2;3261037
8;32;8;8;1;1;7215852
32;8;32;16;8;16;18446744073709551615
4;16;4;2;4;1;36835555
1;64;16;1;1;4;16672741
64;16;4;32;8;1;3653333
32;4;8;32;1;2;12647556
32;16;64;16;4;2;4191408
32;16;32;32;8;8;18446744073709551615
32;4;1;1;1;1;87210222
32;16;1;2;4;1;23142815
32;8;32;8;8;2;3938370
64;16;32;32;2;1;3226518
32;8;32;1;8;1;38634963
32;16;8;16;4;2;3708148
64;16;32;64;4;2;18446744073709551615
32;16;32;8;4;2;4947111
64;8;32;64;8;1;18446744073709551615
32;16;32;32;1;2;2478814
16;16;32;2;4;4;13433333
16;16;32;16;4;2;1949185
32;16;32;32;4;16;18446744073709551615
8;32;32;1;2;2;25251556
32;16;32;32;4;8;18446744073709551615
8;16;128;2;4;2;12654370
32;16;64;8;4;2;5306074
64;4;32;32;2;4;1892593
32;16;32;16;8;2;3155111
16;16;64;1;8;2;32432148
32;16;32;2;2;2;18071556
32;8;4;32;1;4;12924149
32;32;32;32;8;2;18446744073709551615
32;64;32;4;2;1;14024296
128;16;8;32;4;1;2354519
1;64;64;1;4;4;37942074
256;256;16;1;256;4;18446744073709551615
128;2;1;16;1;1;53948000
256;16;8;8;2;2;6447852
32;16;8;32;8;1;3536889
32;64;32;32;1;1;3446074
32;16;32;32;1;2;2487408
32;1;32;1;1;32;29514223
32;16;32;32;2;2;2241333
32;32;32;2;2;2;18420593
32;16;8;32;4;4;18446744073709551615
128;256;2;16;1;1;5544445
64;8;32;32;8;2;18446744073709551615
64;64;4;16;4;4;3284889
32;8;8;32;8;1;6801481
64;32;8;64;1;8;18446744073709551615
32;16;64;2;8;2;16996000
64;8;64;64;2;2;2636297
1;4;8;1;2;1;265860593
2;1;1;2;1;1;4300967259
1;1;16;1;1;1;526779556
32;8;1;2;4;1;45458222
64;16;32;32;4;1;3108148
64;32;8;16;8;4;18446744073709551615
32;8;32;16;8;2;2004444
32;256;32;32;128;4;18446744073709551615
32;16;32;32;8;2;18446744073709551615
32;16;32;1;4;1;46505926
64;32;16;16;8;4;18446744073709551615
32;16;16;16;8;4;18446744073709551615
32;16;16;32;8;8;18446744073709551615
64;16;16;32;8;8;18446744073709551615
32;32;32;32;1;2;2787704
64;8;32;32;8;1;2143259
32;256;8;4;2;1;14946074
2;1;256;1;1;1;45005481
128;1;2;8;1;2;52709037
4;256;2;2;64;2;28622815
32;16;32;4;4;2;8565037
4;1;32;4;1;2;72572148
32;128;32;1;128;2;41193037
32;32;128;32;2;1;2778815
32;16;128;32;1;2;3042667
32;8;64;1;8;2;31557778
64;32;16;32;4;8;18446744073709551615
64;16;16;16;16;4;18446744073709551615
32;16;8;32;2;2;3573037
8;16;32;2;4;4;8431407
32;16;64;32;1;1;3191852
32;16;32;32;16;2;18446744073709551615
64;16;16;16;2;4;3102963
1;4;16;1;4;16;416580000
32;1;1;16;1;1;403094815
1;1;1;1;1;1;8270326074
32;16;8;32;16;2;18446744073709551615
32;16;32;1;1;4;41316000
1;16;32;1;1;2;28533630
32;16;32;8;4;1;6424888
32;16;32;32;16;8;18446744073709551615
32;16;32;4;16;2;11447408
32;16;1;32;4;1;25996741
32;2;32;32;2;2;6526963
32;16;4;32;4;1;6516444
32;64;1;32;1;1;6717777
32;16;32;32;4;4;18446744073709551615
2;64;32;2;1;2;14184296
32;16;1;32;4;1;25976296
32;16;4;32;4;2;6671556
32;16;32;1;4;2;33891555
1;16;32;1;4;2;19829778
32;16;32;32;16;2;18446744073709551615
1;16;32;1;4;4;18697630
4;16;32;4;4;2;5558963
32;16;32;2;4;4;14987555
32;16;32;8;1;2;7240149
32;1;32;32;1;2;12620444
2;1;64;2;1;2;68196444
16;16;1;1;4;1;46958963
32;16;2;32;1;2;12863260
32;16;32;32;4;32;18446744073709551615
32;1;2;32;1;2;196502222
32;1;8;32;1;2;49758963
1;16;32;1;4;1;21992593
32;16;32;4;4;2;8448445
2;16;32;2;4;8;16874963
256;16;32;32;4;2;3057185
32;8;32;32;8;8;18446744073709551615
32;16;8;32;1;2;3590519
32;8;32;32;8;2;18446744073709551615
32;16;32;32;4;2;1688593
32;16;256;32;4;2;2404740
1;16;4;1;4;2;136514222
32;16;1;32;4;1;25958815
32;16;32;2;4;2;15796149
32;16;256;32;4;128;18446744073709551615
32;8;32;32;8;2;18446744073709551615
32;8;32;32;8;1;1979851
32;1;32;1;1;2;36490667
32;16;1;32;4;1;25848148
32;16;8;32;4;8;18446744073709551615
4;4;32;4;2;1;18524889
1;16;8;1;4;8;101920889
1;16;32;1;8;4;24897482
32;16;32;32;8;2;18446744073709551615
32;4;32;32;2;16;18446744073709551615
2;16;32;2;4;2;21684592
32;256;32;32;128;2;18446744073709551615
32;16;32;8;4;2;9642666
32;64;32;32;1;2;4245926
32;16;32;32;4;2;3549778
32;128;32;32;128;2;18446744073709551615
32;16;32;32;4;8;18446744073709551615
32;16;128;1;4;128;18446744073709551615
32;8;32;32;1;2;3653185
32;32;32;4;2;2;18395111
32;1;32;32;1;4;22936888
32;16;4;32;4;2;12710074
32;16;32;32;8;2;18446744073709551615
32;16;32;4;4;2;17951852
8;16;32;2;4;2;18310074
32;16;32;1;4;2;44982222
32;16;2;32;4;2;13215408
32;16;32;32;1;2;2413482
32;16;32;1;4;2;33533186
256;16;32;32;4;2;3096740
256;16;32;64;4;2;18446744073709551615
32;16;32;32;4;1;2022963
128;16;32;32;4;2;3039555
32;16;16;32;8;4;18446744073709551615
256;16;32;2;4;2;18456444
32;16;32;32;2;2;2170963
1;16;32;1;4;2;19425037
32;1;32;1;1;2;35836148
64;4;16;4;4;1;9846371
32;128;4;32;128;2;18446744073709551615
32;2;32;32;2;1;6292000
32;128;32;32;128;16;18446744073709551615
64;8;16;8;1;2;6824445
64;8;1;32;2;1;26797185
128;4;128;64;1;2;3601778
128;64;64;2;32;1;22725926
64;16;16;4;8;1;10933926
32;256;32;32;2;16;18446744073709551615
32;4;8;32;2;8;18446744073709551615
64;16;16;8;8;2;6847851
4;128;1;2;2;1;22094074
2;1;64;2;1;2;68678667
256;32;2;64;32;2;18446744073709551615
256;16;16;4;8;1;12766222
32;1;32;32;1;2;12492741
16;16;32;1;4;2;32640889
128;16;16;8;8;2;6602963
32;16;32;2;8;2;16286518
32;32;32;32;2;2;2937926
256;16;16;16;8;4;18446744073709551615
4;2;256;1;1;32;28761777
256;4;256;1;2;8;28888000
128;1;64;2;1;2;14568000
128;16;16;16;8;4;18446744073709551615
32;16;32;32;1;2;2393481
32;32;2;32;2;2;6624592
32;16;128;32;4;128;18446744073709551615
2;16;256;1;4;128;18446744073709551615
32;16;32;4;4;2;9437777
1;16;32;1;4;16;51460741
64;16;32;32;4;2;2889185
32;1;32;32;1;2;12533926
32;16;32;2;4;2;16078074
8;1;8;2;1;8;171758519
32;16;32;16;4;2;3613333
32;16;32;32;16;2;18446744073709551615
1;16;32;1;4;2;19085926
32;128;4;1;128;2;42685185
32;16;32;8;2;2;5994370
32;2;32;32;2;2;6366963
256;16;256;32;4;128;18446744073709551615
32;1;32;2;1;2;16131407
32;1;32;32;1;2;22796740
32;8;32;1;8;2;41114370
32;8;1;32;8;1;52491852
32;1;256;32;1;128;18446744073709551615
32;128;32;2;128;2;18446744073709551615
32;16;32;16;1;2;3983408
32;16;256;32;8;128;18446744073709551615
32;1;32;32;1;1;12342815
32;256;32;2;128;2;18446744073709551615
32;16;64;4;2;1;12479704
32;16;1;32;4;1;25837185
32;64;16;32;1;4;3091556
16;16;32;1;8;2;28767852
128;16;16;32;4;4;18446744073709551615
32;128;32;32;8;2;18446744073709551615
1;1;32;1;1;2;264146963
32;128;32;32;1;2;3403408
32;256;32;32;64;2;18446744073709551615
16;16;16;16;8;4;18446744073709551615
32;64;128;32;1;128;18446744073709551615
32;16;32;32;2;1;2179704
256;16;32;32;16;2;18446744073709551615
1;8;64;1;8;4;24814963
1;1;256;1;1;2;41895259
8;32;2;8;1;1;20301777
32;8;32;16;8;8;18446744073709551615
1;16;32;1;2;2;21233333
4;16;32;4;4;2;5443408
1;4;32;1;2;2;66720740
128;16;64;8;4;16;18446744073709551615
4;16;4;2;4;1;36778518
1;16;16;1;4;4;37325926
1;256;64;1;4;4;30544000
256;256;128;1;64;128;18446744073709551615
64;16;32;4;4;2;9739703
32;16;32;8;4;2;4738963
16;32;32;1;2;2;34777481
1;256;32;1;128;2;100945185
32;16;32;2;8;2;16370962
32;16;32;32;2;32;18446744073709551615
4;4;1;2;1;1;567081926
256;16;8;8;2;4;5663704
1;4;8;1;2;1;266528296
1;1;4;1;1;4;2094488149
32;2;32;32;1;2;6413926
2;16;32;2;4;4;11543704
1;16;16;1;2;4;34852148
1;1;16;1;1;1;523976296
32;8;8;8;4;2;7009630
32;256;32;4;2;4;9747703
2;1;256;1;1;1;45150667
32;16;32;32;1;4;2349334
32;16;16;32;4;4;18446744073709551615
32;16;1;8;2;1;25677334
1;8;32;1;8;2;39789629
128;1;8;128;1;2;13792592
4;256;2;2;1;2;15136296
32;4;256;4;4;1;10139111
8;1;4;1;1;1;299453334
32;16;64;32;4;1;2953630
32;64;32;32;2;8;18446744073709551615
32;16;4;32;4;2;6668148
32;4;32;32;2;2;3417334
32;1;32;32;1;2;12522814
4;32;1;2;2;1;72655111
16;8;4;16;2;1;23437185
32;4;128;4;1;1;10734519
128;8;64;2;4;1;22140889
32;256;32;1;128;2;50295556
4;64;1;2;4;1;37145630
32;256;64;8;32;2;18446744073709551615
8;32;128;4;32;128;18446744073709551615
128;2;256;64;1;1;3214074
1;4;256;1;2;8;13676888
128;1;64;2;1;1;21097481
1;8;256;1;2;256;18446744073709551615
1;1;256;1;1;1;52026667
16;128;32;1;128;2;50263259
256;32;64;4;1;1;11002371
32;8;32;1;8;8;27801037
4;2;1;2;2;1;1135631407
1;64;16;1;1;16;20163852
1;256;64;1;1;1;41430666
64;256;16;4;1;4;13988148
256;16;32;16;4;2;4286815
1;128;32;1;128;2;75797629
32;32;32;32;1;2;3021185
32;16;128;32;4;1;2902074
32;16;32;32;2;4;1738074
32;32;32;32;4;2;2645037
32;32;64;32;2;1;3034370
32;16;32;16;8;2;3230371
64;16;32;16;2;2;3461481
32;16;32;16;4;1;3439556
32;16;32;32;16;1;18446744073709551615
128;2;1;1;1;1;61925481
256;2;8;8;1;4;4029778
1;128;8;1;2;1;29026519
1;1;16;1;1;4;531582518
32;16;32;32;16;2;18446744073709551615
32;16;1;1;4;1;23270370
16;16;32;1;8;1;37800445
32;16;8;16;16;8;18446744073709551615
16;16;32;2;4;2;13815260
32;16;128;32;16;128;18446744073709551615
32;32;16;32;2;4;1729926
32;4;32;32;4;2;3362518
16;16;32;16;4;2;1951851
256;32;128;4;2;128;18446744073709551615
32;1;8;8;1;1;48833037
32;256;256;4;4;256;18446744073709551615
2;1;8;1;1;1;544011556
32;16;32;2;8;1;18070074
16;8;64;1;4;1;36798222
16;16;64;1;4;2;30548740
4;1;8;1;1;2;286149334
64;32;32;32;2;2;3213778
4;256;2;2;2;2;10112000
32;16;128;32;8;128;18446744073709551615
16;8;32;1;8;8;21499408
16;8;32;16;8;2;3496740
16;16;32;1;2;2;35692148
32;1;1;4;1;1;352663408
16;32;4;8;16;1;6811111
4;32;1;2;2;1;72578667
16;8;2;8;1;2;47786519
16;16;16;1;4;2;30593778
32;32;32;32;2;4;2604297
32;16;64;1;4;1;43582370
32;16;16;1;4;4;29751704
64;16;32;8;4;2;5241926
32;16;64;16;4;1;3863111
32;16;32;16;4;4;2904148
1;4;1;1;1;1;2112606222
128;8;32;2;4;1;22661037
64;128;1;1;16;1;49540889
2;256;64;2;32;4;25763704
16;8;32;2;8;2;9720741
8;32;2;4;32;1;28323408
128;2;256;2;1;64;32001481
16;1;256;1;1;8;53850519
1;1;1;1;1;1;8331377629
32;2;32;32;1;2;6461629
32;16;16;16;4;4;1946519
64;16;32;2;4;2;17185481
1;8;256;1;1;4;24712148
1;1;256;1;1;2;41073333
8;32;8;1;4;1;27889334
32;1;1;1;1;1;346196000
32;16;16;32;2;4;1964889
64;16;32;16;4;2;4211408
8;16;8;2;4;8;17748444
8;16;32;1;4;2;21394074
4;16;128;1;4;1;18161333
1;64;16;1;2;2;15467704
4;256;256;1;4;1;17072592
64;256;16;4;1;1;14745334
32;64;128;32;2;128;18446744073709551615
32;32;256;32;2;64;18446744073709551615
16;16;64;1;4;4;29923111
128;256;1;16;64;1;18446744073709551615
256;1;8;8;1;4;7781926
1;128;4;1;2;1;28281778
1;1;16;1;1;1;528356741
64;16;32;16;4;1;3636889
1;32;16;1;2;2;20794518
128;8;8;2;4;2;16393037
32;256;16;4;128;8;18446744073709551615
256;8;1;16;2;1;7960888
32;16;64;32;4;32;18446744073709551615
16;8;32;1;8;1;34554814
32;16;32;32;2;4;1742371
128;16;128;32;4;128;18446744073709551615
1;32;8;1;8;2;40111111
4;256;2;2;16;2;9190666
32;4;256;4;4;128;18446744073709551615
16;32;4;8;2;1;6189482
32;16;8;32;8;2;18446744073709551615
32;16;8;32;4;1;3564741
1;64;256;1;1;128;143384889
4;32;1;2;4;1;74074074
256;8;4;16;2;1;3000444
128;4;128;1;1;2;27967259
128;8;64;2;4;1;22000148
64;16;32;64;4;2;18446744073709551615
4;1;1;2;1;1;2265667556
1;256;64;1;4;16;100741778
1;32;2;1;8;2;161606519
128;1;256;64;1;64;18446744073709551615
32;8;32;2;8;2;15469185
128;16;32;8;4;2;5348592
4;16;32;4;1;2;6748592
8;16;32;1;4;2;21754518
1;256;256;1;2;8;40850075
16;8;1;16;4;1;98038222
1;8;2;1;8;2;646749778
1;1;16;1;1;2;527917334
32;8;32;32;1;2;2142074
32;32;32;32;32;32;18446744073709551615
32;16;8;8;1;8;4515704
32;1;4;1;1;1;84629333
4;16;128;1;4;1;18067852
64;64;16;8;4;2;5858074
128;16;16;16;8;4;18446744073709551615
1;128;256;1;4;1;16031407
64;256;16;64;1;4;2647704
128;1;128;16;1;1;4623408
1;1;8;1;1;4;1055829037
1;128;4;1;2;1;28278222
128;1;1;2;1;1;106260889
32;8;32;32;8;32;18446744073709551615
32;8;32;16;8;2;1989185
32;32;32;1;2;2;38393629
1;4;16;1;2;16;215695704
32;8;1;8;4;1;50853037
1;1;32;1;1;4;266011111
256;2;8;16;2;8;4198222
128;1;2;4;1;2;54217037
4;1;2;2;1;2;1126202223
32;4;128;4;4;2;9130815
16;256;4;8;1;4;7236741
16;16;32;1;4;4;27907259
32;16;8;8;4;8;3526815
4;32;1;1;2;1;75648000
32;8;4;16;2;1;12672592
256;4;128;1;4;2;19047556
256;8;64;2;4;1;21814963
32;8;16;32;1;4;3597333
32;16;64;32;4;2;2645630
4;1;1;2;1;1;2257486963
8;256;8;8;32;2;18446744073709551615
8;32;2;4;32;1;27617482
128;2;256;1;1;1;41501185
32;16;64;32;16;32;18446744073709551615
16;4;16;1;2;8;13157629
128;1;128;2;1;1;20910815
1;8;1;1;8;1;1102400296
1;4;256;1;1;1;42928741
8;16;32;2;4;4;8158667
64;16;32;32;4;4;18446744073709551615
32;1;8;1;1;8;47446815
32;16;32;1;4;8;30042519
4;16;128;1;4;1;16600741
64;64;4;8;4;4;5369333
32;16;8;16;8;8;18446744073709551615
32;16;32;8;4;8;4486815
32;64;32;1;1;2;34093481
32;16;32;1;8;2;31880000
32;1;32;8;1;2;12406371
32;16;8;16;4;8;18446744073709551615
32;16;32;8;8;2;6634667
32;16;1;8;4;1;26015259
32;16;32;32;16;32;18446744073709551615
32;16;1;32;4;1;25924000
32;1;32;32;1;1;12893481
32;32;32;8;2;4;5362666
32;64;32;32;2;8;18446744073709551615
32;16;16;32;4;2;1904296
1;32;256;1;4;1;22278370
64;2;32;2;1;2;16706371
128;8;256;16;8;256;18446744073709551615
256;32;1;8;1;1;8130223
16;16;32;1;4;16;33716889
4;16;32;4;16;4;12146667
32;16;32;32;16;16;18446744073709551615
32;2;256;2;2;128;18446744073709551615
32;256;64;32;128;1;18446744073709551615
32;4;32;32;1;1;3305037
1;128;4;1;2;2;20548740
128;1;1;2;1;1;106067852
1;32;1;1;1;1;266545185
32;1;8;4;1;2;43824889
32;64;32;2;1;2;19455407
32;256;32;4;1;4;11361333
1;2;128;1;2;1;42551556
128;1;64;1;1;32;58240148
4;256;64;4;16;1;12040444
1;16;32;1;4;2;20042370
32;16;2;32;4;2;13104148
32;16;16;32;16;16;18446744073709551615
4;16;32;2;2;2;9750518
32;4;64;4;4;4;5070963
16;32;4;2;8;1;8267259
4;1;1;2;1;1;2255200000
256;8;4;1;2;1;53878222
32;16;32;8;4;8;4544444
32;4;128;1;1;2;27982666
256;8;1;2;1;1;32257482
4;32;1;2;1;1;76532593
2;64;256;2;8;1;18952148
32;16;64;32;4;8;18446744073709551615
32;4;32;8;2;2;3436148
4;16;32;4;2;2;5806963
1;32;2;1;32;1;230944889
128;1;256;64;1;32;18446744073709551615
16;4;16;4;2;8;12546222
128;1;128;1;1;1;41520000
128;16;32;32;4;1;3196297
1;8;1;1;8;1;1094859111
1;1;256;1;1;2;42512296
32;4;8;8;1;1;12209333
32;1;128;1;1;8;48916445
32;16;32;32;1;16;18446744073709551615
32;16;4;4;4;2;6017481
32;16;128;8;4;1;6249038
64;64;4;8;4;1;7381037
32;128;256;16;4;1;3276000
64;256;32;64;1;2;3419852
32;4;4;32;2;2;24370519
32;16;128;1;4;128;18446744073709551615
32;1;32;1;1;2;41198370
128;4;128;64;1;1;3271408
256;2;8;8;1;1;6921481
1;16;4;1;2;2;133975260
128;1;8;2;1;2;14720148
1;32;16;1;2;16;28313926
32;16;8;8;4;4;3687704
64;16;16;32;4;4;18446744073709551615
32;8;64;32;8;1;2540445
16;16;64;8;4;1;7273333
128;8;32;32;8;32;18446744073709551615
128;128;64;32;128;1;18446744073709551615
32;16;64;32;8;1;2687851
32;2;32;8;1;32;9607408
32;256;1;4;2;1;13170815
256;2;8;16;1;8;3916740
128;16;32;32;8;2;18446744073709551615
128;1;8;128;1;2;13830370
32;256;2;2;1;2;14159259
32;8;1;1;2;1;45106666
16;32;4;8;1;1;7361926
32;8;32;8;8;2;3936000
64;64;32;2;1;2;18975259
32;4;32;32;4;2;3368740
128;8;64;32;4;1;3225778
32;2;64;32;2;1;3464889
16;16;4;1;4;2;12058074
16;16;32;8;4;4;4319555
4;32;1;4;2;1;73201778
256;4;4;128;1;1;4106223
16;4;1;2;1;1;180943704
64;16;64;32;4;64;18446744073709551615
32;8;16;32;4;4;18446744073709551615
32;16;16;16;4;2;2040148
16;8;32;1;2;4;31694962
32;32;64;32;2;2;3094963
256;1;64;2;1;1;21570963
32;16;32;32;8;1;2100741
64;16;32;32;2;2;3141333
32;16;32;32;2;1;2157481
4;128;4;2;2;1;14686222
256;64;256;32;8;1;2431407
64;32;2;64;1;1;6550519
128;2;256;64;1;1;4779852
32;8;128;32;8;128;18446744073709551615
32;32;32;8;2;2;11824000
32;16;16;32;8;2;18446744073709551615
64;8;32;32;2;2;3962963
32;32;128;32;4;128;18446744073709551615
32;8;128;1;2;128;88846519
32;16;32;1;2;2;39360592
16;4;2;4;1;2;88082814
128;1;64;2;1;2;14468593
1;8;2;1;8;1;546693037
1;32;256;1;8;16;59677186
32;8;32;1;8;2;31357926
32;16;32;1;8;1;42271852
32;1;8;32;1;1;49802519
32;128;32;1;128;8;18446744073709551615
32;1;128;8;1;1;8695556
64;1;4;8;1;4;50334370
32;16;32;2;4;32;17118075
32;2;32;8;2;2;6426074
32;128;256;16;2;1;3396296
64;256;16;64;1;16;18446744073709551615
32;4;64;1;1;1;41658370
128;2;8;8;1;1;7728000
32;16;32;2;4;4;15246074
32;16;16;32;4;1;1941037
64;8;32;32;8;2;18446744073709551615
8;1;32;2;1;2;39466371
128;16;4;32;4;2;2020741
32;16;32;1;4;4;32636000
1;128;4;1;2;2;20535111
128;1;256;2;1;32;29221482
1;32;1;1;8;1;275904445
1;8;8;1;4;2;138542222
8;256;32;4;4;4;10023704
8;2;8;2;1;8;87149926
256;1;16;128;1;1;3912296
32;256;2;2;16;2;17701037
16;16;32;1;2;4;33685926
32;4;64;4;4;64;18446744073709551615
1;32;4;1;32;1;113353037
4;32;64;2;2;4;11072444
256;8;4;4;2;1;13983704
32;8;16;16;8;2;3610370
32;16;32;2;16;1;21254815
32;16;1;32;4;1;26018519
4;256;128;4;128;128;18446744073709551615
128;4;1;64;1;1;27813778
256;1;64;2;1;1;21105037
4;32;4;1;8;1;19836444
8;64;1;2;4;1;22364297
32;16;128;16;4;128;18446744073709551615
32;16;64;32;4;4;18446744073709551615
32;16;32;4;4;1;11111704
64;32;2;64;1;1;3530222
1;128;256;1;1;1;41399852
2;4;16;2;2;8;94788444
128;256;64;2;1;4;9982667
32;32;16;32;1;2;2201481
