GLOBAL_SIZE_0;GLOBAL_SIZE_1;LOCAL_SIZE_0;LOCAL_SIZE_1;TILE_0;TILE_1;cost
4096;8;4;4;1;4;10281482
4096;1;1;1;4;64;40008297
256;4;1;1;2;16;29793037
1024;128;2;32;8;32;3295259
1024;128;2;32;8;128;7197926
1024;64;8;32;8;32;3232889
2048;512;2;32;8;32;11108741
1024;128;64;1;64;32;127346666
1;1024;1;16;32;128;20293185
4;1024;2;1;2;32;22980148
2048;4;2;1;2048;32;480198815
32;32;2;32;256;1;458472296
1024;1;8;1;1;32;40650074
1024;64;8;32;8;2;46213037
4;1;1;1;8;32;1249263111
1;1;1;1;8;32;4910204741
4;4096;1;64;4096;1;115512889
256;64;8;8;16;128;3108148
256;256;8;32;8;32;4964296
256;64;8;32;8;32;3048593
128;64;4;32;8;32;2665926
256;16;8;8;8;32;3951111
256;64;8;16;8;32;3031260
128;32;8;32;8;64;5290667
1024;64;4;32;8;32;3286963
64;32;2;32;8;32;6069926
256;64;2;16;8;32;3353778
256;64;4;64;8;64;2677333
128;16;16;8;4;32;30504148
64;64;2;16;8;8;6208297
256;64;4;32;8;64;2874667
1;1;1;1;1;1;3566867111
2;64;1;16;512;2;654844444
1024;8;128;2;2048;256;29314667
1;1;1;1;8;4;5218609334
512;32;4;16;512;16;20839556
256;8;8;8;8;32;6283259
512;64;4;32;8;64;3313778
128;64;32;4;8;32;21184000
256;2048;1;32;1;512;3747851
128;64;4;32;1;32;5799111
128;64;64;4;8;64;67407111
128;64;4;4;8;32;4687704
1;1;1;1;1;1;3568065482
512;16;4;1;4;32;41092149
128;64;4;32;16;16;5158518
16;1024;8;1;256;8;11568889
64;1024;1;128;4096;4;7508312593
64;64;4;4;4096;1;506032889
1;1;1;1;32;256;4894932889
1;16;1;1;1024;32;308722667
128;1;4;1;8;32;52688592
1;64;1;32;2;32;190766074
128;64;4;32;32;32;3730666
16;512;4;1;8;32;12731407
128;16;4;1;32;32;12982815
256;64;2;32;2;32;1632148
256;64;4;32;8;16;5604297
64;64;2;32;2;4;21484148
256;64;1;32;2;32;2130815
512;64;2;64;2;32;3268741
256;256;2;32;8;32;3814814
256;64;2;16;2;32;2531851
256;64;2;1;2;128;22746518
512;64;2;32;2;32;2082666
256;64;2;64;2;64;1545630
512;64;2;64;1;64;1810815
256;64;2;64;4;64;1638370
256;128;2;64;2;64;2029185
512;16;2;2;8;64;15146963
128;64;2;32;2;64;2047555
128;64;2;16;2;64;2246667
256;64;1;64;2;64;1342074
1024;64;1;64;4;64;3977334
256;256;1;64;2;64;3089333
256;128;1;64;2;256;1871851
256;128;1;64;2;64;1707852
256;64;1;64;2;16;4118815
256;64;1;1;2;128;27210370
256;64;1;64;2;256;1752445
1024;64;2;64;2;64;1884889
256;64;1;64;1;64;1465778
256;64;1;64;4;16;13606963
256;64;1;1;2;64;69524000
256;4;1;4;2;32;11182074
2048;256;1;64;2;64;4739852
256;64;1;64;4;64;2019259
512;64;1;64;1;64;1972148
256;64;1;64;2;128;1524593
256;128;4;32;2;64;5248296
128;64;1;1;2;64;27532000
256;64;2;64;1;32;3352889
256;64;8;1;4;16;45831259
1024;64;1;64;4;32;8805926
256;64;1;64;4;32;6272296
256;64;1;64;8;64;4073630
128;64;1;64;4;16;5974222
256;16;2;2;2;128;11694667
64;64;1;64;2;128;3236296
256;64;4;64;4;64;2477037
256;128;1;32;4;64;4154222
256;256;1;64;4;64;3766519
256;64;1;2;2;64;21186371
256;64;1;64;2;32;2305333
256;64;1;64;16;32;15542518
512;64;1;64;2;64;2445926
256;64;1;64;1;32;1970371
64;64;1;64;2;64;2841926
256;16;1;2;2;64;20353629
256;256;1;128;2;64;3204148
512;64;1;1;2;128;55706963
2048;64;1;64;8;128;9624000
256;8;1;4;8;32;12649185
256;32;1;1;2;256;24651111
256;64;1;32;2;64;2045778
512;128;1;64;2;64;2513333
256;512;1;64;4;64;9380444
256;32;1;1;4;64;41790962
128;128;1;64;4;64;1268740
64;32;1;1;4;64;24290074
128;128;1;64;16;64;4329778
128;128;1;32;4;64;1827259
512;128;1;128;4;128;2678370
128;128;1;32;8;64;3473925
256;64;1;2;1;64;19798963
512;32;1;1;16;64;67835556
128;512;2;64;4;128;2613037
128;32;1;1;4;64;26351556
128;128;2;64;2;64;1591259
512;128;1;64;4;512;2859260
128;128;1;64;2;64;1210518
128;128;1;1;4;64;28489629
128;256;1;64;2;64;1498963
32;128;1;128;2;64;5325037
128;128;1;64;8;64;3187852
128;256;2;32;2;256;1697333
128;128;1;64;2;256;1361185
128;128;1;64;4;128;1368889
128;128;2;32;2;128;1647111
256;128;2;64;1;64;1654963
256;128;1;2;2;64;31869037
64;128;1;64;2;64;1715407
128;128;1;64;1;64;1135111
128;256;1;64;2;256;1638222
128;128;2;64;2;256;1623852
64;64;2;64;1;128;6160593
128;128;1;128;1;256;1184593
128;1024;1;64;1;64;3815111
512;128;1;128;2;64;3487555
128;128;2;16;1;128;2719704
128;256;1;64;4;64;1801926
256;128;1;1;1;64;65706518
128;64;1;64;1;256;1795407
128;32;1;1;1;64;26183111
512;32;1;32;1;64;1912148
128;128;1;32;1;64;1502370
128;128;1;64;1;512;1141334
1024;128;1;64;2;128;3241037
128;128;1;128;2;64;2098074
256;128;2;64;1;32;3334666
32;128;2;128;2;256;3436445
64;128;1;64;1;16;5911704
128;64;1;64;4;64;1813038
512;128;1;64;8;64;5049038
128;128;4;2;1;64;19702519
32;64;1;32;1;64;6025482
128;512;1;64;1;64;3400000
128;128;1;64;1;32;2104000
128;256;1;64;1;64;1438074
128;128;1;64;1;256;1115556
256;128;1;128;1;64;3154814
256;128;2;1;1;32;69012445
512;128;1;64;1;64;2332592
1024;128;1;64;1;256;3076444
64;256;2;64;1;256;1754667
128;128;1;64;1;1024;1084000
128;128;1;64;1;2048;1065926
128;256;2;64;1;1024;1691111
64;128;1;64;1;1024;1622074
1024;32;4;32;1;1024;2726223
128;256;1;64;1;2048;1049037
256;64;1;64;2;2048;1579703
32;128;1;64;1;1024;2791260
32;128;1;64;1;2048;2686815
128;256;1;64;2;1024;1521629
256;64;1;64;4;1024;2098222
128;256;1;32;1;2048;1698519
16;256;2;64;1;1;183508889
128;256;1;64;1;4096;5717037
128;256;4;64;1;2048;2910666
128;256;1;256;1;4096;1266074
64;256;1;64;1;2048;1561186
256;256;1;64;1;2048;1484740
128;128;1;64;2;2048;1221926
64;256;1;64;1;4096;2989185
128;256;1;128;1;2048;1481037
128;256;1;64;16;2048;1682222
32;64;1;64;1;1024;5701037
512;256;1;64;1;2048;1877630
64;256;1;32;1;2048;2720296
128;64;4;64;1;1024;5642074
128;256;1;64;1;1;25605926
128;256;1;8;2;2048;5848593
128;64;2;64;1;2048;2974667
256;256;2;64;1;2048;1924148
128;256;1;16;1;2048;3043111
64;2048;2;64;1;2048;2857629
128;1024;1;32;2;2048;1833629
128;256;2;64;1;256;1642519
128;512;2;64;2;2048;1606666
64;1024;1;64;1;2048;1551852
256;256;1;64;2;2048;1647259
64;128;1;1;1;2048;37285037
128;256;1;128;1;4096;3472741
128;256;1;64;2;2048;1204741
128;256;1;64;2;4096;5808000
64;256;2;64;1;1;48215851
128;256;4;32;1;2048;4990222
128;128;1;32;1;2048;1801037
128;256;2;64;1;4096;7081186
128;512;1;64;2;2048;1253185
2048;256;1;64;1;4096;5961925
128;512;1;64;1;2048;1025481
128;128;1;64;2;1024;1363852
64;512;1;64;1;2048;1521778
128;128;1;16;1;2048;3143408
128;512;1;32;1;2048;1808889
128;512;1;64;2;1024;1518815
128;512;1;64;1;4096;11617037
128;2048;1;64;1;2048;1130519
256;512;1;256;1;1024;1700296
128;512;1;64;1;256;1890815
128;1024;1;16;1;1;44878370
128;2048;1;32;1;2048;1806519
64;512;1;32;1;1024;1686963
128;512;1;32;1;4096;26425630
32;1024;1;64;1;2048;2675259
128;512;1;16;1;1024;2792297
128;2048;1;64;1;1;45438963
128;512;2;128;1;2048;1567704
128;512;1;64;4;2048;1318815
128;512;1;128;1;512;1869333
128;512;1;64;8;2048;1720889
128;2048;2;64;1;2048;1834371
64;512;8;4;2;2048;70473334
1024;512;2;64;1;2048;2458370
512;1024;1;128;1;2048;2075852
8;512;1;64;1;2048;9848741
128;512;2;64;4;2048;1667704
64;512;1;64;1;256;1074963
128;64;1;64;1;1024;1780444
128;512;1;64;1;1;37302666
128;128;1;64;4;2048;1319407
128;512;2;128;2;4096;6450074
128;1;1;1;1;1024;42981334
256;512;1;64;1;1;35818370
512;512;2;128;1;4096;7609926
128;512;1;128;2;1;57916444
32;128;1;64;2;2048;2803259
128;512;2;64;1;2048;1603555
128;512;1;64;1;512;1889778
128;512;1;128;1;1024;1874074
32;512;2;64;1;2048;4993629
128;256;1;64;1;1024;1417037
128;1024;1;64;1;2048;1164889
64;512;1;16;1;2048;5008592
128;512;2;64;1;512;1890667
128;1024;1;64;1;4096;23591851
128;1024;2;64;1;2048;1638518
128;256;1;128;1;256;1348889
128;512;1;64;2;4096;11906519
512;512;1;32;1;2048;2200296
128;512;1;32;1;1;45796592
64;2048;1;64;1;2048;1653778
32;1024;1;32;1;4096;43509926
128;1024;1;64;1;1024;1349629
128;2048;1;64;4;2048;1324148
128;512;1;64;1;1024;1369334
128;256;2;64;4;2048;1629926
512;1024;1;64;1;256;9281926
128;512;8;1;2;2048;111798518
128;512;1;128;2;2048;1667259
128;512;1;256;1;4096;3290815
128;512;4;32;1;2048;4946518
512;256;2;64;8;2048;2286667
128;128;2;64;1;2048;1614667
1024;512;1;128;1;2048;2026370
64;512;1;64;1;512;1320148
128;256;1;128;2;2048;1704148
32;256;1;128;1;2048;1505630
128;512;1;128;2;1024;2039111
512;512;1;128;2;2048;2204444
8;1;4;1;1;128;2462755407
512;512;1;16;1;2048;3434518
32;512;1;64;1;2048;2616148
64;4096;1;64;4;2048;1786075
128;4096;2;64;1;2048;1906963
256;128;4;32;128;32;5620593
32;256;4;4;8;512;8824297
1024;1024;32;8;4;1024;51721926
256;16;1;8;32;128;8262815
512;512;1;64;8;1024;2905482
128;512;1;128;1;2048;1541185
64;512;1;64;2;2048;1716000
128;1024;1;32;1;2048;1797778
256;512;1;64;8;2048;1900149
128;4;1;1;1;2048;23120889
128;512;1;64;512;2048;10536444
128;512;2;64;1;1;68057778
128;4096;1;64;1;2048;1156445
128;512;1;2;2048;2048;1019363111
128;256;1;64;1;4;13550666
128;2;1;1;1;2048;22888593
128;512;1;64;128;2048;3087407
128;512;1;64;1;2048;987704
128;4;8;1;1;2048;160090222
128;512;32;4;1;2;45500445
128;512;1;64;1;2;34514370
128;64;1;64;1;2048;1753185
128;512;1;64;1024;2048;21036888
128;512;1;64;1;16;7342963
1024;512;1;64;1;64;9006074
128;512;1;64;1;8;11858074
128;32;1;1;1;2048;23116000
8;512;1;64;1;2048;9844000
128;512;128;2;1;2048;2074343407
256;512;1;64;1;2048;1533629
128;8;32;4;1;2048;237122667
64;512;1;64;1;2048;1564000
128;512;128;1;1;4096;17735938815
1024;512;1;64;1;2048;1977482
128;256;1;256;512;2048;5800593
2;512;1;64;1;2048;42937037
128;4096;1;256;1;2;155066074
1;16;1;4;4;2;1147661037
128;256;1;64;2048;2048;41492741
128;512;1;128;1;2048;1535703
128;512;2;64;1;2048;1608741
128;2048;1;64;1;2048;1137926
32;512;1;64;4096;1024;40377333
64;2048;4;64;1;2048;5402370
64;256;2;64;1;2048;2638814
128;256;1;256;1;1024;1164296
64;512;1;64;1;4096;10352148
128;512;1;64;1;512;1898667
128;512;1;16;1;2048;2962222
128;2048;1;64;1;1024;1353481
64;512;1;64;1;512;1324592
128;512;1;32;1;1024;1610223
128;512;2;128;4096;2048;91660148
16;512;16;1;32;64;9866222
128;512;1;64;1;4096;11444445
128;1024;1;64;1;4096;23545926
128;512;2;64;2048;2048;23648889
64;512;1;64;4096;512;66321926
128;1024;1;64;4096;2048;85167852
64;512;1;64;1024;2048;20702814
128;512;2;64;1;1024;1648148
128;512;1;4;1;64;13098815
128;512;4;16;1;2048;9512741
128;2048;1;8;1;2048;5768148
1;64;1;2;64;32;110847556
32;1024;1;64;1;1024;1469333
32;512;1;64;1;2048;2636593
32;8;16;8;8;64;110030074
64;32;1;1;2;1;37921481
2;512;2;4;1;1;72444148
256;4;16;1;1;1;92689037
32;1024;1;64;1;2048;2642518
128;512;1;64;2048;2048;41985629
128;512;1;64;2048;4096;112812000
128;512;1;32;1;2048;1762223
128;128;1;64;1;2048;1049037
64;512;1;1;2048;2048;1220349185
64;512;4;64;16;32;5308741
128;512;4;64;1;1024;2683704
128;512;4;64;4096;2048;77595704
128;256;4;64;1;2048;2863259
128;512;1;64;1;1024;1457778
128;512;1;64;4096;2048;85235407
1024;512;1;64;1;2048;1904593
64;256;1;32;1;2048;2736444
128;512;1;2;1;2048;21623259
512;128;1;64;1;2048;1892592
128;512;2;64;1;2048;1617629
128;4;1;1;1;2048;26288000
128;256;1;64;1;4096;5673778
256;512;1;128;1024;512;5711852
128;2048;1;64;4096;2048;85564148
128;128;2;64;1;1024;1700592
16;512;1;64;1;2048;5062371
512;512;1;64;1;256;5036297
8;1024;1;64;1;2048;9884740
128;4096;128;1;128;64;18329038
4096;4;1;4;4;32;13222814
1;16;1;8;1;512;492829926
512;1;32;1;256;8;33504000
128;512;1;64;1;256;1938370
128;1024;1;64;2048;2048;42010667
64;512;8;1;64;16;14722815
128;256;1;32;1;2048;1848000
128;1024;1;64;1;2048;1086222
128;512;2;64;4096;2048;95246222
4096;512;1;64;4096;2048;7312065037
512;512;2;32;4;128;6638667
256;256;4;64;16;32;5589482
512;128;4;32;32;32;4670963
256;2;4;1;2048;1;696475111
32;4;8;1;1;1;365171111
64;4096;64;1;1024;1;18446744073709551615
1;4;1;1;512;128;1176296296
256;1024;256;1;128;1024;114714815
128;256;8;32;16;64;3666963
2048;32;4;16;4;16;3243260
128;512;4;64;64;16;12682074
128;512;1;32;4096;2048;163065630
64;512;1;64;1;1;22402667
128;2048;4;32;1;2048;5188444
64;512;1;32;1;2048;2722223
128;512;1;128;1;512;1785630
64;512;1;128;1;2048;986963
64;4096;1;128;4096;2048;42863111
64;512;1;256;1;2048;1189333
64;512;1;128;1;1;41619704
64;128;1;128;1;2048;1709778
1;64;1;8;1;128;127503703
64;512;1;128;4096;2048;42690371
128;1024;1;128;4096;2048;164978815
32;256;1;64;1;2048;2629778
64;4096;1;64;4096;4096;5718841481
64;2048;1;128;1;2048;1012741
256;512;4;64;32;32;8360149
1024;4096;32;2;1024;2048;38683111
4;128;4;4;64;256;31385185
1;512;1;64;64;8;164580889
64;512;2;128;1;4096;7189629
64;512;1;128;2048;2048;21331111
64;512;1;128;1;512;1231852
2048;64;4;8;4;32;9001629
64;512;1;128;1;4096;6159111
256;128;1;128;1;2048;1609482
16;512;1;128;1;2048;2613630
256;512;1;128;1;2048;1884889
64;512;2;1;1;2048;74906519
512;512;4;64;32;32;8339703
16;512;1;256;1;2048;1483703
64;512;1;128;1;256;1153037
64;64;1;2;1;2048;30356889
64;1024;1;128;1;2048;988000
64;512;1;128;256;2048;3037482
32;512;1;8;1;2048;16551555
512;64;4;8;4;32;4889334
256;16;2;16;128;2;369071111
32;64;32;8;1;512;139234370
2;1;1;1;2;2;2909291259
64;512;2;128;1;2048;1621630
32;1024;1;128;1;2048;1524740
32;128;1;128;4096;2048;91397778
512;128;4;16;8;32;4433037
32;512;1;128;1;2048;1526222
64;1024;1;128;1024;2048;10584445
512;8;16;2;32;2;5289629
32;512;1;256;1;2048;989778
64;256;1;1;4096;2048;2409612592
512;32;8;32;16;8;11708740
64;128;4;4;16;512;4852444
512;512;1;64;16;256;6014518
4096;1;4;1;4;32;22702519
64;512;1;1;1;1024;22371111
64;512;1;128;8;2048;1463259
64;16;1;4;1;2048;15757334
8;2;1;2;1;2048;473773333
128;512;1;128;4096;2048;160872740
32;512;2;128;1;2048;2659259
128;512;1;256;1;1;91477185
64;1024;1;128;2048;2048;21409482
32;512;1;256;2048;2048;11457926
64;256;1;128;4096;2048;7074927929
64;512;8;4;1;2048;111110222
64;1024;1;128;2048;512;12009778
32;1024;1;256;1;2048;992593
64;512;1;256;4096;2048;79353333
256;2048;1;128;1;4096;29952889
256;512;1;128;4096;2048;439736445
2048;64;4;32;8;32;3219259
512;128;8;32;8;32;3616296
1024;64;4;16;8;32;3916148
1024;64;4;32;16;32;4280148
64;512;1;256;1;4096;3134963
64;256;1;128;1;2048;1017926
32;512;1;1;2048;1;104391259
64;512;1;128;1;1024;1357334
2;64;1;16;128;2;560247704
1024;8;128;1;2048;256;37687555
1;1;1;1;16;1024;4864508149
64;1024;16;4;64;64;4144592
4096;512;1;1;1;2048;26285629
64;512;1;2;1;4;73553630
64;1024;1;128;1;1024;1316444
1024;128;4;32;8;32;3237037
1024;128;4;32;4;64;4746667
32;512;1;128;1;4096;2877630
64;512;1;128;4096;512;99227703
32;512;1;128;1;1024;950963
16;512;1;128;1;1024;1465334
32;512;1;128;1;512;976296
32;64;1;64;4096;512;186350963
32;256;1;128;1;1024;1477778
32;128;1;128;4096;1024;89058815
32;256;1;128;4096;1024;42598963
32;512;1;256;1;1024;1003852
16;256;1;128;1;512;2854222
128;512;1;128;1;1024;1942963
32;512;1;64;1;512;927111
32;1024;1;128;1;1024;926074
256;512;1;64;1;1024;1899704
16;1024;4;1;1;1024;312169629
8;4096;2;128;1;1024;5037778
32;2048;1;256;1;2048;1092000
32;1024;2;1;1;512;38228000
16;2048;1;128;1;1024;1450370
32;4096;1;1;1;1024;43830815
128;1024;1;128;1;1024;1865629
32;512;1;32;1;2048;5022963
64;1024;1;128;1;512;1841334
32;4096;1;128;1;1024;1152000
64;1024;4;1;1;1024;76599556
64;1024;1;1;1;1024;22328297
32;1024;4;1;1;2048;311375111
16;1024;1;256;1;1024;997481
8;1024;1;128;1;2048;4995260
64;128;1;128;1;1024;1687555
32;1024;1;64;1;128;987704
16;1024;1;256;2048;512;6063852
32;1024;1;128;1024;2048;10682815
32;1024;1;128;512;1024;207736732
32;1024;1;128;1;1;43096593
32;1024;1;256;1;1024;1029037
32;1024;1;128;4096;1024;21836741
128;2048;1;128;1;1024;1842963
128;1024;1;32;1;1024;1580889
32;2048;1;128;1;1024;1068000
64;1024;1;128;1;256;1776148
256;1024;1;128;1;1024;2564297
16;1;1;1;1;2048;318906666
32;4096;1;64;4096;1024;40244296
128;1024;1;128;1;256;2974815
8;4096;1;128;1;1024;2666222
16;512;1;128;2048;1024;10710667
32;1024;1;128;1024;512;5617482
64;1024;2;128;2048;256;22772444
32;256;1;128;4096;2048;41498518
32;1024;1;64;2048;2048;41608593
256;1024;1;128;1;512;4130370
32;1024;1;256;4096;1024;30060296
16;1024;1;128;1;1024;1495408
64;2048;1;128;1;1024;1289333
64;2048;1;128;1;4096;28950074
64;1024;2;128;2048;1024;22955111
128;1024;4;1;4096;512;417282519
64;1024;2;128;1;2048;1689185
32;1024;1;32;1;1024;2625926
32;1024;1;128;1024;1024;5845926
64;4096;1;128;1;256;2798815
8;1024;1;64;1;1024;5021926
16;1024;1;128;4096;512;11207407
64;2048;1;32;1;1024;1744000
32;512;1;128;4096;1024;21587852
16;1024;1;128;4096;1024;20857926
32;2048;1;64;1;512;1047703
32;1024;2;64;1;1024;2546370
32;64;1;1;1;256;21094370
8;1024;1;128;1;1024;2679408
32;1024;1;256;2048;1024;11101778
4;1024;1;128;1;256;3261481
64;1024;1;64;1;1024;1013037
32;1024;4;2;1;512;58446815
16;2048;1;128;1;2048;2557630
64;1024;2;128;1;1024;1495111
256;1024;4;1;1;1024;25514963
32;1024;1;64;1;512;937925
32;2048;2;128;1;1024;1751852
16;2048;1;128;4096;1024;20844741
32;4096;4;1;2048;1024;213838371
32;512;1;64;1;1024;1466519
64;1024;1;256;1;256;1847704
32;1024;1;128;2048;512;11961630
16;1024;1;128;1;2048;2602223
4;1024;1;128;2048;2048;20999852
32;1024;1;128;1;512;1214963
32;1;1;1;1;512;163991704
32;1024;2;128;1;1024;1636741
32;2048;1;128;1;1;81100444
32;1024;1;128;4096;2048;41408889
16;1024;4;1;4096;1024;409904740
32;1024;1;128;1;256;1203407
32;1024;1;1;1;1024;42815556
16;1024;1;128;1;512;973185
32;256;1;128;4096;512;43716296
32;128;1;128;1;256;3123111
32;2048;1;128;1;512;1215555
32;256;1;256;1;1024;1676148
32;512;1;128;1;256;1047555
32;256;2;128;1;1024;2854815
32;1024;2;128;1;512;1438963
32;2048;1;128;2048;1024;11501629
32;1024;1;1;1;2048;74672593
4;512;1;128;1;1024;5209482
32;1024;1;256;1;4096;6494963
64;1024;1;1;1;1;285128741
32;1024;2;128;4096;1024;22953037
32;1024;1;128;4096;512;35421037
32;1024;4;1;4096;4096;100742113778
16;1;1;1;1;1024;327304444
8;1024;1;128;1;1;114061777
32;1024;2;64;1;512;1616445
32;1024;1;128;2048;2048;21342815
32;256;1;128;1;2048;1478519
256;2048;2;128;1;1024;2282222
32;1024;4;64;1;1024;4915556
32;1024;1;128;1024;4096;48095852
4;1024;1;128;4096;1024;20574518
32;4096;1;128;1;4096;55600889
32;1024;4;1;1;1024;155756148
32;256;1;64;1;1024;1478222
8;1024;2;64;1;1024;9728593
128;1024;2;128;2048;1024;22957778
256;512;1;256;1;256;2657037
32;1024;4;64;1;64;2650074
32;1024;1;128;4096;4096;383973185
32;1024;1;128;4096;256;37115852
32;1024;1;32;4096;1024;77955556
32;1024;1;128;2048;1024;11479555
32;1024;2;128;1;128;1456592
32;1024;1;128;1;4096;11736000
16;256;2;128;1;512;5655852
16;1024;1;1;1;1024;76648740
16;1024;1;32;1;1024;4816445
32;4096;1;128;1;512;1333333
4;1024;1;128;1;1024;5303259
32;256;1;128;1;512;1609186
32;2048;1;128;4096;1024;21903556
128;2048;1;128;1;4096;30111555
256;2048;1;128;1;1024;2639111
64;2048;1;1;1;512;21353926
32;2048;1;128;1;2048;1716593
32;1024;1;1;1;512;25600741
64;2048;1;128;4096;1024;78110371
32;1024;1;64;4096;1024;40489926
32;1024;2;1;1;1024;76685926
128;1024;1;128;4096;1024;224994963
32;2048;1;32;1;1024;2794815
32;128;1;128;4096;512;93976592
32;1024;1;16;1;1024;5141186
16;1024;1;64;1;2048;5035407
8;1024;1;128;1;512;1610815
8;512;1;128;2048;4096;42288444
8;1024;1;256;1;512;1780000
32;1024;1;128;1;1;41491259
32;1024;1;1;1;1024;43294074
1;1024;1;128;1;128;12053630
32;4096;2;128;1;1024;1989334
64;1;2;1;1;1024;160902963
8;1024;1;256;1;1024;1552445
32;2048;1;256;1;1024;1123111
32;1024;1;2;16;1024;32080148
128;1;64;1;1;1024;2450668000
32;1;1;1;1;4;172832593
64;4096;1;128;1;1024;1378222
32;1024;1;64;1;4096;17795111
16;256;1;128;1;2048;2639556
32;1024;2;128;1;4096;13948741
8;1024;2;2;4096;1024;473917333
64;64;4;2;4096;1024;240934518
1;512;1;32;32;256;20021778
2048;1;4;1;8;512;26853926
1024;1024;32;2;1024;1024;39067112
32;1024;1;128;2048;128;11742814
32;1024;1;128;1;128;1126519
32;1024;4;1;1;1024;155694815
32;1024;8;2;1;8;19673334
32;1024;1;256;2048;128;21775407
128;128;1;128;1;1024;1101926
32;1024;2;64;4096;1024;23666074
32;1024;2;64;1;2048;4886222
64;1024;1;128;4096;4096;834232889
8;1024;2;128;1;512;2940741
1024;16;4;1;32;8;26204741
64;512;1;64;1;1024;1003407
32;1024;1;64;1;256;1077777
256;4096;2;128;1;2048;1648296
1024;128;4;32;8;64;49249884
2048;128;4;32;8;32;3189481
1024;128;8;32;8;32;3764889
2048;64;4;32;16;32;4551408
2048;128;4;32;8;64;5760741
256;16;256;1;32;128;149910815
32;8;16;2;1;64;436016148
1024;32;128;1;2;1;1653969629
2;512;1;4;1;128;30861185
2048;16;4;1;8;8;27508296
256;1;256;1;1;1;3620104000
128;4096;4;16;128;64;4192444
4096;64;1;4;4;32;23186371
32;1024;4;1;2048;512;122954963
32;256;1;32;1;1024;2691111
32;1024;2;128;1;2048;2640889
32;1024;1;128;4096;1;5275955852
32;256;2;128;1;512;2944296
2048;1;32;1;8;8;66182074
256;2;4;1;1;1;40777926
16;4;8;1;1;1;696453037
64;8;64;1;1024;1;105205482
64;1024;1;64;1;512;1323852
32;512;1;32;4096;1024;77572000
8;1024;2;128;1;1024;5136148
32;1024;1;128;16;1024;1363408
1;1024;1;128;1;1024;20738371
32;1024;1;256;1;2;86703555
512;4;4;1;128;128;18978074
256;1024;4;32;512;64;4730223
1024;4096;32;2;1;64;19868741
4;128;4;4;512;256;30753778
64;4096;4;1;4096;1024;463185482
32;128;1;64;2048;1024;41703407
32;512;4;1;1;512;76900741
32;2048;1;128;1;256;1834074
32;1024;1;128;64;1024;1367407
16;512;1;1;64;64;23505185
32;128;1;128;1;1024;3001037
256;16;2;4;128;2;65323407
4096;16;1;4;1;1024;10047556
32;1024;1;128;1;32;5553185
32;1024;2;128;1024;1024;5880148
32;1024;1;128;4096;64;267839111
32;2048;1;128;256;1024;1937778
32;16;32;8;1;1;2421074667
2;64;1;2;2;2;89611852
64;128;4;4;16;512;4895556
16;128;4;1;16;256;29749481
4;4096;1;128;2048;4096;43931407
32;4096;2;128;1;4096;67334371
64;1024;1;256;2048;1024;11259111
32;1024;1;128;1;64;2676889
1;32;1;2;1;1024;873653185
64;1;4;1;4;32;103510963
1024;64;16;16;128;4096;19055852
1024;8;128;2;2048;2;85072888
1;1;1;1;16;1024;4865607259
128;1024;4;1;1;1024;43216889
32;1024;1;2;1;1024;30613185
32;1;1;1;1;4096;118300741
16;2048;1;128;2048;4096;103066518
32;1024;1;256;4096;256;79406963
16;4096;1;128;1;1024;1717333
128;1024;1;256;1;1024;2194074
32;2048;1;128;4096;2048;41537629
32;1;1;1;1;1024;160632889
32;1024;1;256;1;512;939111
64;1;16;1;64;1024;128169630
1;1024;1;16;4096;1;111627259
1;32;1;32;32;256;361735111
32;256;4;8;8;512;5304297
256;1024;1;128;4096;2048;452508148
8;512;1;128;2048;2048;21212296
16;1024;1;64;1;1024;2622222
64;256;1;128;4096;1024;44521481
32;1024;1;128;1;2;42017186
32;1024;1;32;1;4096;43352741
32;2048;1;64;1;1024;1561037
1024;128;32;2;1024;1024;38993482
256;16;1;8;32;4096;11577777
32;1;8;1;8;64;216826222
8;32;8;1;8;1;45333630
16;512;1;64;1;1024;2660741
32;1;1;1;1;2048;160272593
32;512;1;256;4096;2048;22084592
16;1024;2;128;1;1024;2717037
64;1024;1;128;4096;1024;79637778
32;2;1;2;1;4096;108751556
32;1024;2;128;1;1024;1637185
2;16;1;4;1;128;221432444
512;4;16;1;1;1;48302963
2048;256;4;16;128;1024;2594519
4096;32;1;4;4;32;14900889
32;1024;1;32;4096;1;1448280740
16;1024;1;64;4096;512;20216296
32;512;1;128;1;128;1052296
8;1024;1;64;4096;1024;41296444
128;1024;1;128;1024;2048;10750074
32;512;2;128;1;512;1729334
32;128;1;128;1;4096;2916000
32;1024;2;128;4096;4096;178942519
64;256;1;128;1;1024;1053926
32;256;2;128;4096;1024;23677926
64;1024;1;128;4096;256;157813926
512;2048;1;128;1;1024;2996889
4;1024;1;64;1;1024;10015703
8;1024;1;1;1;1024;155566371
32;1024;2;128;4096;2048;23565630
16;1024;1;128;1;256;1108593
32;512;2;64;1;128;1787259
32;4096;1;64;1;1024;1686074
32;256;1;128;1;1;95375555
64;2048;1;128;1;512;1796148
32;512;2;128;1;1024;1654370
32;1024;2;1;1;2048;156556889
8;512;1;128;1;512;3050074
8;2048;1;256;1;256;1093333
32;512;4;1;1;1024;155874370
32;128;1;128;2048;2048;44375704
32;1;2;1;4096;1024;3737511407
32;2048;4;1;1;512;76744593
64;1024;1;32;1;1024;1657630
32;2048;4;1;1;1024;155713630
32;2048;1;128;2048;512;12080000
1;1024;1;128;256;1024;20749630
32;1024;16;4;1;1024;243813481
32;16;1;4;32;1024;16609186
512;8;256;1;256;8;26182667
256;1;4;1;2048;1;1432688741
32;1;8;1;1;1;875074370
64;8;64;1;8;1;354399556
32;8;4;8;1;1024;140885333
32;1024;1;128;1;1024;981185
2;1024;1;128;1;1024;11061778
32;2048;2;128;4096;1024;23027111
128;1024;2;128;1;1024;1698519
512;4;4;1;4;1;14121629
256;1024;4;2;512;64;17243407
1024;4096;4;32;1;64;54686371
128;128;32;2;512;256;6199407
32;1024;2;128;2048;1024;11556148
32;1024;1;32;1;1024;2710667
32;1024;1;128;4;1024;1351259
32;4;1;2;1;4096;114883555
32;64;1;8;1;1024;8600741
1024;1024;1;128;1;1024;3219852
32;1024;1;128;128;1024;1402370
32;1024;4;1;1;4;48888889
32;16;1;4;1;1024;15980889
32;1;32;1;1;1024;4886175259
32;1024;2;128;1;2048;2590518
64;4;1;2;1;1024;32141482
32;1024;1;8;1;1024;8768741
32;1024;1;128;8;1024;1359111
32;1024;1;128;1;16;8974815
32;1024;32;8;1;1024;280713778
256;1024;1;128;2048;1024;11867259
32;8;1;8;1;1024;35492444
16;4;1;2;1;1024;106246222
1;1024;1;4;1;1024;465994815
32;1024;16;4;1;1;30984889
32;1024;16;4;1;8;9933037
32;1024;8;4;1;1024;110968296
1;1024;1;128;1;1024;21336740
32;2;1;2;128;1024;118214222
32;32;1;2;1;1024;30423555
32;1024;1;128;32;1024;1356148
16;1024;1;128;8;1024;1782815
32;4;1;1;1;1024;38509185
32;64;1;1;1;1024;37357482
32;1024;8;2;1;1024;208285778
16;1024;8;2;1;1024;455179703
32;1024;8;2;1;256;58303703
32;1024;1;128;2;1024;1143111
32;1024;1;32;1;1024;2681629
256;1024;1;1;1;1024;24025186
32;1024;4;1;1;128;21670074
32;1024;2;128;2;1;177956592
32;1024;1;128;1;4;23402222
2;8;1;8;1;1024;572497630
32;1024;1;128;4;1024;1329777
32;1024;8;2;1;1024;209227111
32;1024;16;2;1;128;59441630
64;1024;8;8;1;1024;31316444
32;16;1;4;1;16;18806074
32;16;1;4;128;128;17115555
2;1024;1;128;16;1024;10509777
32;1024;1;1;1;4;319197630
32;1024;8;8;1;1024;62170815
32;1024;4;1;256;1024;53226222
512;1024;1;128;1;1024;3054074
32;4096;1;4;1;1024;17770963
4096;1024;32;8;1;1024;19688296
32;512;1;128;1;1;61824741
32;2048;1;128;1;4096;24651111
16;1024;1;1;1;64;23484592
256;16;256;1;1;2;496651852
32;64;32;1;1;512;547706371
128;64;16;2;16;2;6969037
2;128;1;128;1;1024;45358370
32;1024;8;1;1;32;26799111
32;2048;2;128;1;256;1671259
32;256;1;128;256;1024;3002371
32;1;2;1;1;1024;327226518
64;32;4;4;16;2048;15754074
512;512;1;64;1;1;35482963
1024;1;1;1;4;32;39282963
1024;128;4;16;1024;4096;160973481
2;4096;2;128;1;128;1931704
32;2;1;2;8;1024;119196444
128;2048;4;64;1;1024;2783704
8;1024;1;256;4096;1024;10701185
1024;2;128;2;1;256;554392593
1;1;1;1;16;1024;4875702370
64;1;16;1;64;64;123452445
1;1024;1;16;4096;256;40550963
1;512;1;1;32;256;293247852
2048;256;16;2;64;512;16177333
512;128;32;2;128;1024;9508741
32;1024;4;2;1;1024;104212889
8;4096;4;1;1;1024;610918963
256;16;32;4;32;1;19597037
128;8;4;8;8;64;9993481
64;1;1;1;2;1;83234963
2;512;1;4;1;128;31675556
32;1024;1;4;1;8;29555704
8;1024;1;128;512;1024;2832296
64;1024;64;2;1;1024;970809630
32;4;1;2;1;1024;58543408
32;64;1;64;4096;1024;181136444
32;1024;1;4;1;1024;16765629
64;1024;1;1;1;1024;25995556
32;64;1;2;1;1024;30824888
1;64;1;1;128;1;131069333
32;1024;4;4;128;1024;15689333
4096;4;1;4;4;64;13422371
512;4096;256;1;256;8;97609333
256;2;4;2;1;1;58477333
32;64;8;8;1;1;224516445
256;1;64;1;1024;1;219277037
512;4;4;4;4;64;5339556
4;1024;1;128;1;2048;9962222
1;1024;1;8;512;64;16522222
1024;4096;8;8;1;64;15196296
128;128;32;2;512;8;18201185
16;1024;1;1;1;256;23175111
32;1024;8;2;512;256;9080592
2048;16;2;4;128;2;81653482
32;4096;32;8;1;512;139832889
128;64;16;1;16;256;8383556
64;128;4;1;16;32;12564148
512;512;1;64;16;1024;2168593
4096;4096;4;16;4;32;49885778
32;2048;8;32;1;1024;18761333
32;1;16;1;1;1024;2452789926
32;1024;1;8;16;1024;9335111
1024;128;128;2;128;4096;1902920000
1024;8;256;1;2048;64;26623852
1;1;1;1;16;1024;4865628148
64;1024;16;4;64;64;4205778
1;1024;1;1;4096;256;274677037
1;512;1;32;64;256;19880741
32;256;4;1;8;512;29718074
512;128;1;32;128;1;107247704
32;1024;1;128;1;8;17547260
256;16;4;8;32;128;4711111
4;8;4;8;8;1024;306231704
64;1024;1;128;2;4096;13690963
2048;512;1;4;1;128;31865926
8;256;1;256;1;1024;6057482
4;4;1;4;1;1;875455852
2048;8;4;1;128;1024;19038814
4096;4;1;4;1024;4;626100297
512;8;1;2;128;8;47353482
256;2;1;1;1;1;21130667
32;64;1;4;4;256;10072148
64;1;64;1;1024;1;607838667
512;4;4;4;8;32;5998814
256;4096;1;64;1;1024;1879111
8;512;2;2;512;64;11473926
1024;4096;8;2;1;64;20362667
64;128;1;2;512;256;81258667
16;1024;1;1;128;1;196381481
256;16;2;1;1;128;23810370
32;64;16;4;1;512;121631851
128;64;16;2;256;32;7454223
32;256;1;128;1;4;38873778
32;256;1;128;1;16;11367111
16;1024;1;64;1;256;968444
4096;128;4;4;16;512;7818518
512;512;1;1;2048;1024;966831408
1024;1;4;1;2;32;25352296
1024;64;16;16;1;1024;10123852
32;1024;1;64;64;1024;1791111
1024;32;256;1;512;64;54165777
1;1;1;1;16;4;5361522370
512;1024;16;16;64;1;70524000
1;16;1;16;4096;256;705071407
1;1;1;1;64;256;4893528148
32;256;4;16;8;512;3670222
512;64;1;32;128;16;27886815
32;1024;1;128;1;1024;984889
512;1024;1;128;1;2048;2078666
256;16;4;8;256;128;11532889
128;8;4;1;128;4096;98543111
64;1024;1;128;2;64;5607555
2;512;1;4;1;128;31400148
32;4096;1;128;1;32;13060000
4096;2048;1;128;1;1024;3063407
512;4;16;4;1;1;117854963
1024;256;16;8;128;1;45238963
4096;1;1;1;4;32;38798815
512;16;256;1;256;8;30393926
256;16;1;1;1;1;45506963
1;64;1;4;4;256;116043556
64;1;64;1;1024;4;311465481
256;4096;32;4;4;64;90166370
1024;1024;1;1;1;1024;25063408
32;1024;1;128;64;64;5890518
1;1024;1;128;1;1024;21508889
256;1024;64;4;1;64;39737037
2048;1;8;1;1;64;26608741
