epoch;GLOBAL_SIZE_0;GLOBAL_SIZE_1;LOCAL_SIZE_0;LOCAL_SIZE_1;cost
1505181813;1;128;1;128;2407268585
1505181854;1;1;1;1;40697238695
1505181857;64;1;2;1;2033035298
1505181859;16;8;2;4;1255015405
1505181862;4;8;1;1;2316758403
1505181865;8;8;1;4;2196266633
1505181867;16;8;2;2;1288942839
1505181869;16;8;4;8;1233875129
1505181871;32;16;4;8;1694781795
1505181873;128;16;2;2;1234579757
1505181875;1;64;1;4;2086614601
1505181877;256;4;4;1;1275767978
1505181880;16;8;16;8;2282616083
1505181882;16;8;4;4;1257894054
1505181884;16;8;1;8;1262108702
1505181886;128;8;1;1;1465676892
1505181889;16;4;4;1;2152124016
1505181891;16;8;4;1;1276735981
1505181893;16;16;1;8;1447937771
1505181895;16;8;4;2;1262476777
1505181936;1;1;1;1;40696815042
1505181938;64;2;1;1;1276796875
1505181940;256;1;1;1;1137423743
1505181943;8;8;2;2;2223063588
1505181964;1;2;1;1;20033159335
1505181965;64;128;2;1;654989421
1505181966;128;256;2;8;720803020
1505181969;1;32;1;2;2371533162
1505181971;256;128;16;8;865323838
1505181974;2;32;1;32;2036614554
1505181976;32;32;4;2;1362055666
1505181978;64;8;2;2;1552912700
1505181979;64;128;2;2;918811855
1505181981;16;128;1;2;785720511
1505181983;64;8;2;1;1518459391
1505181984;64;128;2;2;915514854
1505181986;2;64;1;2;1180954042
1505181989;16;2;1;1;2265616625
1505181992;32;2;4;2;2074174559
1505181994;32;16;2;8;1706010424
1505181996;64;256;2;1;609248730
1505181997;128;128;1;1;464448460
1505181998;64;256;2;2;797247609
1505182000;64;128;4;1;1011227958
1505182001;256;128;1;1;441600294
1505182002;64;128;1;1;521163219
1505182003;256;128;128;2;861934984
1505182005;128;32;64;1;1162786743
1505182006;256;256;1;1;416997837
1505182008;256;128;128;1;859208845
1505182009;256;128;1;2;546259336
1505182011;1;128;1;1;1197819140
1505182013;1;256;1;1;1096125730
1505182014;256;1;1;1;1136352672
1505182016;256;256;128;2;765534333
1505182017;128;128;2;1;630207009
1505182019;128;1;2;1;1175546837
1505182060;1;1;1;1;40696790834
1505182062;256;256;256;1;772254898
1505182063;256;256;128;1;770583105
1505182066;32;1;8;1;2323425678
1505182068;64;256;4;1;871068231
1505182069;128;256;2;1;576740834
1505182070;256;256;64;2;781483841
1505182072;256;1;1;1;1101714474
1505182114;1;1;1;1;40696799363
1505182115;256;256;1;2;463110600
1505182118;8;8;2;1;2183343246
1505182159;1;1;1;1;40697090750
1505182161;64;4;1;1;1254046917
1505182165;16;1;16;1;3309744834
1505182167;256;64;16;1;999701834
1505182168;256;128;256;1;846132375
1505182170;256;32;1;2;830750418
1505182172;1;256;1;16;1757324166
1505182173;4;256;1;1;630354513
1505182175;256;256;1;16;732627842
1505182176;256;256;4;1;780318815
1505182177;256;256;256;2;18446744073709551615
1505182180;64;1;4;1;2015030660
1505182182;128;4;8;2;1336615692
1505182184;256;32;32;4;1091636569
1505182194;1;4;1;1;9866416881
1505182198;2;8;2;2;2924112955
1505182199;128;256;128;2;785728417
1505182201;256;256;1;8;665598388
1505182202;256;32;1;1;583074145
1505182204;64;64;4;1;1133521933
1505182205;128;256;1;1;427474637
1505182206;256;128;1;4;748947678
1505182248;1;1;1;1;40696205945
1505182250;128;1;1;1;1235337426
1505182251;1;256;1;1;1092267182
1505182254;128;32;8;2;1174892243
1505182256;2;256;2;1;1164245584
1505182257;256;256;1;4;604763713
1505182260;8;4;2;1;2353132466
1505182261;256;128;256;2;18446744073709551615
1505182262;128;32;32;2;1199216591
1505182264;32;8;16;8;1320573333
1505182266;16;128;8;4;1154445083
1505182268;32;32;8;8;1399547342
1505182310;1;1;1;1;40697111238
1505182312;256;1;128;1;1294435625
1505182313;256;1;1;1;1135344658
1505182316;1;256;1;2;1763649718
1505182318;256;1;256;1;1316523505
1505182320;256;1;256;1;1303403842
1505182321;256;64;1;1;483099934
1505182323;128;256;2;2;737823017
1505182326;1;64;1;1;2266438500
1505182328;32;256;4;1;975136886
1505182330;128;8;32;4;1448049204
1505182331;256;64;1;2;649790717
1505182333;256;32;8;16;1003220375
1505182335;256;16;8;4;1147418875
1505182337;128;16;64;4;1268278344
1505182339;256;1;128;1;1305352344
1505182340;128;256;128;1;791837476
1505182343;64;1;2;1;2056674729
1505182345;64;256;4;2;852125463
1505182347;128;128;2;2;848018102
1505182348;128;64;128;1;1017623880
1505182351;1;256;1;4;1759305921
1505182393;1;1;1;1;40696872333
1505182396;1;256;1;4;1764904125
1505182397;128;256;2;4;709163542
1505182398;256;128;64;8;18446744073709551615
1505182440;1;1;1;1;40696541542
1505182442;128;1;1;1;1235206660
1505182444;256;64;256;1;973793640
1505182445;256;256;256;4;18446744073709551615
1505182447;1;128;1;2;1296385003
1505182450;1;256;1;2;1755393072
1505182452;1;128;1;1;1199941734
1505182455;1;128;1;2;1301051554
1505182457;32;256;8;1;989009663
1505182459;128;64;2;1;697085973
1505182463;64;1;4;1;2023617171
1505182465;128;1;2;1;1204465302
1505182467;128;256;1;4;714580250
1505182469;1;256;1;1;1099272288
1505182470;256;256;16;1;777843019
1505182472;32;8;4;4;1539091817
1505182474;8;128;2;1;786413547
1505182476;64;2;4;1;1165848049
1505182477;256;16;16;8;1150169979
1505182480;256;32;256;1;1083976698
1505182481;256;256;128;4;18446744073709551615
1505182483;1;128;1;16;1296884081
1505182485;256;32;32;2;1088277111
1505182486;256;128;64;16;18446744073709551615
1505182489;1;64;1;1;2263044877
1505182491;256;32;16;2;1089326231
1505182532;1;1;1;1;40696842654
1505182537;256;1;1;1;1137763758
1505182539;1;256;1;1;1087274440
1505182542;64;64;4;2;1120615045
1505182544;128;64;1;1;542611727
1505182546;128;128;128;1;910365307
1505182549;8;64;8;4;1492084254
1505182551;1;256;1;1;1095963996
1505182553;256;32;16;16;1074168793
1505182555;256;1;64;1;1157001082
1505182566;4;1;1;1;9943504914
1505182567;256;32;16;32;18446744073709551615
1505182569;1;256;1;2;1761864907
1505182590;1;2;1;1;20033660793
1505182593;256;2;1;1;1498318145
1505182594;256;256;256;16;18446744073709551615
1505182595;8;256;2;1;732747559
1505182597;64;32;2;1;1054034689
1505182599;128;1;32;1;1182885147
1505182601;1;128;1;8;1292874024
1505182603;256;128;1;8;825782217
1505182605;256;64;16;64;18446744073709551615
1505182607;256;64;32;1;1001039001
1505182609;128;64;2;4;996763665
1505182613;128;1;128;1;2226203517
1505182616;256;256;64;1;779711196
1505182618;256;64;128;1;975779587
1505182621;1;256;1;1;1093950928
1505182622;32;256;2;1;658224187
1505182624;64;32;4;1;1251591927
1505182627;256;1;32;1;1104701390
1505182630;256;64;16;4;974340753
1505182630;256;64;256;2;18446744073709551615
1505182633;256;64;4;1;1009018213
1505182636;256;1;256;1;1293170502
1505182639;64;1;4;1;2037168797
1505182641;256;256;1;64;855401190
1505182643;256;256;1;256;1894627901
1505182645;256;128;1;16;856644768
1505182648;2;32;1;1;2205505901
1505182650;32;32;16;2;1356756887
1505182652;64;32;2;8;1396157033
1505182653;256;32;16;2;1071621039
1505182658;16;256;1;1;580302606
1505182659;256;256;1;1;417260667
1505182661;256;16;1;1;805857567
1505182662;256;256;256;8;18446744073709551615
1505182666;64;256;1;1;439888727
1505182670;1;32;1;1;2389866468
1505182673;1;128;1;1;1194708347
1505182675;256;128;64;1;862865863
1505182679;1;64;1;4;2054765639
1505182681;256;256;8;1;779031388
1505182682;8;256;2;2;1148728608
1505182684;128;32;1;2;1109689940
1505182687;32;2;1;2;2098258508
1505182690;64;16;1;8;1711662287
1505182692;256;8;1;1;1219467376
1505182733;1;1;1;1;40696930125
1505182740;2;4;1;1;4893777930
1505182742;16;128;16;4;1175701749
1505182745;1;32;1;4;2366196075
1505182786;1;1;1;1;40696767041
1505182788;256;1;64;1;1156452182
1505182790;128;32;2;2;1116585998
1505182792;256;256;128;32;18446744073709551615
1505182794;2;256;2;128;1745701145
1505182796;128;64;2;2;991378341
1505182798;64;64;2;1;737215555
1505182800;128;8;8;2;1455300848
1505182801;256;256;2;16;615421337
1505182804;1;256;1;128;2220840083
1505182806;16;256;8;1;1075244346
1505182848;1;1;1;1;40696906195
1505182849;32;64;16;2;1218895882
1505182870;1;2;1;1;20033449625
1505182872;32;32;8;1;1365217288
1505182875;256;256;1;128;1172833708
1505182876;16;256;16;1;1084559385
1505182877;256;256;2;1;530307309
1505182878;256;256;16;64;18446744073709551615
1505182880;256;256;1;64;856446743
1505182881;256;256;1;32;733055820
1505182923;1;1;1;1;40697076487
1505182925;256;8;16;1;1270264638
1505182926;256;1;1;1;1147867940
1505182929;32;8;4;1;1419899756
1505182929;8;256;2;256;18446744073709551615
1505182931;64;2;4;2;1214961827
1505182933;128;16;16;8;1300515146
1505182937;256;1;128;1;1296478843
1505182939;1;256;1;2;1757298198
1505182947;128;256;1;2;541541519
1505182950;128;1;1;1;1244375663
1505182955;8;2;8;1;3058588389
1505182957;256;32;1;8;1125539797
1505182959;1;256;1;2;1758923158
1505182980;1;2;1;1;20033057833
1505182982;256;1;1;1;1120980365
1505182983;256;256;128;16;18446744073709551615
1505182985;256;256;32;1;779857014
1505182987;256;4;1;2;1776528861
1505182990;256;16;1;16;1805315541
1505182991;8;128;1;1;816913269
1505182993;128;32;2;8;1254372897
1505182996;1;128;1;128;2408194383
1505182999;256;128;1;128;1678743510
1505183001;64;256;4;4;827514256
1505183010;256;128;256;4;18446744073709551615
1505183015;2;32;1;2;2018465537
1505183018;8;4;1;2;2344686970
1505183021;64;1;32;1;2026489783
1505183025;8;2;1;2;3085954955
1505183026;32;256;1;1;462030468
1505183028;32;16;4;2;1529843096
1505183031;32;1;2;1;2315309265
1505183033;8;256;1;1;635081144
1505183046;128;32;2;1;895609656
1505183051;1;16;1;1;3448656913
1505183092;1;1;1;1;40696956458
1505183097;2;4;1;4;4857798078
1505183099;8;128;2;4;1281284677
1505183101;32;256;8;2;963623066
1505183104;256;64;1;4;917040248
1505183105;128;256;128;1;792599141
1505183106;256;256;8;64;18446744073709551615
1505183107;256;256;1;1;417541263
1505183110;256;64;128;2;979929905
1505183114;256;32;32;1;1103366159
1505183116;1;128;1;2;1302143287
1505183118;128;1;8;1;1199054334
1505183122;1;64;1;2;2092305845
1505183127;64;1;4;1;2035172291
1505183133;1;256;1;8;1762871314
1505183135;128;32;32;8;1186992587
1505183137;32;64;8;32;1515918209
1505183139;16;128;16;4;1192273297
1505183141;1;256;1;1;1095846207
1505183144;32;1;4;1;2345973820
1505183147;1;128;1;8;1308679782
1505183149;256;1;1;1;1151131017
1505183192;1;1;1;1;40696472000
1505183194;256;256;4;2;679073336
1505183196;1;256;1;1;1092938254
1505183198;1;256;1;1;1094101873
1505183200;1;256;1;32;1755728260
1505183203;32;8;8;2;1446976417
1505183205;8;128;4;1;1299037179
1505183207;64;2;1;1;1275851047
1505183209;16;16;16;8;1345428259
1505183214;256;4;1;1;1617616582
1505183217;1;128;1;4;1289285916
1505183219;64;64;2;4;1103979612
1505183221;256;32;1;8;1183337955
1505183222;32;256;4;8;905152756
1505183243;1;2;1;1;20033369833
1505183246;256;8;1;2;1650068263
1505183250;1;128;1;2;1305475570
1505183251;128;256;8;8;801033309
1505183292;1;1;1;1;40696333083
1505183294;256;4;256;1;1310893978
1505183296;256;64;1;2;660013560
1505183297;256;16;256;2;18446744073709551615
1505183299;128;1;2;1;1190905018
1505183305;64;128;4;2;984044373
1505183312;128;1;2;1;1200750383
1505183316;256;32;1;2;844578512
1505183318;32;32;8;2;1359492584
1505183320;64;32;2;4;1249168697
1505183322;256;32;4;2;1066916886
1505183325;32;1;4;1;2340636264
1505183328;1;32;1;1;2390679901
1505183335;1;32;1;2;2375186136
1505183338;64;128;2;4;931620236
1505183341;32;128;8;1;1103521597
1505183387;1;1;1;1;40696889291
1505183389;128;128;2;4;844684023
1505183392;32;16;1;1;1292065716
1505183396;1;16;1;2;3362006886
1505183398;32;16;8;1;1522777516
1505183400;256;8;2;2;1254206989
1505183401;256;256;64;16;18446744073709551615
1505183402;256;256;2;1;529144934
1505183406;256;2;1;2;1269356036
1505183448;1;1;1;1;40697244571
1505183453;2;4;1;2;4862791047
1505183457;1;64;1;1;2252375239
1505183460;256;64;64;1;999117000
1505183461;16;128;16;128;18446744073709551615
1505183467;8;1;2;1;4966481666
1505183467;256;256;128;8;18446744073709551615
1505183469;256;256;4;64;661239795
1505183469;256;256;16;32;18446744073709551615
1505183471;4;256;1;1;616523799
1505183478;128;256;128;4;18446744073709551615
1505183480;128;256;64;1;834213208
1505183484;4;8;4;1;2377259636
1505183487;1;32;1;8;2411978341
1505183489;128;1;2;1;1206335626
1505183491;16;32;4;8;1581609459
1505183497;32;64;32;2;1205544050
1505183499;4;128;4;4;1733626150
1505183501;1;128;1;2;1287339917
1505183503;32;64;4;2;1215095491
1505183506;256;16;1;4;1233787075
1505183508;1;128;1;2;1302521309
1505183549;1;1;1;1;40696861529
1505183552;256;16;1;8;1385947048
1505183554;256;1;1;1;1089096561
1505183556;256;32;1;4;1072580154
1505183559;1;64;1;4;2077405503
1505183562;64;256;2;4;805481443
1505183569;128;128;2;1;625265057
1505183571;64;2;8;1;1156700676
1505183581;1;4;1;2;9872704823
1505183583;64;256;64;1;887475797
1505183587;128;128;1;2;622768097
1505183589;256;128;1;2;544955186
1505183591;128;16;4;2;1252947291
1505183593;256;2;8;1;1260068496
1505183595;64;128;64;2;1028470843
1505183598;256;8;1;1;1240531167
1505183604;2;256;2;64;1754470604
1505183606;256;1;1;1;1107235317
1505183613;1;256;1;1;1090761666
1505183616;32;1;8;1;2309619045
1505183617;256;128;1;8;821524007
1505183620;1;32;1;4;2413337135
1505183627;64;32;16;2;1221733547
1505183629;32;32;2;4;1308666001
1505183632;1;32;1;16;2379285699
1505183673;1;1;1;1;40696642570
1505183676;256;256;32;4;786053054
1505183683;32;128;4;1;1103257362
1505183688;32;16;2;2;1554965005
1505183691;1;32;1;1;2374268339
1505183693;256;8;32;1;1272081712
1505183734;1;1;1;1;40696380708
1505183741;1;256;1;4;1759728638
1505183743;64;64;64;1;1136579419
1505183746;64;4;1;1;1200912617
1505183747;16;128;2;2;1133011625
1505183749;256;32;32;2;1087591007
1505183751;128;4;1;1;1513408542
1505183754;256;64;1;16;1033086794
1505183756;256;1;32;1;1150690712
1505183758;256;4;1;1;1597348107
1505183802;1;1;1;1;40696926071
1505183809;64;1;1;1;2316730487
1505183811;128;16;32;16;18446744073709551615
1505183813;32;64;4;2;1210919022
1505183815;8;128;1;4;1289986172
1505183817;1;256;1;1;1093506151
1505183825;64;64;4;4;1146682094
1505183829;1;16;1;16;3440069560
1505183833;2;8;2;1;3045804883
1505183838;1;64;1;2;2077242987
1505183840;128;1;2;1;1180788496
1505183842;64;2;8;2;1219768880
1505183848;1;16;1;8;3430909113
1505183850;1;256;1;1;1089030946
1505183851;256;128;1;4;748749063
1505183853;32;64;4;8;1243121997
1505183859;256;64;128;16;18446744073709551615
1505183862;64;1;2;1;2071517640
1505183864;2;256;2;1;1170101834
1505183867;1;32;1;8;2370918171
1505183876;256;1;1;1;1152920914
1505183879;1;256;1;128;2221073996
1505183880;128;256;2;1;574769928
1505183886;8;1;2;1;5048237123
1505183890;1;128;1;4;1293654532
1505183891;256;32;2;2;1014423204
1505183893;64;32;1;1;849809352
1505183895;16;32;2;8;1530300822
1505183905;256;16;4;2;1147462136
1505183946;1;1;1;1;40696275542
1505183948;16;256;16;2;1082872080
1505183950;64;1;4;1;2043184875
1505183959;1;64;1;2;2079339990
1505183961;256;1;1;1;1128951446
1505183964;32;64;8;1;1234247464
1505183968;256;8;1;4;1541145836
1505183970;256;32;4;1;1086791737
1505183972;256;8;256;1;1250391562
1505183980;128;1;1;1;1236846397
1505183985;2;4;1;4;4863348792
1505183987;16;16;2;2;1454407947
1505183990;1;32;1;2;2407647117
1505184001;1;4;1;1;9863603417
1505184003;128;1;1;1;1251348198
1505184005;128;1;8;1;1198093184
1505184012;128;128;1;8;937146659
1505184013;256;256;32;128;18446744073709551615
1505184016;32;32;8;4;1364526575
1505184018;16;128;4;4;1140098238
1505184059;1;1;1;1;40696599363
1505184061;256;64;16;2;995856043
1505184071;128;128;2;4;843462836
1505184073;128;2;1;1;1187548719
1505184073;256;16;64;8;18446744073709551615
1505184074;64;256;64;16;18446744073709551615
1505184083;256;32;64;1;1084022410
1505184084;256;128;1;1;442119128
1505184087;1;32;1;8;2390916835
1505184089;16;256;8;16;1077922286
1505184091;1;128;1;1;1201308142
1505184096;128;256;1;8;784586903
1505184098;64;256;64;2;896114480
1505184104;128;1;2;1;1202783215
1505184106;1;128;1;8;1292353654
1505184107;256;128;1;1;444353342
1505184108;256;32;1;2;841488306
1505184117;4;256;2;1;802515025
1505184120;64;32;1;2;1185530249
1505184121;256;32;2;4;1018564050
1505184123;256;32;128;2;1089466766
1505184126;32;2;8;1;2126672110
1505184136;32;256;4;2;932642636
1505184140;1;16;1;1;3389553160
1505184145;1;8;1;1;5048743670
1505184166;2;1;1;1;20228387000
1505184169;1;256;1;2;1761757812
1505184182;64;16;32;1;1392293832
1505184185;128;64;4;4;1033328505
1505184190;16;128;2;1;762023504
1505184191;256;128;32;2;874393187
1505184202;1;4;1;1;9859567327
1505184204;128;1;8;1;1177934933
1505184209;128;32;32;1;1177081179
1505184212;32;1;2;1;2285834012
1505184214;256;1;128;1;1299121284
1505184255;1;1;1;1;40696332238
1505184257;256;32;256;2;18446744073709551615
1505184280;2;1;2;1;20226598833
1505184282;128;128;2;8;856260530
1505184284;256;64;16;1;994029251
1505184286;128;128;2;2;855829018
1505184296;2;2;2;1;9964832500
1505184298;256;1;16;1;1145532202
1505184323;2;1;2;1;20226664333
1505184325;32;256;8;1;980926447
1505184327;8;256;1;16;1232962491
1505184331;256;1;64;1;1155837839
1505184335;32;128;2;1;701541805
1505184341;1;32;1;8;2366034928
1505184343;64;128;1;1;526166505
1505184344;32;256;1;8;945082287
1505184348;16;1;8;1;3264040625
1505184354;1;128;1;1;1200879709
1505184355;128;256;2;32;752768385
1505184357;64;2;64;1;1179972916
1505184359;16;32;2;4;1539745965
1505184366;256;1;16;1;1165064508
1505184377;64;1;1;1;2322407012
1505184379;32;32;1;1;1130286261
1505184381;128;4;2;4;1443608351
1505184382;256;32;128;16;18446744073709551615
1505184388;32;1;4;1;2354085556
1505184390;128;256;1;2;537305473
1505184392;64;2;4;1;1163719279
1505184433;1;1;1;1;40696668904
1505184474;1;1;1;1;40697023458
1505184483;16;2;16;2;2298502533
1505184488;128;64;1;2;776133764
1505184490;256;128;256;8;18446744073709551615
1505184495;128;1;8;1;1203642669
1505184496;256;32;1;1;584288312
1505184496;16;256;2;256;18446744073709551615
1505184498;128;128;32;2;942551934
1505184502;64;64;1;1;613614643
1505184509;256;128;128;4;18446744073709551615
1505184511;256;2;4;1;1265316250
epoch;GLOBAL_SIZE_0;GLOBAL_SIZE_1;GLOBAL_SIZE_2;LOCAL_SIZE_0;LOCAL_SIZE_1;LOCAL_SIZE_2;cost
1505184538;4;4;1;2;1;1;3068346125
1505184540;32;128;1;4;4;1;1704783464
1505184546;2;2;2;1;1;2;5021328500
1505184548;128;16;8;8;16;2;1495863440
1505184550;4;128;1;1;8;1;1385683385
1505184554;4;16;128;1;16;2;2932814745
1505184557;16;1;128;16;1;16;2869592500
1505184561;16;1;1;1;1;1;3440651736
1505184562;128;256;1;1;2;1;499532312
1505184564;128;1;8;1;1;2;691945055
1505184564;2;1;256;1;1;256;279727761
1505184575;2;1;2;1;1;2;10091173330
1505184576;256;32;128;128;8;1;18446744073709551615
1505184579;32;64;4;8;1;4;2568000881
1505184581;1;256;1;1;1;1;916053896
1505184582;32;256;8;1;2;2;563793716
1505184582;1;16;256;1;4;256;18446744073709551615
1505184583;2;1;256;1;1;256;280304338
1505184585;2;1;16;1;1;8;1524234990
1505184586;2;256;256;1;128;256;18446744073709551615
1505184587;2;16;16;2;2;8;296110009
1505184589;64;8;1;2;2;1;1557483894
1505184591;64;1;4;4;1;2;895698000
1505184592;16;128;2;1;2;2;1223741560
1505184593;2;1;256;1;1;128;251952260
1505184594;4;1;256;4;1;256;18446744073709551615
1505184595;2;1;256;2;1;128;234892005
1505184596;2;1;256;2;1;256;18446744073709551615
1505184596;4;1;256;2;1;128;224223459
1505184598;2;1;256;1;1;1;981923866
1505184599;4;256;128;2;128;128;18446744073709551615
1505184600;2;1;256;2;1;128;230372423
1505184600;4;1;256;2;1;128;224309175
1505184601;4;256;256;2;256;128;18446744073709551615
1505184602;4;1;256;1;1;128;264022458
1505184603;4;1;128;2;1;128;209810295
1505184604;4;1;256;1;1;128;243682258
1505184604;4;1;256;1;1;128;224455960
1505184606;4;128;128;2;1;128;340951217
1505184606;4;1;128;4;1;128;18446744073709551615
1505184607;4;256;128;1;64;128;18446744073709551615
1505184608;16;1;128;2;1;128;253134009
1505184609;4;1;128;4;1;64;292576506
1505184609;8;256;128;2;128;128;18446744073709551615
1505184610;4;1;128;1;1;128;265960710
1505184613;4;1;4;2;1;2;2527071893
1505184615;4;1;16;2;1;4;736990917
1505184615;128;1;128;16;1;128;18446744073709551615
1505184616;4;1;128;1;1;128;254418962
1505184619;32;1;2;2;1;1;2462480359
1505184620;16;256;128;8;64;1;18446744073709551615
1505184621;2;4;16;2;1;8;611732545
1505184622;256;4;8;64;4;2;18446744073709551615
1505184632;4;1;1;2;1;1;9833914028
1505184634;4;1;128;2;1;1;761474696
1505184635;4;1;128;2;1;1;757992060
1505184636;4;1;256;2;1;128;224201507
1505184637;8;1;64;2;1;64;303216215
1505184638;4;1;256;2;1;64;273806882
1505184639;4;1;128;2;1;1;695464299
1505184640;2;1;128;2;1;128;213968298
1505184642;256;1;2;32;1;1;1917890430
1505184645;32;64;1;8;1;1;2216273640
1505184648;256;8;1;64;1;1;2078068756
1505184649;64;2;16;4;1;8;261739719
1505184649;4;256;128;2;256;128;18446744073709551615
1505184652;8;1;128;2;1;1;1989240417
1505184655;4;64;64;2;64;1;2654302584
1505184656;2;256;32;2;128;16;18446744073709551615
1505184658;2;8;4;1;2;1;1757828979
1505184659;1;1;128;1;1;128;434129878
1505184660;4;1;128;1;1;64;253259668
1505184664;4;1;4;2;1;2;2526235103
1505184665;4;1;32;2;1;2;587761473
1505184666;4;64;128;2;2;128;18446744073709551615
1505184667;4;1;32;1;1;2;1064050555
1505184673;4;1;2;2;1;2;4931757667
1505184674;4;1;128;2;1;4;320641637
1505184674;4;4;128;2;4;64;18446744073709551615
1505184676;4;1;16;2;1;4;739033500
1505184677;4;1;128;2;1;128;209874800
1505184678;4;1;128;1;1;8;340123929
1505184679;1;1;128;1;1;128;495970933
1505184680;1;128;32;1;1;32;225928257
1505184683;64;128;16;64;1;4;2619989631
1505184684;1;8;16;1;8;16;442204176
1505184686;256;2;1;2;1;1;1187508211
1505184687;4;1;128;2;1;128;226475800
1505184687;4;1;128;4;1;128;18446744073709551615
1505184690;4;8;32;2;1;4;1776956815
1505184692;16;1;32;8;1;2;1835057034
1505184693;4;1;128;2;1;128;210080209
1505184694;4;1;64;2;1;1;578614761
1505184698;8;8;32;8;2;1;2638607651
1505184698;8;1;128;4;1;128;18446744073709551615
1505184699;2;1;128;2;1;128;209228174
1505184700;2;1;128;1;1;128;263916130
1505184701;1;1;128;1;1;64;537003853
1505184703;2;1;128;1;1;1;941408595
1505184704;2;1;128;2;1;1;504070168
1505184705;2;1;128;2;1;1;505763339
1505184706;2;256;128;2;128;128;18446744073709551615
1505184707;16;256;128;2;256;128;18446744073709551615
1505184707;8;256;128;2;256;128;18446744073709551615
1505184708;4;1;64;2;1;1;587971897
1505184709;2;256;256;2;256;32;18446744073709551615
1505184710;2;1;256;1;1;256;280553960
1505184711;2;256;256;2;256;128;18446744073709551615
1505184711;2;1;128;2;1;64;215703631
1505184713;2;1;64;2;1;1;976058959
1505184715;4;32;2;4;16;2;1390660095
1505184718;4;128;8;4;32;2;2381843730
1505184719;8;256;16;2;64;16;18446744073709551615
1505184719;4;64;16;4;64;2;18446744073709551615
1505184721;2;1;128;2;1;1;503148560
1505184721;2;8;128;2;2;128;18446744073709551615
1505184722;2;1;128;2;1;128;227293884
1505184763;1;1;1;1;1;1;40693835112
1505184764;256;2;1;256;2;1;18446744073709551615
1505184767;16;64;8;8;1;1;2731038546
1505184769;16;256;1;2;128;1;965825434
1505184770;64;256;4;8;64;4;18446744073709551615
1505184771;2;1;128;1;1;128;275595382
1505184772;2;1;128;2;1;1;505429548
1505184773;2;1;128;2;1;128;208728088
1505184773;2;1;128;1;1;128;278442760
1505184774;128;1;128;2;1;128;260379423
1505184795;2;1;1;2;1;1;20032165168
1505184796;2;1;128;2;1;128;257601792
1505184797;64;1;128;32;1;128;18446744073709551615
1505184797;2;4;128;2;4;128;18446744073709551615
1505184798;2;1;128;2;1;128;209060756
1505184799;2;2;128;2;2;128;18446744073709551615
1505184799;2;1;128;2;1;128;210388090
1505184800;2;32;128;2;4;128;18446744073709551615
1505184801;2;16;128;2;4;128;18446744073709551615
1505184802;2;1;128;1;1;128;265423251
1505184803;128;1;128;2;1;128;263265591
1505184803;2;1;128;1;1;128;274136757
1505184804;2;4;128;2;4;8;256121841
1505184805;2;256;128;2;4;128;18446744073709551615
1505184811;2;1;4;2;1;2;5218366500
1505184812;2;1;64;2;1;1;976741194
1505184813;2;1;128;2;1;128;209188340
1505184814;16;1;128;2;1;32;242922209
1505184815;2;1;128;2;1;128;215992126
1505184816;2;1;128;2;1;128;219244504
1505184817;2;1;128;2;1;1;503734417
1505184818;2;1;128;2;1;32;220759212
1505184819;2;256;128;2;4;32;718180316
1505184822;2;256;16;1;2;2;1614570022
1505184823;16;8;1;16;8;1;1232206177
1505184827;4;4;1;2;2;1;3211527232
1505184829;1;256;1;1;2;1;882856522
1505184832;8;16;32;2;8;8;2051033710
1505184834;4;256;8;2;32;1;1750587708
1505184835;2;1;128;2;1;128;209394169
1505184876;1;1;1;1;1;1;40693809292
1505184877;4;1;128;2;1;128;236086545
1505184878;2;1;128;2;1;2;209308167
1505184879;2;1;128;2;1;1;503156854
1505184880;2;1;128;1;1;128;263660714
1505184881;2;1;128;1;1;128;249830542
1505184882;2;1;128;2;1;16;209423630
1505184884;8;1;128;2;1;2;1584640423
1505184887;2;1;8;2;1;8;2758885521
1505184888;2;2;128;2;1;32;213461423
1505184889;2;1;128;2;1;8;225072383
1505184890;2;64;128;2;4;128;18446744073709551615
1505184890;2;64;128;2;32;128;18446744073709551615
1505184891;2;1;128;1;1;128;272911258
1505184894;2;64;128;2;4;4;2510136940
1505184900;2;1;4;1;1;1;5216319232
1505184921;2;1;1;2;1;1;20031954668
1505184922;2;1;128;2;1;64;209213333
1505184923;2;2;32;2;1;2;494727057
1505184924;2;2;128;2;1;128;227561176
1505184926;2;1;16;2;1;4;1521282194
1505184927;2;1;128;1;1;128;265710466
1505184928;2;1;128;2;1;2;227383754
1505184928;256;32;128;2;4;128;18446744073709551615
1505184930;2;1;64;2;1;1;979110702
1505184931;2;1;128;2;1;8;209375841
1505184932;2;1;128;2;1;128;208777674
1505184932;4;8;128;2;4;128;18446744073709551615
1505184933;2;2;128;2;1;128;227302426
1505184934;2;1;128;2;1;1;504608378
1505184936;2;1;32;2;1;2;731992601
1505184937;8;1;128;2;1;128;251927547
1505184937;1;128;128;1;4;128;18446744073709551615
1505184938;1;1;128;1;1;128;536503220
1505184940;2;1;32;2;1;2;729024881
1505184941;2;1;128;2;1;8;224944711
1505184961;2;1;1;2;1;1;20032510292
1505184962;2;1;128;1;1;128;271186125
1505184963;1;1;128;1;1;128;434328920
1505184966;4;64;2;4;8;1;1785075670
1505184967;64;1;128;2;1;128;266184802
1505184968;8;1;128;2;1;128;235847418
1505184971;4;64;4;4;16;4;2068492511
1505184981;2;1;2;1;1;2;10091591000
1505184982;2;1;256;1;1;8;231244625
1505184985;256;32;128;1;8;1;1958816780
1505184987;4;64;2;1;16;2;1242255404
1505184989;4;256;4;4;16;2;1818943962
1505184990;8;64;8;8;8;8;18446744073709551615
1505184992;4;128;4;1;16;2;1899185937
1505184995;2;1;64;1;1;1;1793638842
1505184996;2;256;128;1;4;64;512247461
1505184997;1;1;128;1;1;64;434191639
1505184998;2;4;128;2;4;128;18446744073709551615
1505184999;256;1;128;2;1;8;624162969
1505185000;2;1;128;2;1;128;209409834
1505185001;2;1;256;2;1;128;225359129
1505185004;2;256;128;2;4;1;2237933740
1505185005;2;1;32;2;1;2;729439099
1505185008;8;64;4;2;1;1;1890684263
1505185018;1;4;1;1;1;1;9983360832
1505185020;1;32;8;1;2;2;1442035087
1505185041;2;1;1;2;1;1;20032040584
1505185043;8;256;4;2;32;2;1351170965
1505185046;4;128;4;1;32;4;1853714565
1505185046;32;1;128;8;1;128;18446744073709551615
1505185047;4;1;256;2;1;128;224415465
1505185048;4;1;128;4;1;128;18446744073709551615
1505185049;2;1;128;2;1;4;225899632
1505185050;16;1;128;2;1;128;261276377
1505185051;1;1;128;1;1;128;472933889
1505185052;256;1;128;2;1;128;243990172
1505185093;1;1;1;1;1;1;40693790917
1505185095;64;8;1;2;8;1;1133333125
1505185097;64;1;4;4;1;2;973322696
1505185098;16;16;128;1;2;128;307366590
1505185100;2;256;2;2;32;2;1346538293
1505185101;2;1;128;1;1;128;248058463
1505185102;2;1;256;2;1;128;223148589
1505185104;4;128;1;1;16;1;1398004708
1505185115;2;1;2;2;1;2;10091721174
1505185115;8;1;256;2;1;128;224909635
1505185118;4;128;2;1;16;1;1775600047
1505185139;1;1;2;1;1;1;20388467084
1505185140;16;256;128;8;256;1;18446744073709551615
1505185141;2;4;16;2;4;8;533293091
1505185143;4;128;2;1;32;1;1721703494
1505185146;8;128;4;2;32;2;1715437881
1505185148;4;128;2;1;16;2;1539315945
1505185150;4;128;4;1;32;2;1896971090
1505185151;2;32;128;2;8;128;18446744073709551615
1505185152;256;128;128;2;2;128;18446744073709551615
1505185153;2;1;32;2;1;2;729847883
1505185174;2;1;1;1;1;1;20036171501
1505185175;2;1;128;2;1;2;215217797
1505185176;2;1;128;2;1;128;221974009
1505185178;1;4;8;1;4;4;1352774973
1505185180;256;1;2;32;1;1;1922259321
1505185191;1;4;1;1;4;1;9980393499
1505185197;1;8;1;1;1;1;5191921716
1505185201;1;1;64;1;1;1;3786921042
1505185202;2;128;128;2;4;64;18446744073709551615
1505185203;4;1;256;2;1;64;242578754
1505185204;1;1;128;1;1;128;459965635
1505185206;2;1;64;2;1;64;568679215
1505185207;1;1;128;1;1;128;434638342
1505185208;4;128;128;2;1;128;300124550
1505185211;64;2;128;4;2;1;2685259835
1505185212;16;4;32;1;4;32;499284395
1505185213;64;8;16;1;1;4;421014675
1505185214;1;8;16;1;4;2;478879918
1505185215;128;1;128;1;1;128;290834883
1505185216;2;1;128;2;1;128;257448424
1505185217;8;128;128;2;4;128;18446744073709551615
1505185218;4;1;128;2;1;128;209946918
1505185219;128;1;128;2;1;128;255524260
1505185219;2;256;128;2;4;128;18446744073709551615
1505185221;64;1;128;2;1;4;1370895952
1505185222;2;2;128;2;2;128;18446744073709551615
1505185226;2;32;128;2;32;1;2866444517
1505185246;2;1;1;2;1;1;20032057083
1505185249;16;1;2;2;1;2;1708562849
1505185250;2;1;128;2;1;64;209306461
1505185250;2;1;128;2;1;4;215726674
1505185251;2;1;128;2;1;2;266688128
1505185252;2;1;128;1;1;128;248329132
1505185253;8;1;128;1;1;128;258618835
1505185254;2;1;128;2;1;64;209948383
1505185255;2;256;128;2;1;128;297185962
1505185257;32;128;16;2;4;4;1733666105
1505185258;32;1;128;2;1;128;249377093
1505185259;2;2;128;2;1;128;227354960
1505185262;64;1;128;2;1;1;2052524006
1505185264;2;1;128;1;1;1;949065217
1505185266;2;1;16;2;1;4;1523043562
1505185267;2;1;128;1;1;1;931694354
1505185269;2;16;2;2;4;2;1481092747
1505185270;64;1;128;2;1;64;280235336
1505185272;2;1;128;1;1;128;273543379
1505185272;1;16;128;1;4;128;18446744073709551615
1505185273;2;16;128;2;2;128;18446744073709551615
1505185274;2;1;128;2;1;2;219537045
1505185278;1;1;16;1;1;4;3234585990
1505185278;2;1;128;2;1;16;220887674
1505185279;32;1;128;2;1;128;242647005
1505185282;16;1;64;2;1;1;2149539833
1505185283;256;2;4;2;1;4;235846544
1505185284;256;8;1;256;8;1;18446744073709551615
1505185285;1;64;8;1;1;1;936955502
1505185287;16;256;1;2;1;1;1233521968
1505185290;2;1;64;1;1;1;1812502403
1505185291;1;1;128;1;1;128;434061757
1505185292;2;2;128;2;1;2;254837125
1505185293;2;1;128;2;1;128;209379547
1505185313;2;1;1;1;1;1;20036589418
1505185314;32;16;128;2;4;128;18446744073709551615
1505185315;4;1;128;1;1;128;265207547
1505185316;64;256;4;64;64;4;18446744073709551615
1505185318;2;256;16;2;2;2;1919739260
1505185321;16;4;8;16;2;8;1795659958
1505185322;4;4;32;2;1;8;351742212
1505185323;2;1;64;2;1;2;540775559
1505185324;4;256;128;1;4;128;18446744073709551615
1505185324;2;16;128;2;4;128;18446744073709551615
1505185325;2;1;128;2;1;1;503825476
1505185327;2;64;1;1;4;1;1175466294
1505185330;2;1;32;1;1;2;1840277230
1505185330;2;128;128;2;4;128;18446744073709551615
1505185332;128;128;1;1;2;1;613796898
1505185333;128;64;1;1;16;1;870265312
1505185336;16;1;4;4;1;1;1919612361
1505185338;256;32;128;1;8;2;1401579342
1505185341;2;16;1;2;8;1;2352369718
1505185344;2;1;8;2;1;8;2762678555
1505185347;2;1;64;1;1;1;1843511403
1505185348;2;256;128;1;4;64;477989394
1505185349;2;1;128;1;1;128;270537214
1505185351;32;1;128;2;1;2;1638745038
1505185354;128;1;128;2;1;1;1897178261
1505185356;1;64;4;1;32;1;1404780060
1505185358;256;1;128;2;1;1;1895246984
1505185359;8;1;128;2;1;128;235974509
1505185360;1;1;128;1;1;128;434796458
1505185361;8;64;128;2;4;128;18446744073709551615
1505185363;1;256;1;1;1;1;936485770
1505185365;32;256;1;16;2;1;1563529050
1505185368;2;16;1;2;2;1;2313052487
1505185370;64;8;8;1;8;8;1134557722
1505185372;64;1;16;4;1;2;1965829119
1505185373;16;2;128;1;2;128;256521049
1505185375;32;1;2;2;1;2;1415981548
1505185376;256;256;32;8;64;1;18446744073709551615
1505185378;16;1;4;2;1;2;1851092766
1505185380;64;1;4;2;1;2;696767628
1505185383;2;16;32;1;4;2;2335953292
1505185385;16;1;128;2;1;2;1936667844
1505185386;16;1;8;2;1;8;377316889
1505185387;2;64;128;1;4;128;18446744073709551615
1505185390;4;1;4;2;1;2;2526107730
1505185392;2;4;16;2;4;8;671783777
1505185393;1;4;16;1;4;1;758410500
1505185394;4;128;8;4;128;1;18446744073709551615
1505185414;1;2;1;1;1;1;20229718375
1505185416;1;1;128;1;1;64;442006507
1505185417;1;64;8;1;1;1;924340801
1505185418;16;32;16;4;1;8;280154843
1505185420;2;1;32;2;1;32;731780612
1505185421;64;1;16;1;1;4;428566887
1505185422;1;8;16;1;1;16;463200712
1505185425;8;8;1;2;4;1;2176719387
1505185430;4;2;1;1;2;1;4898522533
1505185431;1;256;8;1;1;4;297098335
1505185432;2;1;128;2;1;64;209240005
1505185433;2;1;256;1;1;8;221867964
1505185434;32;1;8;2;1;8;241922842
1505185475;1;1;1;1;1;1;40694021959
1505185478;64;4;4;8;1;4;1639837731
1505185479;2;256;1;1;2;1;944283687
1505185483;16;1;1;16;1;1;3432477922
1505185489;2;1;4;2;1;1;5218363735
1505185492;2;256;128;2;4;8;1976880120
1505185495;4;32;32;2;1;2;2117371662
1505185496;128;1;256;1;1;16;344044507
1505185498;8;1;256;2;1;2;1821013588
1505185505;1;1;8;1;1;8;5760372709
1505185506;2;1;128;2;1;2;257810217
1505185516;2;1;2;1;1;2;10090999500
1505185518;256;32;2;1;8;1;971017362
1505185520;1;64;4;1;2;1;1199346692
1505185522;1;1;64;1;1;64;1094307429
1505185523;32;1;8;16;1;1;1185868235
1505185525;2;16;16;1;1;8;303018549
1505185526;64;32;1;1;2;1;861665145
1505185529;64;1;1;4;1;1;2063911005
1505185529;16;2;128;4;2;128;18446744073709551615
1505185531;64;1;2;2;1;2;675521019
1505185534;16;256;128;4;1;1;2380644772
1505185535;2;1;256;2;1;8;234843175
1505185541;1;1;8;1;1;1;5748407646
1505185542;4;1;128;1;1;128;251934336
1505185543;32;32;128;2;4;128;18446744073709551615
1505185544;1;1;128;1;1;128;538654849
1505185548;1;1;64;1;1;1;3786006575
1505185552;2;128;128;2;4;32;3020512628
1505185553;4;1;256;2;1;128;224380299
1505185554;2;1;128;2;1;64;225251422
1505185555;2;256;128;2;1;128;314693467
1505185556;1;1;128;1;1;64;473078473
1505185577;1;1;2;1;1;1;20388965417
1505185588;1;4;1;1;4;1;9974988376
1505185594;1;8;1;1;1;1;5108466967
1505185595;1;4;16;1;1;8;760192385
1505185596;2;1;256;1;1;128;223957924
1505185598;2;1;128;1;1;1;942475978
1505185599;2;128;32;1;1;2;571978351
1505185600;64;8;16;1;1;4;404503880
1505185606;1;8;1;1;8;1;5091559674
1505185607;256;2;128;2;1;32;275636420
1505185608;8;1;256;1;1;128;233123459
1505185610;4;2;4;2;1;1;1240366543
1505185621;1;1;4;1;1;4;10659636805
1505185623;16;32;256;2;1;2;1905560218
1505185624;2;1;128;2;1;128;208972130
1505185625;2;1;256;2;1;128;222540545
1505185626;2;1;128;1;1;64;275069254
1505185629;64;256;4;8;2;1;1573359244
1505185630;1;256;1;1;2;1;916064959
1505185632;16;8;1;16;8;1;1211307002
1505185633;4;4;16;2;1;16;232138506
1505185635;128;1;256;4;1;16;1198729893
1505185636;128;1;8;1;1;2;689358959
1505185638;2;1;256;1;1;1;974579752
1505185640;256;32;16;1;8;1;1559534309
1505185641;1;256;128;1;4;128;18446744073709551615
1505185644;2;256;64;2;4;2;2279805236
1505185644;1;16;128;1;4;128;18446744073709551615
1505185647;1;64;4;1;64;1;1398375140
1505185648;2;256;1;2;1;1;1181847557
1505185652;32;16;256;32;2;2;3176754529
1505185655;2;16;1;2;2;1;2330389250
1505185656;2;1;128;1;1;128;266960377
1505185657;4;1;128;2;1;64;262760672
1505185659;64;32;1;1;2;1;855055393
1505185661;16;128;4;1;8;2;1630756397
1505185663;16;2;32;2;2;2;2029592875
1505185666;64;1;1;2;1;1;2247496116
1505185670;16;1;128;4;1;2;2567337409
1505185691;2;1;1;2;1;1;20032362209
1505185701;1;4;1;1;4;1;9973608955
1505185703;256;1;1;1;1;1;871554558
1505185705;2;64;1;2;4;1;1213392593
1505185716;1;4;1;1;4;1;9978782833
1505185717;1;1;256;1;1;1;1115815088
1505185718;64;2;256;64;1;8;18446744073709551615
1505185719;2;128;128;1;1;32;460703250
1505185722;64;1;16;16;1;4;2021102039
1505185722;32;64;16;8;64;8;18446744073709551615
1505185723;2;1;128;1;1;64;247856084
1505185727;2;128;64;2;4;1;2600518708
1505185727;2;256;128;2;8;128;18446744073709551615
1505185728;8;1;128;4;1;32;314258921
1505185731;4;256;128;2;4;1;2100010000
1505185732;2;256;128;2;2;128;18446744073709551615
1505185734;16;2;4;2;1;1;1342538599
1505185744;4;1;1;1;1;1;9831586049
1505185746;256;256;1;32;1;1;1482689477
1505185748;16;256;1;2;2;1;1110021934
1505185750;64;256;4;1;2;1;738753270
1505185752;1;256;64;1;2;1;2087083976
1505185755;1;256;64;1;2;1;2062626335
1505185758;2;256;64;2;2;1;2381232010
1505185759;16;8;256;16;8;64;18446744073709551615
1505185760;2;4;16;2;2;16;609873231
1505185761;128;1;256;2;1;16;326162887
1505185768;1;1;8;1;1;2;5742902052
1505185770;2;1;64;1;1;1;1833282299
1505185771;2;1;128;1;1;2;504610377
1505185772;2;1;128;1;1;64;269850382
1505185775;16;1;256;4;1;4;2501724334
1505185778;256;32;2;8;8;1;1423898133
1505185781;1;64;16;1;4;1;2464294323
1505185782;1;256;4;1;1;1;1084995108
1505185784;16;256;1;4;64;1;1340148221
1505185787;2;1;16;2;1;8;1523026286
1505185789;2;1;32;2;1;1;1841905152
1505185792;64;16;1;1;4;1;1609833632
1505185793;64;1;32;1;1;2;759521052
1505185794;16;256;128;1;2;64;265000426
1505185798;64;1;1;1;1;1;3296729095
1505185799;4;1;128;2;1;16;304156178
1505185802;16;256;32;16;1;1;2004246543
1505185802;2;1;256;2;1;2;228716338
1505185804;1;4;16;1;4;1;762186445
1505185805;4;1;64;2;1;4;321500969
1505185807;2;1;32;2;1;2;1103060767
1505185808;256;1;1;1;1;1;873009586
1505185811;8;4;1;1;4;1;2377071297
1505185817;1;8;1;1;1;1;5100782617
1505185820;64;1;16;4;1;1;2517303562
1505185821;128;256;32;1;256;32;18446744073709551615
1505185822;64;8;16;1;1;4;418164430
1505185823;2;1;256;2;1;128;234234964
1505185826;1;256;64;1;4;1;2587707495
1505185828;4;1;256;4;1;64;819112557
1505185829;2;256;1;2;2;1;1173127881
1505185831;1;8;16;1;8;16;470128889
1505185832;256;128;4;1;1;1;944446241
1505185834;64;2;1;32;1;1;1123114244
1505185836;1;256;32;1;1;4;801204608
1505185838;1;1;128;1;1;1;2081719055
1505185841;128;1;1;64;1;1;1358493604
1505185841;64;256;4;1;1;4;251925672
1505185843;1;256;4;1;2;1;1039093208
1505185847;16;1;1;16;1;1;3427491851
1505185848;2;1;128;2;1;1;502907793
1505185849;2;8;128;2;1;128;316526467
1505185870;2;1;1;2;1;1;20032593584
1505185871;1;1;128;1;1;128;537639626
1505185872;2;1;256;2;1;1;526273723
1505185893;2;1;1;2;1;1;20032319126
1505185894;2;1;128;2;1;128;209130878
1505185895;4;1;256;2;1;256;18446744073709551615
1505185896;64;1;2;2;1;2;679532417
1505185897;64;4;128;2;4;128;18446744073709551615
1505185897;128;1;128;4;1;128;18446744073709551615
1505185898;4;1;128;2;1;128;209728712
1505185900;2;128;1;2;32;1;1236478206
1505185901;2;2;128;1;1;128;229259834
1505185903;256;32;1;2;4;1;970692350
1505185904;2;1;256;1;1;128;271248462
1505185905;8;1;128;2;1;16;325504675
1505185907;256;1;128;2;1;1;1890664666
1505185908;2;1;128;2;1;16;214325667
1505185909;4;256;16;2;1;16;200030925
1505185911;128;1;256;1;1;1;1464122178
1505185914;128;64;8;8;4;2;2078583722
1505185915;2;1;256;1;1;8;238167589
1505185917;256;1;2;1;1;1;970196338
1505185919;64;64;4;4;4;1;2090986386
1505185921;1;256;1;1;128;1;1043822576
1505185922;256;256;1;1;2;1;440887012
1505185923;2;16;16;2;2;8;235449966
1505185927;64;1;1;1;1;1;3229692987
1505185930;64;1;32;8;1;2;2418259979
1505185932;16;2;128;2;1;8;1598025425
1505185935;64;1;2;4;1;1;1248009833
1505185935;16;256;32;16;256;1;18446744073709551615
1505185937;128;1;1;32;1;1;1350233008
1505185938;1;4;16;1;4;1;759711881
1505185940;256;1;1;1;1;1;872030800
1505185961;1;1;2;1;1;2;20375275833
1505185962;1;8;256;1;2;4;339554001
1505185965;64;2;16;16;2;8;2122863213
1505185967;1;1;32;1;1;32;1512683377
1505185969;64;8;16;1;1;2;755056669
1505185970;1;8;256;1;8;1;575604477
1505185971;256;1;4;2;1;4;359435553
1505185977;4;2;1;1;2;1;4901760004
1505185979;1;256;64;1;1;4;1474456193
1505185981;16;256;8;2;128;1;1289019197
1505185982;64;1;4;1;1;4;298295003
1505185982;128;256;1;16;256;1;18446744073709551615
1505185985;16;8;4;16;2;1;1719675132
1505185986;4;256;16;4;1;16;191391632
1505185987;32;1;256;1;1;16;381374504
1505185988;128;1;2;16;1;2;727804591
1505185991;2;1;8;1;1;8;2760888897
1505185995;256;64;256;1;1;1;3308465863
1505185997;1;64;4;1;4;1;1399232033
1505185999;1;1;64;1;1;64;1118788914
1505186001;256;256;1;1;2;1;442344335
1505186001;2;16;16;2;1;8;283213966
1505186002;64;32;16;1;2;16;207525962
1505186044;1;1;1;1;1;1;40694194778
1505186047;16;2;128;16;1;16;2909746280
1505186049;64;1;2;32;1;2;671809345
1505186051;16;256;32;16;1;1;1998553457
1505186052;2;1;256;2;1;2;236633381
1505186054;1;4;16;1;1;16;759369757
1505186057;32;1;1;8;1;1;2376179589
1505186067;1;4;1;1;4;1;9986842125
1505186069;1;1;256;1;1;1;1116258240
1505186072;64;8;4;4;1;1;2361349012
1505186074;1;2;32;1;1;32;766423108
1505186075;1;8;16;1;1;4;437061724
1505186076;1;8;16;1;8;16;689066675
1505186078;256;16;4;2;4;1;1119406238
1505186084;4;2;1;1;2;1;4898307921
1505186087;32;32;8;8;8;4;2529795738
1505186090;16;4;1;4;2;1;2113199501
1505186091;64;1;4;1;1;4;277711004
1505186093;4;2;256;2;2;1;1643787423
1505186096;16;64;1;16;1;1;2147590968
1505186097;1;256;16;1;1;16;198503837
1505186099;128;1;256;2;1;2;1199267492
1505186100;128;1;8;2;1;2;1064026846
1505186102;2;1;32;1;1;8;732923923
1505186107;4;1;2;1;1;2;4930383542
1505186109;1;64;4;1;2;1;1167292132
1505186151;1;1;1;1;1;1;40693849695
1505186152;16;4;4;1;2;2;1223890541
1505186153;8;16;16;2;2;8;224850294
1505186154;64;32;16;1;2;4;319533179
1505186156;64;1;2;1;1;2;834267785
1505186158;16;1;128;1;1;1;1594046644
1505186179;1;1;2;1;1;2;20374540167
1505186183;16;1;1;16;1;1;3454859015
1505186185;16;1;128;1;1;2;691645093
1505186189;1;4;16;1;1;1;3387297523
1505186191;1;128;1;1;1;1;1640329518
1505186202;1;4;1;1;4;1;9987217041
1505186204;1;1;256;1;1;1;1113690273
1505186205;64;64;16;1;1;8;322164300
1505186207;1;128;32;1;1;1;1494617168
1505186208;64;8;16;1;4;4;312841629
1505186249;1;1;1;1;1;1;40693832403
1505186251;32;64;4;2;4;4;1704841264
1505186262;4;1;1;1;1;1;9832644736
1505186263;1;256;128;1;1;4;481081308
1505186264;16;256;128;2;128;2;18446744073709551615
1505186265;64;256;64;1;1;4;930289104
1505186271;1;4;2;1;1;1;4977180375
1505186273;1;8;8;1;8;1;718403769
1505186276;4;32;8;4;8;1;2411544010
1505186277;128;1;256;2;1;16;322542585
1505186279;8;4;8;1;4;2;1325545249
1505186282;32;1;256;4;1;8;2629737317
1505186288;4;1;2;1;1;2;4932854750
1505186289;128;1;4;1;1;1;971622037
1505186291;1;128;1;1;2;1;1194920783
1505186292;128;256;1;1;2;1;501506918
1505186298;8;1;1;2;1;1;4921498593
1505186299;64;32;16;4;2;16;219982714
1505186300;64;1;32;1;1;2;776327570
1505186301;16;2;128;4;2;128;18446744073709551615
1505186322;1;1;2;1;1;2;20374915390
1505186323;16;1;32;8;1;32;767472238
1505186325;2;1;256;2;1;32;235781542
1505186328;1;1;16;1;1;1;3229292907
1505186331;256;1;1;128;1;1;1859103690
1505186341;1;4;1;1;1;1;9968798207
1505186343;1;8;256;1;8;4;572439894
1505186345;64;2;1;1;1;1;1655034539
1505186347;1;128;4;1;1;4;785086422
1505186349;64;8;16;4;4;4;1910028625
1505186350;1;8;16;1;8;4;468868631
1505186356;1;2;4;1;1;4;5266549426
1505186377;1;2;1;1;2;1;20226557333
1505186378;1;256;8;1;1;4;303253043
1505186382;16;1;1;2;1;1;3419401934
1505186384;64;256;4;1;16;4;721839768
1505186386;1;4;16;1;2;1;1606651832
1505186407;1;1;2;1;1;1;20388572183
1505186410;4;256;8;4;1;1;2275977773
1505186412;128;1;64;2;1;16;796579438
1505186415;128;1;16;16;1;1;2462029346
1505186416;2;1;256;1;1;32;222844633
1505186421;4;1;2;1;1;1;4932919047
1505186423;128;1;2;1;1;1;872874353
1505186425;1;128;1;1;2;1;1214247289
1505186445;2;1;1;1;1;1;20036901334
1505186449;4;32;16;4;1;1;2832295722
1505186450;4;256;256;4;1;16;280355132
1505186452;4;256;1;4;1;1;1558817292
1505186453;2;2;32;1;1;32;373207626
1505186455;256;4;1;128;2;1;1469932241
1505186456;256;32;16;128;8;16;18446744073709551615
1505186457;64;128;1;8;128;1;18446744073709551615
1505186457;1;2;128;1;2;128;249386417
1505186458;128;256;16;1;1;16;232335377
1505186460;1;256;1;1;1;1;898219154
1505186460;4;256;16;4;8;16;18446744073709551615
1505186462;4;256;32;4;1;16;1381851208
1505186467;4;64;64;4;1;16;3654126057
1505186470;4;256;16;2;1;1;2099298479
1505186470;4;256;16;1;1;16;199856050
1505186472;64;1;2;32;1;2;687286044
1505186474;1;1;32;1;1;2;1514041873
1505186475;2;4;128;2;1;2;259112877
1505186476;1;2;256;1;1;32;241032383
1505186477;4;1;16;4;1;16;752887215
1505186480;4;256;4;4;1;2;1874796359
1505186481;4;1;256;1;1;16;333516375
1505186482;4;256;16;4;1;4;289934550
1505186482;4;64;16;4;1;16;210249627
1505186485;16;256;16;8;1;16;2075744125
1505186486;4;256;16;1;1;16;191155504
1505186490;4;4;1;4;1;1;3223173884
1505186491;4;32;16;1;1;16;217828792
1505186492;32;256;16;8;1;16;239193465
1505186493;4;256;32;1;2;4;554627439
1505186494;4;256;16;1;1;4;326622929
1505186495;4;256;16;1;4;16;200345716
1505186497;4;256;16;2;1;1;2115340727
1505186498;4;256;16;4;1;16;193997716
1505186502;64;32;64;8;1;16;2940725544
1505186503;2;256;16;2;1;16;197742964
1505186503;4;256;16;1;128;16;18446744073709551615
1505186505;4;1;16;1;1;16;739628773
1505186506;4;256;16;1;1;1;1181926007
1505186508;4;256;1;1;1;1;1209830778
1505186510;4;1;16;1;1;16;739836097
1505186511;64;256;16;8;1;16;1195666548
1505186513;4;64;2;1;1;1;1317844932
1505186514;4;256;16;1;1;8;229623674
1505186515;2;256;16;2;1;16;189285543
1505186516;4;64;16;4;1;16;213319796
1505186518;2;256;16;2;8;16;1877814000
1505186519;8;256;16;8;256;16;18446744073709551615
1505186521;2;1;16;2;1;8;1522191302
1505186522;2;256;16;2;1;4;276359049
1505186523;2;16;16;2;4;16;300561129
1505186524;2;256;16;2;1;8;235356426
1505186526;2;256;1;2;1;1;1151000479
1505186526;2;256;128;1;256;8;18446744073709551615
1505186529;2;256;16;2;4;16;1509471583
1505186531;2;256;8;2;1;1;1847300022
1505186532;2;256;16;2;1;16;203840712
1505186532;2;256;16;2;256;16;18446744073709551615
1505186533;2;128;16;2;2;16;211571341
1505186535;2;1;16;2;1;16;1522566169
1505186537;2;2;16;2;2;16;750785844
1505186538;2;256;16;2;2;16;196600423
1505186540;32;256;16;8;1;16;1513788811
1505186542;128;256;4;8;1;2;1324371303
1505186543;2;256;32;2;1;16;352360043
1505186545;2;32;4;2;8;2;1183297720
1505186545;2;256;16;2;64;16;18446744073709551615
1505186548;32;256;16;8;1;16;2181893243
1505186551;2;256;16;2;32;2;1942146981
1505186552;2;4;16;2;1;16;461557464
1505186553;2;256;16;1;1;16;215442340
1505186553;1;256;16;1;1;16;199694424
1505186557;2;128;16;2;2;1;2422960549
1505186558;16;4;16;8;1;16;399285174
1505186558;2;256;16;2;1;16;212413382
1505186561;8;256;16;8;1;16;1903143350
1505186562;2;256;16;1;1;16;200921799
1505186563;8;256;16;1;1;16;228490337
1505186565;256;2;16;8;2;16;1394353389
1505186566;2;256;64;2;1;8;474724018
1505186567;2;256;256;2;1;16;292979293
1505186568;2;256;16;1;1;16;204930753
1505186570;2;1;16;2;1;16;1522006997
1505186572;2;256;16;2;16;4;1884516583
1505186573;2;256;256;2;1;16;266373125
1505186576;16;256;16;8;1;16;2175626333
1505186578;2;256;16;2;4;16;1540254717
1505186579;2;256;16;1;1;16;205898084
1505186580;2;256;16;2;32;16;18446744073709551615
1505186583;8;256;8;8;2;1;2101450633
1505186585;64;256;16;8;1;16;1385691472
1505186585;2;64;16;2;64;16;18446744073709551615
1505186587;2;256;4;2;1;2;1165022271
1505186588;2;8;16;2;4;16;355292468
1505186589;128;256;16;64;1;16;18446744073709551615
1505186591;2;256;16;2;1;2;1428389369
1505186592;2;4;16;2;1;16;373586881
1505186593;2;32;16;2;1;16;272938053
1505186595;2;256;8;2;1;1;1877762776
1505186596;2;256;128;2;1;16;403380089
1505186597;1;256;16;1;64;16;18446744073709551615
1505186599;2;256;8;1;1;1;962802727
1505186600;2;256;1;2;2;1;1155599904
1505186601;2;64;16;2;4;8;302390928
1505186602;2;256;64;2;1;16;426739834
1505186603;1;32;16;1;8;16;276993546
1505186604;4;256;16;1;1;16;196910881
1505186607;2;256;16;2;16;2;2025832382
1505186608;256;256;16;2;1;16;230378587
1505186609;1;256;16;1;1;2;698154678
1505186610;2;1;64;2;1;16;536002555
1505186612;2;2;8;2;2;1;1352644791
1505186613;2;256;16;2;16;16;18446744073709551615
1505186616;2;256;16;2;1;1;2048845050
1505186618;2;256;32;2;4;16;1796638409
1505186621;2;256;16;2;2;2;1897758251
1505186622;2;2;16;2;2;8;750543250
1505186623;1;8;16;1;2;16;420812390
1505186624;2;256;16;1;1;16;205265840
1505186625;1;256;16;1;1;16;217736462
1505186626;1;256;16;1;1;16;202442419
1505186627;2;128;32;2;2;16;1296708341
1505186629;2;256;1;2;1;1;1141007762
1505186632;2;256;16;1;16;16;1937864541
1505186633;2;256;16;1;256;16;18446744073709551615
1505186635;2;1;16;1;1;16;1524989395
1505186637;2;256;8;2;1;1;1854314739
1505186639;4;256;8;1;1;1;1234267755
1505186640;4;256;16;1;1;8;234803796
1505186641;2;256;16;2;1;16;212551757
1505186642;256;1;16;128;1;16;18446744073709551615
1505186643;2;1;64;2;1;16;535460292
1505186643;2;256;4;2;256;2;18446744073709551615
1505186645;2;256;16;1;1;1;1146569423
1505186646;2;128;16;2;1;16;217853838
1505186647;2;256;8;2;256;1;18446744073709551615
1505186649;2;1;16;2;1;1;1520642522
1505186650;2;256;8;1;1;2;466327211
1505186651;2;256;16;2;128;16;18446744073709551615
1505186651;2;256;16;1;256;16;18446744073709551615
1505186652;2;128;16;2;2;16;216822625
1505186655;1;256;16;1;8;1;2380860459
1505186656;2;256;32;2;256;8;18446744073709551615
1505186658;1;256;16;1;1;1;1474879592
1505186661;2;256;16;2;1;1;2086464712
1505186663;2;64;16;2;4;16;1432414804
1505186666;2;1;8;2;1;1;2759458895
1505186669;64;256;16;16;1;16;1910418031
1505186672;256;256;16;8;1;1;2222110084
1505186676;1;1;16;1;1;16;3229684903
1505186677;4;256;4;1;1;2;593685963
1505186679;2;256;8;1;1;1;994037958
1505186679;4;256;16;2;1;16;190775966
1505186680;2;256;32;1;128;16;18446744073709551615
1505186681;2;1;32;2;1;16;732035154
1505186685;1;1;16;1;1;8;3228882744
1505186689;1;1;16;1;1;16;3234519240
1505186690;8;64;16;8;4;16;18446744073709551615
1505186692;128;1;16;8;1;16;1089613696
1505186694;2;16;16;1;16;16;1262353118
1505186694;1;128;16;1;2;16;209954924
1505186695;2;128;16;2;2;16;203449916
1505186696;4;256;16;2;1;16;190687506
1505186697;2;256;32;2;1;8;336428385
1505186698;2;256;16;1;1;8;235451961
1505186699;256;256;16;8;1;16;249563052
1505186700;4;128;16;1;2;16;188269545
1505186701;4;128;32;1;2;16;431291219
1505186702;4;1;16;2;1;16;754240510
1505186704;4;128;16;1;2;1;1243626533
1505186708;8;128;16;8;2;16;2755075125
1505186708;4;128;16;1;2;8;217888669
1505186709;4;128;16;2;2;16;188279589
1505186710;1;128;16;1;2;16;209671672
1505186714;4;128;64;2;2;16;3068405783
1505186717;4;64;16;4;4;16;2904104314
1505186718;4;128;16;1;2;4;305386468
1505186719;8;64;32;8;4;16;18446744073709551615
1505186720;2;128;16;1;1;16;211698501
1505186723;4;64;16;1;4;1;2603939208
1505186724;4;128;64;1;2;16;513365720
1505186725;4;128;16;4;1;16;203436050
1505186726;16;256;16;4;256;1;18446744073709551615
1505186727;2;64;16;1;4;16;219780050
1505186730;2;64;64;2;4;16;2897927858
1505186733;4;128;8;1;2;2;1943586643
1505186734;4;64;16;1;4;16;203710000
1505186736;4;128;32;1;2;1;1456002633
1505186737;2;128;16;1;2;4;278354335
1505186740;4;128;16;4;1;2;2605075091
1505186742;4;32;16;1;8;16;1753150792
1505186745;4;128;32;4;1;16;2193770206
1505186746;1;256;32;1;1;16;370984334
1505186747;4;128;16;1;2;16;188231419
1505186749;4;128;16;1;1;1;1244674533
1505186751;4;128;16;1;2;1;1222720236
1505186752;4;128;32;1;2;16;384800513
1505186753;4;128;16;2;2;16;188238127
1505186754;2;128;64;1;2;64;310724045
1505186755;4;128;32;1;1;16;399472840
1505186755;4;128;16;1;2;8;226571254
1505186758;4;128;32;4;2;16;2259101251
1505186759;16;128;16;2;2;16;206725838
1505186760;4;128;16;1;1;8;248925969
1505186761;4;128;16;1;128;8;18446744073709551615
1505186762;4;128;16;4;2;16;313551549
1505186765;8;256;16;4;1;1;2240213175
1505186765;4;128;16;1;1;16;220314128
1505186769;8;128;8;4;1;1;2568811213
1505186771;2;128;16;2;1;1;2251488844
1505186774;4;64;8;1;4;1;2323345428
1505186775;8;128;32;4;128;16;18446744073709551615
1505186777;4;128;32;2;2;8;921714658
1505186777;1;128;16;1;2;16;212061133
1505186778;1;128;16;1;2;16;209937837
1505186779;4;64;16;1;2;16;188073084
1505186780;4;64;16;1;4;16;194872958
1505186782;4;64;8;2;4;8;1556874468
1505186783;4;64;16;2;2;16;210783882
1505186784;4;64;16;4;2;8;357840179
1505186788;4;32;16;4;8;2;2852713983
1505186790;4;32;8;1;4;1;2240919835
1505186791;2;128;16;1;128;16;18446744073709551615
1505186795;4;64;16;4;2;1;2917094611
1505186795;4;64;16;1;2;8;231770667
1505186797;4;64;16;1;1;1;1318799521
1505186798;4;128;16;4;1;16;207933128
1505186799;4;64;16;1;1;16;224966550
1505186800;2;64;16;1;4;16;195243925
1505186801;2;128;16;1;1;16;203013590
1505186802;8;64;16;4;2;8;240779630
1505186803;4;64;16;4;1;16;219032502
1505186805;4;64;4;1;2;2;1843378535
1505186809;8;16;16;4;8;4;2835705729
1505186809;16;64;16;1;2;16;207044334
1505186810;2;64;16;1;2;16;223670923
1505186811;4;64;16;4;2;16;236151668
1505186813;4;16;16;1;8;16;1062372531
1505186813;8;64;16;4;64;8;18446744073709551615
1505186814;2;64;32;1;2;16;337916012
1505186815;4;64;16;1;64;16;18446744073709551615
1505186816;4;32;16;1;2;16;220995839
1505186817;4;64;64;1;2;64;330738500
1505186820;4;128;8;1;128;1;2382605666
1505186821;4;64;16;4;2;16;207093884
1505186822;16;64;16;2;2;16;206208460
1505186824;8;16;2;8;4;1;1309651744
1505186825;4;64;8;1;2;1;1145513422
1505186828;4;64;8;2;2;1;2246734979
1505186829;8;64;16;4;1;16;240122713
1505186830;1;64;16;1;2;16;209754467
1505186833;4;32;4;1;2;2;1738101667
1505186833;4;64;16;1;2;4;327357504
1505186834;4;64;16;1;4;8;249715718
1505186835;4;64;16;2;1;16;212415172
1505186837;4;64;32;2;2;8;1367091645
1505186840;4;64;4;2;2;2;1859806964
1505186841;4;8;16;1;1;16;220575217
1505186844;4;64;16;4;4;16;2892722699
1505186845;4;256;16;1;1;16;190986044
1505186846;4;128;16;4;1;8;215858381
1505186848;4;64;16;1;2;1;1336534652
1505186849;4;64;64;1;2;16;556323555
1505186850;8;64;16;4;2;16;209997294
1505186853;4;32;64;1;4;16;2243682914
1505186855;8;128;4;2;1;2;1262220812
1505186856;4;128;32;2;1;16;415794126
1505186858;2;64;8;1;2;1;1145431346
1505186859;4;128;16;1;1;4;335423959
1505186861;16;32;16;2;4;16;1307138698
1505186863;2;64;16;1;2;1;1273175754
1505186863;2;64;16;2;2;16;220513835
1505186864;4;128;16;1;1;16;219582338
1505186865;4;64;8;1;64;8;18446744073709551615
1505186867;1;64;16;1;2;1;1501990771
1505186868;2;64;16;1;2;8;226391133
1505186874;8;1;1;1;1;1;5079469660
1505186878;1;16;1;1;4;1;3306787208
1505186880;1;8;256;1;2;1;952825173
1505186880;64;4;16;1;1;8;280480464
1505186882;1;128;2;1;2;2;673621858
1505186883;64;8;16;1;4;4;300785834
1505186885;4;128;1;4;2;1;1440440750
1505186887;256;1;4;2;1;1;1409896837
1505186888;4;2;128;1;2;4;518160760
1505186890;16;8;1;8;2;1;1211028673
1505186891;16;256;1;8;128;1;18446744073709551615
1505186892;64;4;4;1;4;4;791970104
1505186898;1;4;2;1;1;1;4954977502
1505186900;1;2;16;1;2;16;1566449917
1505186902;4;256;1;4;64;1;1588797552
1505186904;128;256;64;16;1;16;1239001220
1505186906;128;1;8;1;1;2;692274048
1505186907;2;1;256;1;1;32;281418546
1505186917;4;1;1;1;1;1;9836338882
1505186938;1;1;2;1;1;1;20388760766
1505186959;1;2;1;1;2;1;20227864968
1505186961;256;256;1;1;1;1;731924644
1505186962;8;16;16;1;1;8;248367093
1505186963;64;1;16;1;1;16;225931379
1505186965;64;1;32;2;1;2;1485140654
1505186966;1;2;128;1;1;16;220644177
1505186987;1;1;2;1;1;1;20388660058
1505186989;32;1;32;8;1;32;1425371677
1505186990;4;64;16;1;1;8;248920292
1505186991;2;1;256;2;1;2;231545420
1505186992;1;256;256;1;256;8;18446744073709551615
1505186997;8;1;1;1;1;1;5106412079
1505186999;1;128;1;1;4;1;1166426084
1505187000;1;8;256;1;2;8;374572339
1505187001;64;2;8;1;1;8;215838752
1505187002;128;128;32;2;1;32;229333674
1505187005;64;8;16;1;4;1;2179681890
1505187006;4;32;16;1;4;8;295576335
1505187007;1;8;16;1;4;16;464809084
1505187008;1;2;128;1;1;32;220854586
1505187009;4;1;128;1;1;4;326436419
1505187010;1;256;8;1;2;4;236750625
1505187011;8;32;16;8;4;16;18446744073709551615
1505187011;4;256;32;1;256;16;18446744073709551615
1505187012;4;64;8;1;2;8;224413593
1505187014;16;256;16;2;1;2;989926418
1505187015;64;256;4;1;1;4;252599462
1505187017;128;4;2;8;1;2;1746983686
1505187021;1;8;8;1;1;1;2990725041
1505187021;2;256;16;1;256;16;18446744073709551615
1505187025;8;64;32;4;2;16;2523866875
1505187026;4;8;16;1;2;16;265079632
1505187028;4;256;1;4;1;1;1564865963
1505187029;128;2;256;2;1;16;332209460
1505187031;64;1;8;2;1;1;1336913681
1505187033;2;256;1;2;1;1;1149071679
1505187036;2;128;8;1;128;1;2332091972
1505187037;2;32;16;1;4;16;202298542
1505187037;1;64;16;1;1;8;277350087
1505187041;8;32;16;4;4;16;2773873420
1505187047;4;1;2;1;1;2;4932783247
1505187048;128;128;256;1;64;1;837458597
1505187054;8;1;1;1;1;1;5028338461
1505187055;256;256;16;1;2;2;652950715
1505187058;2;64;64;2;2;16;2300664808
1505187061;4;64;8;4;2;2;2625109651
1505187064;4;128;16;2;1;1;2340604724
1505187065;2;64;16;1;1;16;226823000
1505187066;4;256;16;4;256;16;18446744073709551615
1505187069;8;64;64;4;2;16;2840945556
1505187070;4;64;64;1;2;32;278680460
1505187071;8;128;16;4;1;16;235530382
1505187073;8;16;1;2;2;1;1240135165
1505187074;64;1;16;32;1;16;18446744073709551615
1505187076;64;1;16;2;1;2;1439921529
1505187097;1;2;1;1;1;1;20228938301
1505187097;4;256;16;1;256;8;18446744073709551615
1505187101;8;64;16;4;4;16;2844926917
1505187105;64;1;1;1;1;1;3300980995
1505187106;16;1;32;2;1;32;279383216
1505187109;128;1;64;32;1;2;2870191161
1505187110;1;2;256;1;2;4;233441049
1505187111;4;256;16;1;256;16;18446744073709551615
1505187114;8;32;8;4;4;1;2632049177
1505187115;4;64;16;2;2;16;188202168
1505187116;4;128;16;1;128;16;18446744073709551615
1505187127;4;1;1;1;1;1;9949672496
1505187129;1;128;8;1;4;1;2048006445
1505187131;1;8;256;1;4;4;642528833
1505187131;64;8;8;1;1;8;222152129
1505187132;16;64;16;16;2;16;18446744073709551615
1505187135;4;64;32;1;4;16;1931667559
1505187137;2;32;4;1;4;2;1374280152
1505187140;4;64;16;4;1;1;2897755983
1505187143;1;128;1;1;1;1;1616729714
1505187144;64;1;16;1;1;8;262336175
1505187146;1;2;16;1;2;16;1564469144
1505187147;1;2;32;1;1;32;762352764
1505187148;4;32;16;1;4;16;223585839
1505187151;4;64;4;1;4;2;1936072347
1505187152;1;64;256;1;2;16;403121967
1505187154;4;64;1;1;2;1;1108616989
1505187155;4;64;16;1;2;4;291687254
1505187156;4;64;64;1;1;16;572730803
1505187157;4;4;64;1;4;16;349886506
1505187158;4;64;16;4;2;16;203151086
1505187158;4;64;16;1;4;16;212822793
1505187161;4;64;32;1;2;1;1476511450
1505187163;4;64;16;1;2;1;1331358430
1505187165;4;64;16;2;4;16;1546208102
1505187167;16;4;16;4;4;16;1820364924
1505187170;4;64;16;2;2;2;2344019834
1505187171;4;64;16;1;1;16;215734669
1505187172;4;8;16;1;1;16;222567713
1505187173;4;16;16;1;8;16;759315264
1505187177;4;1;8;1;1;1;3302848334
1505187178;4;64;16;1;2;16;218323089
1505187179;4;64;16;1;2;8;220116377
1505187180;4;4;16;1;1;16;234531920
1505187183;4;64;16;1;16;1;2684759142
1505187184;4;2;16;1;1;16;377724098
1505187185;4;64;16;1;2;16;188346042
1505187186;4;64;32;1;2;16;428901262
1505187187;64;64;16;64;2;16;18446744073709551615
1505187188;2;2;16;1;1;16;751969562
1505187189;4;16;16;1;2;16;226597673
1505187192;4;64;16;1;8;16;2237691839
1505187193;4;64;256;1;2;16;266231465
1505187194;1;64;16;1;2;16;270177630
1505187195;32;128;16;1;1;16;247610379
1505187196;4;64;128;1;2;16;537526462
1505187197;4;4;16;2;4;16;310020502
1505187198;2;64;16;1;64;16;18446744073709551615
1505187201;2;32;16;1;4;2;2313820976
1505187202;4;128;64;1;1;16;475915930
1505187203;4;1;16;1;1;4;737484563
1505187205;4;256;8;2;8;4;1572532292
1505187207;4;64;1;1;2;1;1102887018
1505187211;32;64;16;32;2;1;2784986991
1505187214;256;64;16;64;2;1;2398368099
1505187215;4;1;16;1;1;16;739279674
1505187218;2;64;16;1;2;2;2327467040
1505187221;4;64;16;1;16;16;2357614021
1505187222;32;64;16;1;2;16;206087878
1505187223;16;256;1;16;256;1;18446744073709551615
1505187224;64;256;1;1;1;1;794269068
1505187230;1;4;2;1;1;2;4947021333
1505187236;1;1;8;1;1;1;5748581428
epoch;GLOBAL_SIZE_0;GLOBAL_SIZE_1;GLOBAL_SIZE_2;LOCAL_SIZE_0;LOCAL_SIZE_1;LOCAL_SIZE_2;cost
1505187260;128;256;256;2;8;32;18446744073709551615
1505187261;128;1;64;1;1;2;490623017
1505187262;32;64;256;8;2;2;194013043
1505187263;64;32;1;16;4;1;337799087
1505187264;32;8;256;8;1;2;197516090
1505187265;32;64;256;8;2;16;233331632
1505187266;8;32;4;4;32;2;290275804
1505187266;16;256;1;8;128;1;18446744073709551615
1505187267;32;32;256;8;4;2;202092547
1505187268;64;64;1;4;2;1;291180672
1505187269;64;64;256;4;2;1;210366544
1505187271;1;1;256;1;1;4;1785813702
1505187272;32;64;256;8;4;2;200082675
1505187273;256;8;16;256;2;2;18446744073709551615
1505187274;16;8;16;8;2;8;227206669
1505187274;32;64;128;8;4;2;221602672
1505187275;32;64;32;8;2;2;197652042
1505187276;32;64;256;8;8;2;218424507
1505187277;64;32;128;16;8;8;18446744073709551615
1505187298;2;1;1;2;1;1;20377838265
1505187299;4;4;128;4;1;32;262785506
1505187302;64;128;1;1;16;1;2455729402
1505187303;32;64;256;4;2;2;194282048
1505187303;32;64;256;8;2;1;200011375
1505187304;16;64;256;16;2;2;191540800
1505187305;32;128;128;8;1;8;223921963
1505187306;16;64;128;16;1;2;192645377
1505187307;16;64;128;16;2;2;192599423
1505187308;8;64;128;2;2;4;268231842
1505187308;16;64;64;16;2;8;200122375
1505187309;16;32;256;16;4;2;197276916
1505187310;16;64;256;16;2;1;205684960
1505187311;16;128;256;16;128;2;18446744073709551615
1505187311;16;8;256;16;1;2;199030132
1505187313;64;8;2;64;1;2;258104128
1505187313;16;128;32;8;1;2;194223127
1505187314;32;64;128;8;2;2;195048837
1505187315;8;64;256;2;2;2;167934087
1505187316;16;128;256;16;1;2;191704712
1505187317;8;64;128;2;1;2;177743798
1505187317;8;64;256;2;2;1;176554629
1505187319;4;32;256;1;4;2;702837733
1505187319;8;128;256;2;1;4;165349084
1505187320;8;64;256;2;2;4;193867920
1505187321;8;64;256;2;4;2;236311050
1505187322;8;128;256;2;128;4;18446744073709551615
1505187323;4;256;256;1;1;2;319719005
1505187324;8;128;128;2;2;2;168891335
1505187325;4;32;128;1;4;4;902856834
1505187326;8;128;1;2;1;1;390666137
1505187327;8;256;256;2;256;4;18446744073709551615
1505187327;8;128;256;2;1;2;170149839
1505187328;8;128;256;1;1;4;165830292
1505187329;8;128;256;2;2;4;164824416
1505187330;4;1;256;1;1;4;495997931
1505187331;8;256;256;2;1;4;165881506
1505187332;8;256;256;1;1;4;168399709
1505187333;8;128;1;2;2;1;193673710
1505187334;16;128;256;16;2;4;183107417
1505187334;8;128;128;2;2;4;192521548
1505187335;8;32;256;2;8;1;368053928
1505187336;8;128;256;2;2;8;210100128
1505187338;4;128;1;2;2;1;839264350
1505187338;16;128;256;16;2;8;189452340
1505187340;8;64;256;1;4;4;686726101
1505187341;8;128;256;1;2;4;313891715
1505187343;1;128;1;1;2;1;1203538125
1505187343;32;128;256;8;1;4;197563590
1505187344;8;256;128;2;1;4;166927340
1505187345;4;128;256;1;2;4;450488384
1505187347;4;128;256;1;2;16;551396062
1505187347;8;128;256;1;2;2;168334460
1505187348;4;128;128;4;2;4;174078629
1505187349;8;128;256;2;2;2;168156043
1505187350;8;64;256;2;4;4;256462251
1505187351;8;128;1;8;2;1;207691377
1505187351;4;128;256;1;128;4;18446744073709551615
1505187353;4;64;256;1;4;4;659810428
1505187354;32;64;64;8;4;4;275760218
1505187354;4;128;256;4;2;4;167593548
1505187355;8;128;64;2;2;4;261839839
1505187356;8;128;256;1;1;2;343652545
1505187357;8;128;1;2;2;1;194997918
1505187359;8;128;128;1;128;2;885289191
1505187360;8;64;128;2;4;4;303474168
1505187360;16;128;256;8;2;4;183968673
1505187361;8;32;256;2;8;4;329947340
1505187362;8;128;256;2;2;1;176369420
1505187364;8;256;1;1;1;1;718180527
1505187364;8;64;256;2;64;4;18446744073709551615
1505187367;4;64;16;1;4;4;1663135125
1505187370;8;256;1;1;256;1;2152786426
1505187370;8;64;256;2;4;1;177752379
1505187371;2;128;256;2;2;4;199936175
1505187372;8;128;128;1;2;4;534890936
1505187373;2;128;256;1;1;4;276460629
1505187374;32;64;128;8;4;4;242126592
1505187375;64;128;64;4;2;4;227767050
1505187376;8;128;1;2;2;1;194616003
1505187377;16;32;16;8;2;1;217754795
1505187378;8;256;256;2;1;1;351477634
1505187379;8;256;64;2;1;4;195696713
1505187380;4;256;64;1;1;4;277475669
1505187381;8;64;1;2;1;1;395781460
1505187381;16;128;64;16;2;4;184960340
1505187383;128;1;1;64;1;1;430736918
1505187385;4;256;1;1;64;1;1468279174
1505187387;1;1;64;1;1;16;2058344316
1505187390;1;1;256;1;1;4;1790270923
1505187391;8;64;128;2;4;16;369417175
1505187392;2;128;128;2;2;4;225753962
1505187393;8;128;1;1;1;1;729519606
1505187394;64;8;128;32;2;4;300999463
1505187395;16;64;256;16;4;4;188087505
1505187397;8;128;32;1;2;8;1165575244
1505187398;16;256;256;16;1;4;188466584
1505187402;16;1;1;16;1;1;3214268173
1505187403;8;4;256;2;1;4;388609338
1505187404;8;4;256;1;1;4;251589800
1505187405;8;128;64;1;32;4;996154001
1505187406;8;64;256;2;1;4;167744253
1505187407;16;128;128;4;2;4;186786837
1505187408;32;4;8;2;2;4;752367886
1505187410;1;16;256;1;1;8;933627889
1505187411;128;16;32;16;1;1;261183635
1505187411;64;16;2;32;8;2;18446744073709551615
1505187453;1;1;1;1;1;1;40719098959
1505187454;8;64;1;2;4;1;248538626
1505187455;4;128;128;1;1;8;657642059
1505187456;128;4;64;64;4;8;18446744073709551615
1505187457;8;128;256;4;2;4;165320586
1505187457;8;32;256;2;8;128;18446744073709551615
1505187459;8;32;256;1;8;4;880674265
1505187460;32;128;256;4;2;2;195663549
1505187461;4;256;256;1;1;8;372125761
1505187461;16;64;256;16;4;8;18446744073709551615
1505187503;1;1;1;1;1;1;40719292488
1505187505;32;1;1;8;1;1;1504553207
1505187506;64;128;256;4;32;16;18446744073709551615
1505187508;1;1;256;1;1;8;1791446884
1505187511;16;16;16;2;16;4;1981143835
1505187511;32;16;8;32;8;8;18446744073709551615
1505187512;16;32;8;8;1;8;232086505
1505187513;32;16;64;16;2;16;18446744073709551615
1505187514;8;128;256;8;2;4;169258258
1505187515;8;32;128;2;8;8;434580256
1505187516;16;128;256;16;2;2;191227919
1505187517;2;128;1;2;2;1;668197903
1505187518;64;128;256;4;2;4;203590298
1505187519;8;128;256;1;2;32;647875047
1505187520;8;256;256;2;1;4;166185376
1505187521;8;32;128;2;8;4;368379427
1505187522;16;64;32;1;2;1;423162386
1505187524;64;64;32;1;1;1;1006379293
1505187524;32;64;32;16;1;1;204724339
1505187525;64;256;128;8;128;4;18446744073709551615
1505187526;2;256;256;2;1;4;196122174
1505187527;32;16;16;32;4;16;18446744073709551615
1505187527;128;8;64;32;1;16;18446744073709551615
1505187530;8;128;1;2;128;1;1955728505
1505187531;8;128;256;2;2;16;226354589
1505187532;32;128;256;8;2;4;197767213
1505187533;8;128;32;2;2;4;304733043
1505187534;2;64;1;1;32;1;700252434
1505187535;8;128;256;2;8;4;246152631
1505187536;4;32;256;1;8;2;764747517
1505187537;8;128;256;4;128;4;18446744073709551615
1505187538;8;32;4;8;1;2;232675341
1505187539;2;128;256;1;128;8;18446744073709551615
1505187541;4;32;2;1;8;1;1409139024
1505187541;16;8;256;8;8;32;18446744073709551615
1505187542;4;16;16;4;16;16;18446744073709551615
1505187543;8;128;256;2;4;16;241775716
1505187544;8;128;32;2;2;4;316258637
1505187545;8;128;256;2;2;4;168606340
1505187546;8;16;16;8;1;16;227332466
1505187548;4;16;1;2;2;1;1509988336
1505187550;1;64;64;1;4;64;1208508647
1505187551;256;1;128;32;1;2;292843719
1505187552;2;2;32;2;2;8;615574897
1505187553;1;128;256;1;8;1;558664186
1505187554;8;16;4;1;2;2;258129719
1505187555;4;128;256;1;2;2;192297625
1505187556;4;128;256;1;2;8;529064019
1505187557;16;128;256;16;1;1;200122133
1505187558;8;32;256;2;4;4;301179000
1505187559;8;64;256;2;4;8;260452339
1505187560;8;1;256;2;1;4;425104879
1505187561;8;128;128;1;2;2;172075877
1505187562;8;128;128;2;1;2;173663629
1505187563;4;128;256;1;1;8;512116506
1505187564;8;64;256;8;4;4;173810797
1505187565;8;256;1;2;1;1;380268212
1505187566;32;128;128;8;2;4;203306627
1505187567;8;128;256;2;1;8;232750712
1505187568;8;256;256;2;1;16;222871757
1505187569;16;128;1;16;2;1;209594542
1505187570;4;128;256;1;1;4;200010509
1505187571;4;64;256;1;4;8;656919020
1505187572;8;128;1;1;2;1;370357424
1505187573;8;256;256;2;1;2;173114129
1505187574;4;128;1;1;2;1;349629001
1505187575;2;128;256;2;2;2;200209591
1505187575;16;64;256;8;2;4;188056758
1505187576;4;128;256;2;2;2;169257503
1505187577;16;128;256;4;2;16;217979089
1505187579;4;64;1;1;4;1;1220027676
1505187581;4;32;256;1;8;4;756750669
1505187582;8;1;256;2;1;2;196746460
1505187583;8;128;256;1;2;1;349715925
1505187583;8;128;32;2;2;2;172656629
1505187584;4;128;256;2;128;2;18446744073709551615
1505187587;8;256;1;1;128;1;1900988458
1505187587;8;128;256;1;128;4;18446744073709551615
1505187588;8;256;64;2;1;8;297250134
1505187589;8;1;256;2;1;4;393457041
1505187591;8;128;128;1;1;4;173044625
1505187592;8;1;256;1;1;4;215802546
1505187593;16;256;256;16;1;2;193517754
1505187593;8;128;1;8;2;1;206160335
1505187594;4;128;128;1;1;4;287513752
1505187595;4;64;256;1;4;1;226168676
1505187596;8;256;1;2;1;1;381266629
1505187597;8;1;256;8;1;2;206306256
1505187598;4;64;256;1;4;2;601266184
1505187599;8;32;128;2;4;2;349022382
1505187600;8;1;64;2;1;4;223489752
1505187601;8;128;128;2;1;4;186146837
1505187602;4;128;256;2;2;4;201573583
1505187603;16;128;128;16;2;2;192148041
1505187604;8;128;1;2;1;1;391717636
1505187606;8;128;64;1;2;16;1079065997
1505187607;16;128;1;16;1;1;225622336
1505187608;16;64;256;16;2;4;183000834
1505187608;8;256;256;1;256;4;18446744073709551615
1505187609;8;64;1;2;2;1;201053213
1505187610;16;256;256;16;128;2;18446744073709551615
1505187611;32;128;256;4;2;4;197797798
1505187612;32;64;256;8;4;4;217549965
1505187613;16;128;256;16;1;4;190373168
1505187613;4;256;256;1;1;4;176992129
1505187614;32;256;256;8;1;4;196646335
1505187615;16;128;256;8;1;2;191427417
1505187616;8;128;128;2;2;8;244700502
1505187617;8;64;64;2;4;4;358494472
1505187618;16;128;256;8;2;8;190654170
1505187619;4;128;64;1;2;4;721863377
1505187620;16;128;128;16;2;4;184557421
1505187621;8;128;1;2;2;1;233492210
1505187622;8;256;256;2;1;8;179480839
1505187623;16;64;256;16;4;2;192617380
1505187624;16;128;256;4;2;4;183635462
1505187625;8;64;1;4;4;1;208883083
1505187631;8;1;1;2;1;1;5746883511
1505187632;16;64;128;8;2;4;190614084
1505187634;8;64;256;1;1;2;347919297
1505187635;8;128;64;2;2;8;291360259
1505187636;8;128;128;2;2;16;250791136
1505187636;16;64;1;16;4;1;222385843
1505187638;4;64;128;1;4;4;788254529
1505187639;4;1;256;1;1;4;851152804
1505187640;16;1;256;16;1;1;228339255
1505187641;2;256;256;2;64;4;18446744073709551615
1505187642;128;128;256;2;2;4;211577380
1505187643;256;128;256;1;2;8;266521631
1505187644;8;128;256;2;2;256;18446744073709551615
1505187645;8;16;256;2;16;4;367469137
1505187646;16;128;128;16;1;4;193001212
1505187647;8;128;64;2;1;4;193255710
1505187649;4;16;8;4;4;4;1691741439
1505187652;1;64;1;1;2;1;2320797970
1505187655;32;64;1;1;64;1;2514574643
1505187658;16;4;1;1;2;1;1569112000
1505187658;8;16;8;8;16;2;183422209
1505187659;32;128;1;4;2;1;195875711
1505187662;2;16;2;1;4;2;1482646184
1505187662;4;256;256;4;256;4;18446744073709551615
1505187663;8;128;256;2;64;4;18446744073709551615
1505187664;8;2;256;2;2;4;390236126
1505187665;1;128;256;1;128;4;18446744073709551615
1505187667;4;16;4;4;2;1;1327142249
1505187668;32;16;32;32;2;1;202698585
1505187671;2;128;8;1;1;8;2036004259
1505187673;2;32;1;1;4;1;1461017102
1505187674;64;32;1;4;8;1;536511295
1505187695;2;1;1;2;1;1;20378109667
1505187698;64;16;32;2;2;16;1834715056
1505187699;16;16;8;16;2;1;226675920
1505187700;8;1;256;2;1;128;847367343
1505187701;8;8;256;2;1;4;360221636
1505187702;8;128;256;2;32;4;261534543
1505187703;256;128;256;1;2;1;484409389
1505187704;64;4;32;8;1;16;468364850
1505187705;16;32;8;8;1;1;226055462
1505187706;4;128;1;1;2;1;350153335
1505187708;4;4;128;2;1;32;717449884
1505187711;64;256;1;1;16;1;2124746979
1505187712;1;256;1;1;64;1;1095835357
1505187714;1;256;64;1;16;16;659356211
1505187715;16;4;64;8;1;64;18446744073709551615
1505187715;8;64;256;2;1;2;174055418
1505187717;8;64;128;1;4;4;834282751
1505187718;16;32;16;8;1;16;288077256
1505187718;8;256;256;2;256;4;18446744073709551615
1505187719;8;1;64;2;1;4;264943132
1505187722;1;1;256;1;1;4;1796216475
1505187723;16;16;16;16;1;2;201193668
1505187724;16;32;16;8;1;1;223283257
1505187724;16;32;8;8;32;2;18446744073709551615
1505187725;16;16;8;16;1;2;206532005
1505187727;8;128;2;2;8;1;1495421187
1505187728;64;128;128;4;2;4;214023086
1505187729;8;1;256;2;1;64;612685691
1505187733;1;16;1;1;1;1;3256010187
1505187734;128;2;1;16;2;1;218176381
1505187735;64;16;32;32;8;2;18446744073709551615
1505187776;1;1;1;1;1;1;40719124905
1505187777;8;16;16;8;1;1;206001085
1505187779;32;1;1;8;1;1;1505013063
1505187780;16;32;8;8;32;1;255506300
1505187781;64;64;256;4;32;4;18446744073709551615
1505187782;16;4;8;8;4;2;357833381
1505187783;64;128;256;1;2;4;204150666
1505187784;8;16;2;2;16;1;342572094
1505187786;8;128;4;2;2;4;1405330231
1505187787;16;8;8;8;2;2;255648876
1505187789;1;2;256;1;2;1;594148438
1505187791;16;64;32;1;64;2;1562625925
1505187793;64;64;32;1;64;1;1990029210
1505187794;32;64;1;32;1;1;205338461
1505187795;16;64;8;8;32;2;18446744073709551615
1505187796;8;128;256;2;2;32;250484593
1505187797;8;128;256;2;4;4;217161300
1505187798;16;16;8;8;1;2;206377504
1505187799;128;128;256;16;2;4;210004710
1505187799;8;128;256;2;2;64;324087717
1505187801;16;4;8;8;4;8;263231671
1505187801;8;256;128;1;256;4;18446744073709551615
1505187802;32;128;256;8;2;8;203981132
1505187803;16;32;16;8;32;1;258355341
1505187804;64;256;1;8;16;1;381256460
1505187805;2;128;256;2;128;8;18446744073709551615
1505187806;4;1;64;1;1;16;602053085
1505187808;16;4;2;8;4;2;559279458
1505187812;16;1;1;16;1;1;3222325805
1505187814;1;1;64;1;1;64;2076850362
1505187815;256;1;64;32;1;2;308804757
1505187817;8;1;32;2;1;4;207178751
1505187818;1;128;128;1;2;8;610227857
1505187819;128;1;256;2;1;4;415380753
1505187820;8;128;256;8;2;8;167008417
1505187821;8;8;256;2;2;4;316646677
1505187832;2;2;1;2;2;1;10166799048
1505187832;8;128;256;8;8;1;179348048
1505187835;1;64;1;1;4;1;2015889376
1505187836;16;64;1;16;32;1;18446744073709551615
1505187837;8;128;1;2;2;1;210306752
1505187838;8;1;256;2;1;8;541921673
1505187840;16;4;1;1;2;1;1570123393
1505187843;2;128;8;1;1;8;2028779584
1505187844;64;32;1;8;8;1;402294891
1505187845;8;128;256;1;2;32;643922964
1505187846;8;128;256;2;128;4;18446744073709551615
1505187847;8;128;1;4;2;1;230863922
1505187848;1;128;256;1;2;4;505142224
1505187849;8;128;256;2;4;128;18446744073709551615
1505187851;8;128;8;1;2;4;1554607634
1505187852;8;128;256;2;1;1;350044970
1505187853;8;4;256;8;1;1;194704757
1505187854;8;1;256;1;1;4;207295425
1505187855;8;128;256;2;16;4;264731052
1505187855;8;128;256;2;2;4;164857756
1505187856;8;128;256;1;2;4;281838293
1505187858;8;128;8;2;2;4;1327391635
1505187859;8;128;256;4;2;4;165538959
1505187860;8;1;256;2;1;16;499528501
1505187861;8;128;1;2;2;1;246789917
1505187863;1;2;256;1;2;4;1118709596
1505187864;64;2;256;4;2;4;301033918
1505187865;8;128;256;1;128;4;18446744073709551615
1505187866;8;128;256;1;2;1;349542718
1505187867;8;1;256;2;1;4;437161884
1505187868;64;128;128;4;2;16;287075048
1505187869;8;128;256;2;2;4;167237255
1505187870;1;128;256;1;2;4;503889480
1505187871;16;128;8;16;2;4;185401631
1505187871;8;128;256;2;32;2;263192882
1505187873;8;128;16;2;2;4;833678923
1505187874;8;8;256;4;2;4;203331505
1505187876;1;64;256;1;1;256;1719330191
1505187877;256;128;256;8;2;4;243027833
1505187878;8;256;256;8;1;4;169213085
1505187879;2;4;256;2;1;4;496212393
1505187880;1;2;256;1;2;256;18446744073709551615
1505187881;8;128;256;8;2;4;169672292
1505187881;8;128;256;2;2;128;18446744073709551615
1505187883;256;16;256;1;16;4;700063387
1505187884;8;8;1;2;2;1;771734212
1505187885;16;32;256;16;8;4;18446744073709551615
1505187886;8;128;2;2;2;1;192466168
1505187886;8;128;1;4;2;1;228250591
1505187888;8;2;256;1;2;4;1028334248
1505187889;128;128;256;2;2;1;225453921
1505187890;8;128;32;2;2;8;346854426
1505187891;8;16;256;2;16;128;18446744073709551615
1505187892;64;1;2;4;1;2;514263587
1505187894;2;1;32;1;1;8;1369782053
1505187896;4;4;64;4;1;32;1218063071
1505187897;64;256;1;64;16;1;18446744073709551615
1505187897;8;128;256;4;2;32;192455840
1505187899;256;8;256;1;8;4;774997460
1505187903;1;32;1;1;1;1;3193505260
1505187904;1;256;64;1;1;16;766485606
1505187906;1;1;256;1;1;2;1125011099
1505187908;1;1;256;1;1;1;833692743
1505187909;8;128;32;2;1;4;370765263
1505187910;8;128;32;2;2;4;326892460
1505187911;128;1;32;16;1;1;272708087
1505187911;64;128;2;32;8;2;18446744073709551615
1505187917;1;8;1;1;8;1;5173122917
1505187921;32;1;1;1;1;1;3760430638
1505187923;1;128;2;1;2;1;1036246009
1505187924;16;128;256;16;32;4;18446744073709551615
1505187926;8;128;8;2;4;4;1515893883
1505187927;256;128;256;1;2;256;18446744073709551615
1505187927;8;128;128;2;2;1;178048670
1505187929;1;128;256;1;32;1;559164467
1505187930;32;2;256;8;2;1;214084300
1505187931;64;64;32;1;2;1;503903711
1505187932;64;1;1;16;1;1;1078969408
1505187933;32;128;256;8;2;1;203104380
1505187934;8;2;256;4;2;4;238502009
1505187936;8;32;256;1;32;1;886809489
1505187937;32;2;1;8;2;1;758996310
1505187939;1;1;256;1;1;2;1122772959
1505187940;4;1;64;4;1;16;364516304
1505187941;8;128;256;1;2;4;312773763
1505187942;1;128;256;1;2;32;537186226
1505187943;1;128;256;1;32;4;566887770
1505187945;8;128;256;1;2;16;585558726
1505187946;16;16;1;16;1;1;216007667
1505187947;1;64;2;1;4;1;1140042618
1505187949;256;1;128;1;1;2;466130798
1505187950;2;2;32;2;2;1;568410175
1505187951;4;128;256;4;2;8;166562792
1505187952;8;128;256;8;4;1;179482255
1505187954;1;64;1;1;2;1;2296403212
1505187955;32;64;1;1;4;1;274314548
1505187957;128;4;1;1;2;1;583120093
1505187959;2;128;8;1;64;1;1686150167
1505187960;64;32;1;2;4;1;266345002
1505187971;1;2;2;1;2;2;9967449915
1505187974;2;1;32;1;1;1;2508016353
1505187975;256;128;256;2;2;4;236949088
1505187986;1;4;1;1;1;1;9956531750
1505187987;2;2;32;2;1;1;733294467
1505187988;1;256;256;1;64;1;515448597
1505187991;1;2;32;1;1;4;2022591836
1505187992;64;128;256;2;2;64;645208275
1505187993;8;1;256;2;1;4;404833099
1505187994;4;32;256;4;8;64;18446744073709551615
1505187995;2;1;256;2;1;32;622085691
1505187997;1;1;256;1;1;1;832330043
1505187998;128;2;1;16;1;1;290617341
1505187999;64;16;2;32;1;2;321788340
1505187999;8;128;256;2;2;1;176278128
1505188000;8;32;256;2;16;4;343118010
1505188006;1;8;1;1;1;1;5075246089
1505188007;32;32;1;8;8;1;405404724
1505188049;1;1;1;1;1;1;40719199333
1505188050;4;2;256;1;2;1;373100848
1505188051;8;128;256;2;1;4;165826132
1505188052;16;64;32;16;2;1;218389506
1505188053;64;64;32;1;1;1;1006275461
1505188054;32;64;32;16;1;1;204701044
1505188056;1;256;1;1;16;1;1093147450
1505188057;8;128;1;8;2;1;207141129
1505188057;64;128;256;4;2;128;18446744073709551615
1505188059;8;2;256;1;2;4;972803903
1505188060;2;1;256;2;1;2;629391560
1505188061;4;1;64;1;1;4;319398461
1505188062;16;16;1;16;8;1;217549712
1505188064;4;64;1;1;4;1;1151762586
1505188065;8;128;256;1;2;256;18446744073709551615
1505188065;128;128;256;1;2;4;214391212
1505188067;256;1;128;32;1;8;296270628
1505188069;1;2;128;1;2;64;1479727174
1505188070;8;128;256;1;8;1;434415250
1505188074;1;16;1;1;16;1;3309549260
1505188075;8;1;256;2;1;4;424382085
1505188076;8;1;256;2;1;4;401059265
1505188077;32;64;256;1;4;1;234922381
1505188078;128;4;1;1;4;1;220714459
1505188081;1;2;8;1;1;1;2855578243
1505188083;64;1;1;4;1;1;1079009103
1505188084;16;128;1;16;2;1;211557545
1505188085;16;128;256;16;2;1;200685925
1505188086;16;128;256;16;1;8;193353588
1505188087;4;128;128;4;1;4;190244210
1505188088;16;128;128;16;2;8;194442462
1505188089;8;128;1;8;1;1;224058213
1505188090;8;128;128;2;128;4;18446744073709551615
1505188090;8;128;256;8;2;8;167872751
1505188091;8;256;128;2;256;4;18446744073709551615
1505188092;4;128;128;1;2;4;584882353
1505188094;8;1;256;1;1;8;1040214972
1505188095;16;256;128;16;1;4;190912460
1505188096;4;128;64;4;2;4;186006631
1505188097;8;256;64;2;256;4;18446744073709551615
1505188098;16;1;256;16;1;8;227673547
1505188099;8;1;128;2;1;4;277515178
1505188099;4;256;256;4;1;8;168002128
1505188100;16;256;1;16;1;1;213495383
1505188103;8;128;1;1;128;1;2043656014
1505188104;32;128;256;4;2;8;221273508
1505188105;4;128;128;2;2;4;232350170
1505188106;4;128;256;4;2;2;168022839
1505188107;16;64;256;4;4;4;211931006
1505188109;8;64;64;2;4;16;476424934
1505188109;8;128;256;4;2;8;176156546
1505188110;16;64;128;16;4;2;197096694
1505188111;2;128;32;2;2;4;350787295
1505188112;8;256;1;2;256;1;18446744073709551615
1505188113;8;128;256;2;128;2;18446744073709551615
1505188113;4;256;256;4;1;4;166118419
1505188114;2;128;256;2;2;8;210278800
1505188115;16;256;128;8;1;4;186869421
1505188116;2;128;64;2;2;4;264522885
1505188117;4;64;256;4;2;4;175402918
1505188118;2;128;128;2;128;4;18446744073709551615
1505188119;1;128;256;1;2;4;502738309
1505188120;8;64;64;2;2;4;319059136
1505188121;2;128;256;1;2;4;478491515
1505188122;2;64;256;2;4;4;232068215
1505188123;16;32;256;16;8;8;18446744073709551615
1505188124;16;128;256;16;128;8;18446744073709551615
1505188126;8;128;256;1;2;8;535702342
1505188126;8;128;256;2;128;8;18446744073709551615
1505188127;8;16;256;2;4;4;329335632
1505188128;8;32;128;2;4;4;343172877
1505188130;4;32;256;1;4;4;748453353
1505188130;8;64;256;8;4;2;171702294
1505188131;16;128;1;8;2;1;209751256
1505188132;2;64;256;1;4;4;616303333
1505188133;16;64;256;8;1;4;186762293
1505188135;4;64;256;1;2;8;657895348
1505188136;8;256;256;8;1;2;174107378
1505188137;32;32;256;8;8;4;254413135
1505188138;16;64;256;8;4;4;184293255
1505188139;1;128;256;1;2;1;422536836
1505188141;1;128;256;1;1;4;513726683
1505188142;32;256;64;8;1;4;204188962
1505188143;16;32;1;16;8;1;217675753
epoch;GLOBAL_SIZE_0;GLOBAL_SIZE_1;LOCAL_SIZE_0;LOCAL_SIZE_1;cost
1505188167;8;128;4;16;1276271333
1505188170;1;64;1;64;2035723214
1505188173;8;4;1;4;2381092301
1505188176;16;64;4;2;2103290546
1505188181;4;2;4;1;4944526375
1505188184;32;1;2;1;2369130041
1505188226;1;1;1;1;40699191292
1505188247;1;2;1;2;20236065884
1505188250;64;32;16;2;2358588950
1505188251;128;256;1;256;844835882
1505188253;64;16;2;16;1308385666
1505188256;1;128;1;128;2215937628
1505188259;16;2;4;1;2260753509
1505188265;4;2;4;2;4944614831
1505188270;4;2;1;1;4904771359
1505188276;4;2;2;1;4941688760
1505188279;8;2;1;2;3128587520
1505188283;8;2;1;1;2806839791
1505188293;4;1;1;1;9843016875
1505188299;4;2;1;2;4945109870
1505188310;2;2;1;1;9973035959
1505188313;64;32;16;16;1986390081
1505188323;4;1;4;1;9834559444
1505188327;4;4;1;1;3180037410
1505188330;32;2;1;1;2377381255
1505188331;64;32;16;32;18446744073709551615
1505188334;8;2;4;1;3069187833
1505188337;32;32;2;2;2039237790
1505188339;16;8;1;2;1238927712
1505188342;64;16;16;4;1874435183
1505188343;16;8;8;8;1271676920
1505188346;2;32;1;1;2314260930
1505188350;16;1;2;1;3468188708
1505188353;1;32;1;1;2257935914
1505188356;32;1;2;1;2378775270
1505188367;4;1;2;1;9926240702
1505188371;4;4;1;2;3037450739
1505188376;4;2;1;1;4938233503
1505188379;16;2;1;1;2217336980
1505188381;4;128;1;64;1330887668
1505188392;4;1;4;1;9923492615
1505188402;4;1;2;1;9839401576
1505188404;8;32;1;1;1255903128
1505188406;128;32;1;16;1183749912
1505188408;128;16;1;16;1196049550
1505188414;4;2;2;1;4940969300
1505188424;2;2;2;2;9972882459
1505188435;4;1;1;1;9836923077
1505188438;8;4;2;4;2329874501
1505188440;4;256;1;64;1253278426
1505188445;4;2;1;2;4935362531
1505188448;8;4;1;1;2366368735
1505188451;8;4;8;2;2360546655
1505188453;16;8;4;8;1253913189
1505188474;1;2;1;2;20235344833
1505188480;4;2;2;1;4945076253
1505188483;16;2;1;2;2184002069
1505188488;8;1;2;1;5087246364
1505188491;8;64;4;4;1642801101
1505188493;16;256;8;4;1640835896
1505188496;16;2;2;2;2226156043
1505188502;1;8;1;4;5077691093
1505188505;8;4;2;1;2403688801
1505188510;4;2;1;2;4947243127
1505188514;8;4;1;2;2365259916
1505188517;8;2;1;2;2693358930
1505188520;8;4;2;2;2374082328
1505188526;4;2;1;1;4938271458
1505188528;128;4;64;1;1926450160
1505188531;64;128;8;2;2120813795
1505188537;8;1;2;1;5079238170
1505188539;4;256;4;2;1293926924
1505188543;16;1;2;1;3374759584
1505188545;4;64;1;64;1451721174
1505188551;4;2;1;2;4946278753
1505188556;4;2;1;1;4934883828
1505188562;4;2;1;2;4918172590
1505188572;1;4;1;1;9996235417
1505188576;1;16;1;2;3315095454
1505188580;2;8;1;4;3008546668
1505188583;256;1;256;1;2278596320
1505188586;4;8;1;4;2349668668
1505188587;64;4;1;1;865037714
1505188589;64;2;1;1;1154211253
1505188595;4;2;4;1;4944041380
1505188597;256;2;1;1;1226150185
1505188600;4;8;1;4;2373116141
1505188605;4;2;1;1;4939577365
1505188607;4;32;1;1;1295451904
1505188610;4;16;1;2;2132745708
1505188614;16;1;1;1;3457071330
1505188616;4;32;1;32;1206471935
1505188622;4;2;1;2;4944369248
1505188624;4;256;2;64;1234607655
1505188627;32;2;1;1;2369774636
1505188648;1;2;1;1;20239055884
1505188653;4;2;1;1;4946150630
1505188657;8;2;1;2;2887165880
1505188661;4;4;1;1;3192502199
1505188671;1;4;1;1;10001617792
1505188674;32;2;1;2;2004022416
1505188678;4;4;1;1;3172126625
1505188684;4;2;1;2;4905997121
1505188685;64;2;1;2;1178656268
1505188689;8;2;4;1;2913412735
1505188695;4;2;4;1;4943453828
1505188698;4;8;2;4;2324172985
1505188703;4;2;1;1;4938753713
1505188714;2;2;1;2;9973460250
1505188725;4;1;1;1;9838714618
1505188728;4;8;2;2;2396332059
1505188749;1;2;1;1;20237791968
1505188770;1;2;1;1;20239213125
1505188775;4;2;1;1;4925806163
1505188781;4;2;2;1;4944584412
1505188792;2;2;1;1;9972181542
1505188802;2;2;2;1;9971854247
1505188804;4;128;4;64;1328313167
1505188807;32;2;32;1;2013625792
1505188810;32;2;1;1;2367567856
1505188813;32;2;1;1;2380090463
1505188834;1;2;1;2;20235472125
1505188837;64;1;32;1;2077414113
1505188838;128;2;1;1;749982563
1505188841;16;2;16;2;2251611657
1505188852;4;1;4;1;9843762112
1505188857;4;2;2;2;4904653200
1505188859;4;64;2;32;1291215130
1505188865;4;2;1;2;4945494074
1505188867;4;32;2;2;1226409211
1505188872;4;2;4;2;4900894071
1505188878;4;2;2;2;4943934003
1505188884;4;2;4;1;4943879662
1505188886;256;2;256;1;2172328658
1505188888;4;64;4;32;1313556562
1505188899;4;1;4;1;9917424080
1505188904;4;2;2;2;4906022375
1505188915;4;1;1;1;9838658715
1505188921;4;2;4;2;4939601703
1505188923;4;16;4;1;2103757695
1505188929;4;2;4;1;4939297282
1505188932;4;32;4;32;2273529772
1505188935;4;8;4;2;2389706032
1505188938;8;2;4;2;2772390073
1505188940;64;2;2;2;1171873041
1505188951;2;2;1;2;9973078083
1505188961;4;1;4;1;9920535660
1505188964;4;32;4;32;2293544958
1505188970;4;2;4;1;4944314741
1505188972;4;256;4;32;1205775630
1505188974;32;4;2;4;1229961730
1505188984;4;1;1;1;9922155208
1505188986;4;32;4;8;1216646771
1505188989;32;2;4;2;2012259001
1505188991;4;128;4;2;1459256762
1505188997;4;2;4;2;4941607919
1505189017;1;2;1;2;20235486301
1505189020;1;64;1;32;2018053131
1505189026;4;2;4;1;4944564535
1505189031;4;2;2;2;4945890454
1505189034;256;1;256;1;2277353454
1505189040;4;2;1;2;4911396709
1505189045;4;2;4;2;4938031042
1505189047;64;2;2;1;1164334916
1505189049;4;128;4;32;1346528723
1505189051;4;64;2;32;1277669595
1505189052;256;2;256;2;18446744073709551615
1505189056;8;2;1;2;2881710735
1505189059;8;2;1;1;2925062817
1505189062;16;2;8;2;2309652458
1505189073;4;1;1;1;9838206014
1505189078;4;2;1;2;4947020247
1505189081;4;16;4;4;2118444130
1505189084;1;32;1;32;2312850679
1505189087;16;2;4;2;2195462598
1505189097;2;2;1;2;9972993294
1505189108;2;2;1;1;9973027414
1505189110;4;128;4;32;1330843875
1505189121;2;2;2;2;9972745329
1505189131;1;4;1;4;10005235083
1505189134;8;4;1;4;2368153121
1505189155;1;2;1;2;20235566958
1505189158;32;2;32;2;1991594877
1505189161;8;2;8;1;2799213734
1505189164;16;256;4;1;1652065377
1505189166;32;2;4;1;1991455126
1505189168;4;256;2;32;1253750311
1505189174;4;2;2;2;4939456010
1505189176;4;32;4;1;1269135128
1505189180;8;2;8;2;2975758207
1505189185;4;2;4;2;4938758209
1505189187;128;64;1;2;1330358594
1505189191;16;1;16;1;3452780902
1505189194;2;16;2;2;2272060546
1505189197;64;1;1;1;2273613610
1505189200;1;32;1;8;2317856155
1505189202;1;128;1;32;1191588569
1505189205;16;2;8;2;2167796500
1505189211;4;2;4;2;4938592674
1505189213;4;64;4;4;1464784198
1505189223;4;1;4;1;9927362125
1505189226;64;1;2;1;2071739908
1505189228;8;16;1;1;1347818641
1505189234;4;2;2;2;4940961032
1505189236;16;128;8;32;1872305786
1505189242;4;2;2;1;4946500083
1505189248;1;8;1;2;5123922771
1505189251;4;8;1;2;2359774464
1505189253;4;64;1;32;1281267150
1505189256;32;2;32;2;1979157120
1505189277;1;2;1;2;20235655135
1505189282;4;2;4;2;4907863587
1505189284;4;64;4;32;1324797610
1505189286;128;1;1;1;1196998584
1505189288;128;2;64;2;1625340849
1505189290;64;2;2;2;1171984984
1505189301;2;2;1;1;9971971957
1505189305;4;4;4;4;3169266229
1505189311;4;2;1;2;4946264132
1505189316;8;1;1;1;5020575460
1505189327;2;2;2;2;9972706042
1505189330;16;4;16;4;2077598256
1505189340;2;2;2;1;9971355208
1505189351;2;2;1;2;9973321040
1505189355;4;4;4;2;3171130951
1505189359;16;1;8;1;3450136261
1505189363;4;4;4;4;3068301283
1505189384;1;2;1;2;20235500237
1505189389;8;1;2;1;5016766293
1505189393;4;4;1;2;3058179912
1505189396;4;8;1;2;2374611683
1505189400;4;4;4;1;3204131683
1505189441;1;1;1;1;40698816333
1505189447;8;1;1;1;5189795700
1505189451;8;2;2;2;2865030233
1505189455;4;4;1;4;3111711773
1505189465;2;2;2;1;9971551539
1505189471;4;2;1;1;4944269591
1505189475;4;4;2;4;3135482506
1505189486;2;2;1;1;9972504335
1505189496;4;1;1;1;9841514459
1505189507;4;1;2;1;9841592272
1505189528;1;2;1;2;20235572833
1505189533;4;2;1;1;4902239530
1505189537;4;4;4;1;3128380094
1505189540;8;2;1;1;2661705401
1505189546;2;4;1;2;4906931696
1505189550;8;2;4;1;2859196726
1505189553;4;4;2;1;3119188397
1505189565;4;1;1;1;9882097380
1505189568;4;8;4;4;2380354806
1505189574;8;1;1;1;5032801169
1505189584;2;2;1;2;9973131789
1505189588;2;8;1;2;3237420647
1505189599;2;2;2;2;9972657583
1505189602;16;2;8;1;2226770505
1505189623;2;1;1;1;20046822043
1505189633;2;2;2;1;9971459625
1505189644;2;2;1;2;9973375540
1505189647;8;4;2;4;2344112891
1505189668;2;1;2;1;20038398500
1505189679;4;1;4;1;9829845617
1505189720;1;1;1;1;40698701612
1505189723;64;1;4;1;2068096292
1505189764;1;1;1;1;40699020583
1505189768;1;16;1;1;3222381666
1505189772;8;2;8;2;2967762294
1505189778;4;2;2;1;4936611492
1505189781;8;2;8;1;2770611879
1505189784;16;2;16;1;2263910114
1505189788;8;2;2;1;2874835802
1505189791;32;1;2;1;2386180048
1505189794;1;32;1;4;2320600261
1505189796;32;32;1;16;1702679112
1505189798;128;1;1;1;1201522491
1505189840;1;1;1;1;40698632529
1505189843;4;8;4;1;2385485568
1505189846;4;16;1;1;2356977354
1505189857;2;2;2;2;9972726709
1505189867;1;4;1;1;9947204706
1505189909;1;1;1;1;40698858000
1505189912;16;32;2;4;1854628430
1505189914;32;256;4;1;1825928509
1505189917;8;2;4;2;2722946879
1505189921;8;2;1;1;2955956968
1505189924;32;2;8;2;2008397793
1505189928;8;2;2;1;2876075479
1505189931;16;2;8;2;2205785584
1505189942;4;1;1;1;9927365413
1505189945;16;2;8;2;2197427625
1505189966;1;2;1;1;20237493218
1505189969;8;8;1;4;2146629899
1505190011;1;1;1;1;40698928459
1505190014;32;2;8;1;2032110573
1505190018;16;1;8;1;3464732744
1505190024;1;8;1;4;5146971167
1505190027;128;4;64;4;1881193005
1505190029;128;4;8;2;1818566891
1505190035;8;1;2;1;5093224742
1505190041;8;1;1;1;4952417373
1505190051;1;4;1;1;9993651708
1505190057;2;4;1;4;4900522133
1505190060;4;16;2;1;2114549258
1505190065;2;4;1;1;4891227620
1505190068;8;4;1;1;2363018913
1505190089;1;2;1;1;20237634968
1505190095;2;4;1;1;4880241505
1505190101;2;4;2;1;4894225847
1505190104;2;8;1;8;2891940828
1505190108;4;4;2;2;3160448499
1505190112;2;8;2;8;3251145583
1505190122;1;4;1;4;9983991666
1505190128;2;4;1;4;4905078967
1505190134;2;4;1;2;4894924583
1505190139;2;4;2;1;4896569288
1505190143;4;4;4;1;3129134036
1505190149;2;4;2;1;4896559654
1505190152;4;4;1;1;3198394791
1505190163;2;2;2;2;9972385915
1505190167;1;16;1;8;3278536148
1505190171;4;4;1;2;3136685523
1505190176;2;4;1;2;4903941883
1505190179;2;16;1;8;2360676337
1505190185;2;4;2;4;4902670833
1505190196;1;4;1;1;9978566372
1505190201;2;4;1;1;4891945435
1505190203;32;4;1;1;1257553189
1505190209;2;4;1;1;4888161912
1505190219;2;2;1;2;9973271749
1505190222;16;4;1;1;2404340583
1505190228;2;4;1;4;4890394000
1505190230;64;4;64;1;1363586011
1505190231;64;16;64;8;18446744073709551615
1505190241;1;4;1;1;9976453832
1505190262;2;1;2;1;20038134208
1505190265;4;16;1;8;2124959536
1505190275;2;2;1;1;9973186125
1505190296;1;2;1;2;20235250791
1505190317;2;1;1;1;20046756459
1505190323;2;4;2;1;4896203950
1505190328;2;4;2;2;4899048620
1505190339;1;4;1;2;9895815328
1505190380;1;1;1;1;40699185904
1505190386;2;4;2;4;4896352011
1505190392;1;8;1;4;5080287128
1505190402;4;1;1;1;9921077000
1505190408;2;4;2;4;4927040753
1505190412;4;4;2;1;3254230021
1505190415;4;8;1;8;2347854984
1505190419;2;8;2;8;3109080704
1505190421;4;64;4;2;1404699818
1505190427;2;4;1;4;4905160121
1505190431;16;1;2;1;3440191759
1505190436;1;8;1;8;5139364125
1505190457;2;1;1;1;20046378666
1505190468;2;2;2;1;9971571207
1505190473;2;4;2;1;4895216825
1505190476;128;4;64;1;1920639844
1505190479;8;4;4;1;2369064614
1505190483;4;4;4;2;3219290314
1505190487;2;8;1;4;3173438714
1505190491;2;8;1;1;3179944379
1505190502;1;4;1;2;9949712625
1505190507;2;4;2;4;4898454079
1505190513;2;4;1;1;4885017157
1505190519;2;4;2;2;4909012454
1505190522;2;8;2;4;2997688458
1505190525;32;16;8;2;1905116008
1505190528;2;16;1;2;2341737500
1505190531;256;1;256;1;2273584599
1505190534;32;2;8;1;1985417788
1505190537;128;4;128;1;2032455250
1505190542;2;4;2;2;4903536875
1505190544;2;128;1;8;1224176069
1505190547;16;4;2;1;2133956792
1505190550;16;4;2;1;2128787292
1505190555;2;4;1;1;4888181106
1505190561;2;4;1;1;4893212583
1505190567;2;4;1;1;4891800676
1505190569;2;32;1;4;2039385042
1505190572;4;16;1;16;2164443862
1505190578;2;4;1;1;4892636310
1505190580;2;64;1;8;1192230024
1505190583;8;4;4;1;2378200422
1505190586;16;2;2;2;2182836947
1505190591;2;4;1;2;4898941741
1505190593;64;4;64;2;1425623422
1505190594;256;32;64;8;18446744073709551615
1505190596;16;8;2;8;1283765656
1505190598;2;256;1;8;1292582776
1505190604;2;4;2;4;4899793687
1505190609;2;4;1;1;4882553912
1505190611;8;32;2;16;1426894715
1505190615;16;1;4;1;3428058595
1505190621;8;1;2;1;5201380375
1505190625;16;1;16;1;3434899637
1505190628;16;32;2;8;1494447335
1505190630;2;256;1;8;1293112110
1505190640;1;4;1;1;9981559583
1505190646;2;4;1;4;4907393916
1505190649;256;4;64;1;2282751328
1505190652;8;4;8;1;2327273389
1505190654;2;128;1;128;1288847826
1505190657;2;32;1;8;2082212337
1505190658;32;4;2;1;1182552849
1505190664;2;4;2;4;4904298946
1505190685;2;1;2;1;20038081126
1505190696;2;2;2;2;9972267832
1505190697;64;256;1;2;1026527584
1505190739;1;1;1;1;40699143571
1505190780;1;1;1;1;40699099820
1505190783;256;4;16;1;2305387576
1505190789;2;4;1;1;4901094491
1505190792;8;4;4;4;2346133110
1505190795;2;8;1;8;3085601372
1505190799;64;1;1;1;2262830550
1505190840;1;1;1;1;40698594458
1505190842;4;32;1;1;1312112466
1505190845;32;1;8;1;2390480974
1505190848;256;1;64;1;1851996971
1505190850;8;256;1;1;1506462999
1505190853;1;32;1;16;2234076442
1505190855;128;1;64;1;1368345329
1505190896;1;1;1;1;40699175779
