GLOBAL_SIZE_0;GLOBAL_SIZE_1;LOCAL_SIZE_0;LOCAL_SIZE_1;TILE_0;TILE_1;cost
512;2;1;1;2;1;826061387
2048;1024;64;4;256;4;848440712
128;8;128;1;2;4096;18446744073709551615
16;1024;2;32;2048;2048;116937046
16;1024;2;64;2048;2048;120039878
1;4;1;1;64;1;6886102552
2;256;1;32;2;2;14884734755
16;1024;1;32;1024;1;58887662203
16;512;1;64;2048;2048;127924542
16;1024;2;32;512;2048;63842251
2;64;2;8;8;1;1590247971
16;1024;2;64;2048;4096;15162318923
32;1024;1;32;256;2048;72240417
32;1024;1;64;512;1024;79014835
16;2048;2;32;256;2048;65924086
16;1024;2;32;512;4096;19452092227
128;4096;1;256;256;1;12767591468
2048;4;2;2;512;64;568451093
32;1;1;1;2048;256;10885194823
4096;512;8;32;64;8;1215940765
16;2048;4;32;512;2048;82563418
16;2048;2;32;512;2048;66776376
16;1024;2;16;128;512;73306209
4;64;1;2;512;1024;658668544
16;1024;2;2;512;2048;722801678
2;256;2;16;128;16;107663879
16;4096;2;32;512;2048;69366042
16;1024;2;32;2048;256;74923668
16;2048;2;32;256;1;2519891098
8;2048;4;32;512;2048;61677709
8;1024;4;64;512;4096;21849174404
1;1;1;1;1024;2048;21925562161
8;2048;2;64;512;1024;65192792
16;2048;2;16;512;2048;65730628
2;4096;1;4;512;2048;1365109360
8;4096;4;32;512;4096;18446744073709551615
8;2048;4;64;512;2048;71486211
8;512;4;32;256;1;2182029455
1;1024;1;64;512;4096;9186972875
16;1024;1;128;512;2048;105914921
8;4096;4;32;512;2048;65508668
8;2048;4;32;1024;2048;69899127
64;16;1;16;1;512;263300002
8;128;4;32;512;512;86042211
64;2;2;2;128;16;1047661371
8;2048;4;8;512;1;13589272309
2048;4;1;1;4;8;703769175
256;128;256;1;2048;64;967839781
4;4096;2;64;4096;8;26393703683
256;1;256;1;32;1024;8875714031
8;4096;2;32;256;2048;86015671
4;2048;1;32;512;2048;115037584
8;2048;8;32;256;2048;590092473
4;256;1;16;512;2048;221831335
8;2048;4;32;512;64;1367278899
8;2048;4;16;512;2048;101943254
1;2048;1;1;512;2048;10841840715
32;8;2;2;512;256;221388375
512;256;1;32;1024;1;44969337708
16;2048;2;32;256;4096;93683209792
32;2048;1;32;256;2048;98476296
8;2048;4;32;256;2048;85001167
2;512;1;1;1;8;917381025
64;1;8;1;256;32;1201324425
4096;2048;2;4;2048;4096;18446744073709551615
32;4;8;1;64;2;710746962
8;128;4;8;2048;64;1503165167
8;2048;8;32;512;2048;864675858
8;2048;1;32;512;2048;72861170
8;2048;4;32;512;1;2252688355
8;2048;1;32;128;512;91983920
128;2048;64;4;512;2048;732578473
8;64;2;8;256;64;1183296000
16;64;4;1;1024;128;705970902
4;128;1;8;256;128;1071400000
16;32;4;1;128;16;806853902
8;1024;4;32;512;4096;55318583167
8;2048;4;1;512;2048;1300527504
4;1024;1;32;512;2048;115066588
8;2048;4;4;512;2048;333154764
8;256;8;2;2048;4096;161949344248
32;2;32;2;4;8;6579629857
128;512;16;4;1;1024;3717361304
1;512;1;16;4;2;7055998757
8;2048;4;32;512;1;2366615803
2048;2048;64;1;512;128;812242464
8;128;4;32;512;2048;94750624
8;2048;4;32;512;16;3543137772
32;256;4;32;512;512;960358732
16;64;1;64;16;256;62983460
512;2;32;2;64;512;733135144
4096;1024;16;4;2048;2048;741433599
2048;32;16;2;256;2;1668063979
2;32;2;1;1;1;739066565
8;512;4;4;256;64;1294605125
8;2048;4;32;1024;1;2304514670
8;2048;4;32;512;1024;81226086
8;128;2;16;256;64;805200990
8;2048;4;32;512;8;7017080626
8;2048;4;32;512;128;131189376
32;128;1;2;256;16;1157601314
8;2048;4;64;1024;2048;75897211
8;128;2;16;256;128;72615877
16;2048;8;1;2;32;2058389459
512;4096;8;8;32;2;2163253119
128;32;2;1;2048;4096;12318812708
1;32;1;32;64;1;25582093857
8;256;4;32;512;2048;85644083
16;2048;2;32;512;256;63721624
8;2048;4;32;4096;2048;1800983300
16;256;8;32;512;256;1404318048
64;2048;64;4;4096;2048;399495591
128;4;64;1;512;2048;392990963
16;128;1;32;64;256;65039377
8;128;1;32;64;64;78643043
16;64;16;4;128;256;846238839
16;128;1;32;64;128;154052131
2;128;2;64;2;8;1352612630
64;1024;8;1;1024;32;1243057989
1;32;1;2;128;1024;2642856515
32;32;2;8;8;64;822594864
8;2048;8;32;512;2048;674927007
8;2048;8;1;512;2048;1298463767
8;2048;1;32;512;2048;73147164
8;8;4;2;512;2048;651240056
16;64;16;2;64;64;846671898
32;128;16;2;128;512;582866767
8;4096;2;32;512;2048;69020962
512;1024;1;64;2;1;3076819679
256;64;64;1;64;1;1197359007
2;32;1;8;1;2;1409244655
2;64;1;8;8;1;2205773025
16;512;16;2;64;512;528077464
8;1024;4;32;512;512;130535752
8;2048;4;32;2048;4096;102890983496
16;256;16;2;64;256;603937854
8;2048;2;32;512;2048;65553586
8;2048;8;32;512;512;1345779613
16;128;1;64;32;256;64289252
16;128;1;64;32;128;68263502
32;128;32;4;64;512;921109361
128;1;1;1;1;1;469614337
4;4096;2;128;512;64;1948563110
32;1;1;1;1;16;1046594826
4096;512;8;32;1;8;1429325643
32;2048;1;32;512;2048;72102876
2;2048;2;32;512;2048;199354799
32;2048;1;32;512;1024;70443043
8;2048;4;32;512;4096;116063369042
512;2048;64;4;512;2048;646106963
8;2048;4;32;2;512;1712429083
16;64;1;1;64;256;504666849
16;64;1;64;32;128;78547834
8;1024;4;32;512;1024;97629667
32;4;1;4;4;8;598307225
8;128;1;1;8;64;631727843
4;8;2;4;4096;8;1771204154
256;1;256;1;128;1;2653463056
4;128;4;64;8;64;886784112
8;2048;4;32;512;2048;86862041
8;2048;4;32;32;2048;82861626
8;128;2;64;16;128;128829542
4;2048;2;32;128;2048;102933044
8;2048;8;16;512;2048;109442212
16;512;1;16;8;256;69782373
8;1;4;1;4096;2048;5288809733
16;256;1;32;16;256;66799417
64;1;4;1;256;1;2094371159
4;2048;1;4;2048;4096;18446744073709551615
32;4;8;1;1024;2;1354752924
64;128;32;4;128;1024;818597356
16;512;1;64;32;1024;88446920
1024;2048;64;4;512;2048;708381798
8;2048;4;32;2048;2048;82981211
16;128;1;64;32;1024;74966128
2048;256;16;2;1;4096;79200585833
32;2;32;1;8;32;3279193314
1;512;1;4;1;1024;1349359994
16;32;1;4;128;256;1153936372
8;2048;2;64;64;2048;66305835
8;2048;2;32;512;1;2476118129
16;256;1;64;32;256;63614751
8;1;4;1;512;2048;2610489259
8;64;1;4;512;2048;368998637
8;2048;4;2;512;2048;652064840
256;512;2;16;4;2;4222110463
512;2;32;2;64;16;749588511
1;1024;1;4;1;2048;2772234227
2048;32;2;1;256;2;1437149841
4;2048;2;32;512;2048;102908293
8;2048;4;32;256;1;23168986174
64;128;64;4;512;2048;679258426
2;8;1;2;512;2048;2665191917
2;2048;1;32;512;2048;213659626
2;32;2;32;16;4096;368205172
16;1;1;1;2;32;1566344901
1024;4096;8;16;32;2;2987895666
128;32;64;1;2048;1;1932655580
8;2048;4;32;256;4096;119723938321
8;1;2;1;512;1024;2611805967
4;1024;1;128;512;2048;93543042
8;2048;4;8;512;2048;177956211
8;2048;1;1;512;2048;1376281084
8;128;2;64;2;1024;173499837
1;1024;1;1;1024;32;532030083
1;32;1;2;128;4;812496760
128;32;4;16;8;64;395905503
8;2048;4;32;128;512;116384128
8;512;1;32;1024;2048;132583583
128;2048;64;4;512;2;3592515084
512;16;1;2;2;1;1402594959
256;64;64;1;64;2048;496148003
2;1;2;1;1;2;23895655703
2;64;2;8;1;4096;3305452096
8;2048;4;64;512;4096;57581659833
8;4096;4;32;2048;2048;94592379
16;2048;2;32;1024;2048;64935294
8;2048;4;32;2048;2048;80078377
8;2048;1;64;2;2048;183895334
128;1;1;1;64;1;1693836599
2048;64;2;8;16;128;513743094
128;2048;8;8;1;16;419818183
4096;512;16;1;64;8;939003501
4;512;1;16;512;2048;222533967
8;2048;4;16;256;2048;113730752
8;1024;8;32;512;2048;840777762
512;2048;32;2;512;4096;18446744073709551615
8;2048;4;32;512;512;222761046
8;2;4;2;512;2048;1301833176
32;4;1;4;32;32;817299799
8;1;2;1;4096;64;10881042667
512;1;16;1;4096;2;59913362125
256;1;8;1;128;1;1959478922
8;1024;4;32;512;2048;94930751
8;1024;4;32;256;2048;94686460
16;4096;1;32;1024;1;51903456000
8;2048;4;32;512;16;3620758850
1;2048;1;32;512;2048;411919583
64;1;1;1;256;32;1769447459
4096;2048;4;4;2048;4096;18446744073709551615
32;512;8;1;64;2;1759669654
2048;1;2;1;1;4096;697256185
8;1024;4;64;512;1;4730371675
4;4096;1;32;512;2048;114934671
8;2048;4;32;4;2048;211588174
8;1;4;1;512;2048;2609746449
8;2048;4;32;32;8;7752582428
8;2048;4;2;512;2048;652289150
128;1;32;1;64;32;587570547
1;4;1;2;1;1024;5349861013
1;512;1;16;4096;2;15125675917
512;2;1;2;128;16;1327716583
8;2048;2;32;64;2048;67174419
8;64;4;32;1;2048;334277096
8;1024;8;16;512;2048;109073126
4;2048;4;32;512;2048;168101548
4096;16;16;4;2048;2048;594240677
2048;32;2;1;64;2;1429008922
2;1;2;1;16;4096;10739806948
1;1;1;1;2048;1;37242585500
8;2048;4;32;512;2;29208180217
64;2048;64;4;64;2048;399484558
8;2048;4;32;64;2048;85706586
4;2048;1;32;512;512;68709920
512;4096;8;8;8;2;434421047
128;32;1;4;2048;1;2153717308
256;128;256;1;2;1024;69057488210
4;1024;1;4;1024;32;1239992125
8;128;1;32;512;2048;73997251
2048;2048;64;4;512;2048;663835900
8;2048;1;32;512;2048;73774583
8;1;2;1;512;2048;2620118078
8;2048;4;16;1024;2048;102385211
1;512;1;128;128;4;20832703577
128;32;4;16;2;64;2209389172
512;2;16;1;1;1;711958936
128;1;64;1;1;2048;10836726743
8;2048;4;2;32;2048;652828628
8;2048;4;32;8;1024;634643093
8;32;4;1;512;2048;1299025926
8;1024;4;32;2048;2048;83466506
8;1024;4;64;1024;4096;23943601292
16;2048;8;16;512;2048;72626666
2;32;2;8;1;2;2956943580
2;16;2;8;1;1;9271161208
128;1;8;1;1;1;1306261045
2048;64;1;8;16;128;762648544
8;1;2;1;512;64;2647770569
8;2048;4;64;512;1;4665602360
8;2048;8;32;512;1;58092577670
32;4096;16;1;512;2048;790339981
128;2048;8;8;256;16;1058747718
4096;2048;256;1;64;8;2996842624
32;4;4;4;4;8;491209220
1;128;1;1;8;128;852542659
1;2048;1;16;512;2048;823732191
8;4096;4;32;512;512;469190602
8;2048;4;64;512;512;554978468
4;2048;2;32;512;512;63415045
8;2048;2;16;1024;1;23966998332
4096;8;16;4;1;8;982046338
1;1;1;1;128;1;30178942791
1;1;1;1;256;32;22156293792
128;2048;64;4;16;4096;18446744073709551615
16;2048;16;1;256;2048;987396422
1;2048;1;32;512;1;21838227326
8;2048;4;32;8;2048;83273083
8;2048;2;32;1024;2048;65318587
4;1;1;1;512;2048;5355839723
8;2048;8;1;512;2048;1298007853
8;4096;4;32;128;2048;85860585
1;4;1;1;64;256;5298048220
2048;4096;4;2;1;4096;18446744073709551615
128;128;8;16;64;64;1071411744
1;512;1;1;1;1024;5307475167
8;512;4;32;512;2048;83898335
8;4096;2;16;128;4096;18446744073709551615
1;2048;1;32;512;1024;210479505
256;4096;2;8;4;2;1555528125
2048;1;32;1;64;512;841730180
4096;8;16;1;1;8;725200511
16;32;2;1;64;2;803612282
8;2048;8;2;512;2048;650978190
128;4;64;4;4096;2048;1946902588
8;256;4;32;256;2048;92522169
8;4096;2;32;512;4096;18446744073709551615
2;32;2;2;16;4096;4660390957
16;1;8;1;2;32;5341841486
1;1;1;1;8;2;23854053577
128;128;64;1;128;1;1411608650
32;2048;8;32;512;2048;965551441
512;1;64;1;512;4096;838366959
8;1;2;1;2;1024;2608958835
8;1024;8;8;1024;1;12915800451
1;32;1;2;128;1;1750551271
16;32;4;8;8;32;761695774
1;1;1;1;512;2048;21920710872
8;2048;4;32;512;32;1586095761
128;2;2;1;1;1;600393092
4;64;1;64;64;2048;114113669
2;32;1;1;1;2;418443468
1;64;1;8;8;32;375508385
128;1;1;1;1;1;479762472
2048;64;2;8;16;1;4204144366
4096;2048;8;8;1;16;434736097
1;8;1;2;4;1;5982635791
1;4;1;4;4;8;6208666050
8;128;1;64;8;64;334608805
2048;8;64;1;1;8;28308142292
256;32;8;4;128;1;6220651268
8;2048;4;64;64;2048;88812583
8;2048;4;1;2;64;1322367718
64;1;16;1;256;1;1702013826
8;2048;4;32;128;2048;89171627
8;512;8;32;512;2048;564349632
4096;1024;2;4;2;4096;54060147086
8;512;4;32;256;2048;88825544
8;256;4;32;2048;1024;88872292
8;2048;1;32;1024;2048;132248875
16;2048;2;32;512;1024;65847335
1;2048;1;32;512;2048;411790174
32;4;8;1;64;1;830554400
1;128;1;2;64;4096;20284637679
128;1;32;1;64;1;623839900
1;512;1;4;1;256;634162106
8;2048;4;32;1024;1024;83000002
1;2048;1;16;256;1024;406652472
1;4096;1;8;4;2;6048452627
1;16;1;16;64;512;1669367708
4096;1;4;1;2048;2048;2616155295
128;32;2;1;512;1024;526896761
4096;2048;64;4;512;4;761200820
2;2048;1;64;512;2048;111203375
8;2048;1;64;512;4096;16193778924
2;2;2;2;16;4096;4713730899
16;1;1;1;2;32;1602268108
512;4096;128;2;8;2;16421133875
16;128;16;1;128;1;1541078260
16;2048;2;32;2048;512;88830252
8;2048;8;32;512;1024;980957992
8;128;2;2;2;1024;664530151
1;1024;1;1;1024;1;164940046
1;32;1;2;128;4;807274545
1;32;1;16;32;1024;822362974
32;2048;1;16;512;2048;134049005
8;4096;4;32;512;1024;85657252
32;4096;2;32;256;2048;68999040
8;512;4;32;512;1;2251543094
8;2048;4;32;1;1024;527066560
16;2048;1;32;512;2048;72823336
8;1024;4;32;1024;2048;89691751
128;2;2;1;1;1;687468479
4;64;1;64;64;1;6668031583
128;32;64;1;8;2;7154721589
1;64;1;8;8;1024;716498125
8;16;4;1;512;2048;1298650033
8;2048;4;1;512;2048;1299565362
4;4096;1;32;256;2048;115448876
8;1024;4;16;512;4096;104407609058
1;1;1;1;8;1;23509279459
2048;64;4;8;16;128;390324169
8;1;8;1;512;16;2743557697
128;2048;8;8;1;8;534863643
4096;512;16;2;64;8;776761973
32;4;4;4;1;8;911682469
8;128;1;2;8;64;921060440
2;2048;1;32;1;2048;199561125
8;1;4;1;512;4096;2614560327
8;2048;8;32;512;4096;114338058722
4096;4;32;4;128;8;730872729
256;1;8;1;128;1;1974068413
64;1;8;1;256;64;1140494737
4096;2;2;1;2;4096;1716648185
4096;2048;64;4;32;2048;766114270
1;4;1;1;64;2;6428014292
4096;1;2;1;1;4096;694374776
128;1;32;1;64;32;592324937
1;1;1;1;1;256;22190191133
16;2048;2;64;512;2048;77717294
4;2048;2;32;1024;4096;102241775250
256;4096;2;1;4096;2;18446744073709551615
1;2;1;2;64;1;28526159167
1;4096;1;4;2048;2048;2769810182
128;512;2;64;8;1;3525743651
2;32;2;8;16;128;461938593
256;2048;64;4;512;2048;598794092
8;2048;4;64;512;1024;63744458
16;1;4;1;1;32;5289442589
512;4096;8;8;8;64;118311919
128;128;64;4;128;1;5419736976
8;4096;2;64;2;256;883327743
32;2048;1;16;256;2048;72147958
1;1024;1;1;256;1;163672464
8;512;4;32;512;64;764740355
1;32;1;16;128;1024;821528234
128;256;4;16;8;1;1107496378
128;2;2;1;1;1;668972225
4;64;4;64;128;2048;172045628
8;2048;4;1;1024;2048;1300176471
8;2048;4;4;256;2048;333315348
8;256;4;32;512;1;2179432447
8;2048;4;2;32;2048;653717817
1;32;1;1;1;128;771007218
1;1;1;1;8;32;21844583041
128;1;1;1;1;1;483651018
2048;64;8;8;16;1;1675329015
128;1;8;1;1;16;1311303141
4096;1;16;1;256;8;1277841481
32;4;1;4;1;8;442652807
8;128;1;64;2048;64;169059586
8;512;4;32;1024;2048;86430127
8;4096;4;64;256;2048;88954749
8;2048;4;64;256;2048;63322000
8;256;4;32;128;2048;81207169
4096;2048;64;4;4;2048;13741314042
256;4;32;2;128;8;1145227209
256;1;2;1;128;256;1001106541
64;1;32;1;256;64;1123281021
4096;2;128;1;2;4096;118588911941
8;4096;4;16;512;2048;103586045
4096;2048;64;4;512;128;860535655
64;2048;64;1;512;2;1551759990
1;4;1;1;2048;2;7467514122
8;1;2;1;1;4096;5271955303
128;1;16;1;64;32;708700733
1;512;1;1;1;256;1295765377
8;1024;4;16;2048;2048;102030252
8;2048;1;32;256;1;42155585048
8;64;4;4;512;2048;332512263
8;4096;2;32;512;2048;68824500
8;2048;4;32;2048;256;61513833
8;2048;1;32;2048;256;89732920
2;2048;1;64;2048;128;70408962
8;2048;4;32;2048;1;60697296125
8;2048;4;32;64;256;149573878
2;2048;1;256;2048;256;62603791
8;2048;4;32;2048;16;3309205747
8;1024;4;32;2048;256;59905045
256;1024;64;4;2048;256;1146027197
8;1024;2;32;2048;256;78382293
8;1024;8;32;2048;256;1373978661
512;4096;64;4;2048;256;1185997125
8;1024;4;32;4096;4096;100604469900
8;16;4;1;4;256;493831294
8;1024;2;32;2048;512;84217792
8;8;4;2;2048;256;837429908
32;2;8;2;2048;256;681708273
8;32;4;2;2048;256;509860963
512;16;64;4;2048;256;1308009221
8;1;4;1;2048;256;2624728651
8;1024;4;32;16;256;292724548
2048;1024;64;4;2048;2;2454793181
8;1024;4;32;2048;8;7052780500
8;1024;4;32;8;256;1282365650
8;1024;2;32;2048;256;73247625
8;8;4;2;2048;512;798331266
8;1024;4;32;32;256;67556503
8;128;4;32;2048;256;83881084
8;1024;4;2;2048;512;462118709
8;4;4;4;2048;256;664448136
8;1024;4;1;2048;256;443103889
8;1024;2;2;2048;256;174967459
8;1024;4;8;2048;256;1002973541
2;1024;1;32;2048;256;80305544
32;1024;1;1;2048;4;388608254
8;1024;4;32;2048;2;30210337625
8;4096;4;32;2048;256;68549461
1024;1024;64;4;2048;256;1146946248
8;1024;1;32;2048;2;18479500186
8;512;2;32;2048;256;72265252
8;1024;4;32;4096;256;2297036342
8;1024;1;32;2048;4;13180912757
8;256;4;32;1;256;3843505519
8;1024;4;32;2048;4096;42381697584
8;2;4;2;2048;256;1303658100
8;1024;4;64;2048;256;1610951125
8;1024;4;4;2048;128;1039429350
2048;1024;64;4;4096;256;39980090208
8;1024;4;32;2048;32;1414548296
8;1024;8;32;2048;256;1496318416
8;256;4;32;2048;256;76980628
1;1024;1;32;2048;256;64183166
8;1024;4;32;2048;2048;82948335
2;1024;1;128;2048;32;4854139600
512;1024;64;1;2048;256;844457971
4096;1024;64;4;2048;256;1125454172
128;1024;64;4;2048;256;1159317212
