GLOBAL_SIZE_0;GLOBAL_SIZE_1;LOCAL_SIZE_0;LOCAL_SIZE_1;v_TP_41;v_TP_42;cost
4;1;1;1;210;9;13848539744
2048;4096;1024;2;26;4095;18446744073709551615
16;2048;8;64;195;39;22728416
4;2;1;1;78;546;6911172832
16;16;8;2;195;39;376996640
4096;2048;32;64;195;39;18446744073709551615
256;2048;2;64;195;39;66286592
4096;8192;8;64;195;39;12835488
4096;128;1;4;1365;546;205552992
64;2048;1;8;4095;2730;1429080032
8192;1024;2;2;182;15;100107968
128;4096;8;16;234;39;18690720
4096;8192;8;64;30;39;12108096
128;8192;8;64;195;39;17019584
4096;8192;128;64;195;39;18446744073709551615
4096;8192;1;64;195;39;73554912
16;2;8;1;315;546;2559976960
8192;16;2;8;15;6;35997952
512;1;2;1;273;585;1986210048
2;8192;2;16;546;90;182047712
4096;8192;8;64;30;45;12390656
4096;1;8;1;30;39;98546176
2;8192;2;64;126;39;37438656
1;8192;1;64;30;39;81380960
4096;2048;4;64;30;39;18709472
2048;8192;8;64;30;39;11432096
4096;4096;8;64;63;1;99797504
4096;128;8;64;30;39;15987936
2048;8192;4;64;30;39;18300096
2048;8192;32;512;30;39;18446744073709551615
2048;8192;8;64;30;63;12490784
2048;2;8;1;30;9;120034400
2048;8192;4;64;30;35;17239264
2048;8192;8;64;14;21;14916000
2048;4096;8;64;14;39;13276224
2048;2048;32;64;30;63;18446744073709551615
2048;64;8;64;30;21;18823712
2048;8192;16;64;30;39;24274016
8;8192;8;64;105;39;20802976
2048;8192;512;64;30;39;18446744073709551615
16;2048;4;4;546;30;92339712
1024;1024;1;128;126;9;97457696
64;2048;8;2;30;13;38380512
32;1;8;1;2;210;2428786432
256;8192;8;1;45;91;50630912
2048;8192;8;64;7;39;19176288
2048;8192;1024;64;30;39;18446744073709551615
2048;8192;8;64;63;39;11095680
2048;8;512;4;63;39;18446744073709551615
2048;8192;8;1024;63;39;18446744073709551615
2048;64;8;64;63;39;18782816
1;8192;1;64;63;39;143543552
16;8192;16;64;63;39;13872448
2;8192;1;64;63;39;175279648
2048;8192;8;64;195;39;12361856
2048;8192;8;64;63;455;15775936
8;8192;2;64;63;39;79159968
2048;256;8;64;63;39;15791200
2048;8192;8;64;63;2;55811296
1;64;1;64;63;39;1693969056
1;1;1;1;39;1;66613096704
2048;8192;8;512;234;13;18446744073709551615
256;8192;8;64;63;39;12699360
16;16;4;4;182;35;370479488
32;8192;8;64;63;39;17116992
2048;8192;1;64;63;39;66972864
1;4;1;1;63;39;13255917344
512;4;16;2;65;182;59972704
4;1;2;1;126;234;14336048128
2048;1;2;1;4095;21;185333440
1;1;1;1;315;2;68763494592
2048;1;16;1;63;70;51288896
2048;4096;8;64;63;70;15829952
2048;8192;4;64;90;39;20972512
2048;1;8;1;70;15;91480672
32;8192;8;64;63;182;20001568
2048;8192;128;32;63;39;18446744073709551615
2048;8192;128;64;63;39;18446744073709551615
8192;8192;1;64;63;39;83904576
16;16;4;4;91;210;303005568
1024;8192;8;64;63;630;19152128
2048;8192;1024;8;1638;39;18446744073709551615
2048;8192;8;512;63;2730;18446744073709551615
1024;1;512;1;15;2;23246956288
2048;128;2;128;70;390;31964960
256;1;1;1;63;585;3752956384
2;32;1;8;26;10;1384635328
32;16;16;8;195;210;171894464
2048;128;8;64;63;630;18261856
2048;8192;8;64;9;39;16530080
128;8192;8;64;63;39;14222912
1;1;1;1;21;1;67095135904
2048;4096;8;64;63;39;11898944
2048;8192;4;64;63;39;23425248
2048;8192;8;64;63;30;10625152
2048;2048;8;64;63;21;12554784
2048;8192;8;64;35;30;12894976
2048;8192;16;64;63;30;17280704
1024;8192;32;64;63;30;18446744073709551615
2048;1;8;1;126;30;82760224
2048;8192;4;64;63;30;18558240
4096;1;8;1;63;30;82528032
512;1;2;1;63;35;281342016
8192;8192;8;64;63;30;12188800
2048;1024;16;64;63;30;15134272
2048;8192;32;64;63;39;18446744073709551615
2048;2048;4;64;63;42;28395648
2048;8192;8;32;63;10;17443904
4096;1;8;1;63;30;82548960
1024;8192;8;64;63;30;10583488
1024;8192;32;128;65;30;18446744073709551615
1024;8192;8;64;70;30;12397280
256;8192;8;64;63;10;18648736
1024;1;8;1;63;6;159735072
1024;1;8;1;91;18;128873472
2048;1;8;1;63;26;84710144
1024;2048;4;32;42;45;22644864
1024;1;8;1;63;26;124018432
1024;8192;8;256;63;35;18446744073709551615
1024;2048;4;64;13;30;18035712
1024;8192;8;32;63;30;10524704
1024;8192;8;64;39;30;12082336
4096;8192;2;32;195;30;47583776
1024;8192;16;32;63;30;12371872
1024;2048;8;8;63;30;11246112
1024;4096;8;32;42;3;44365088
256;8192;32;32;35;21;34711040
1024;8192;8;32;91;30;11409728
1024;8192;8;16;195;30;13924544
256;1;8;1;42;30;367783872
1024;1;8;1;90;30;123746240
1024;8192;8;16;63;30;11035232
1024;2048;16;64;26;30;25859200
1024;1;8;1;65;26;124007104
1024;8192;8;32;45;30;10290912
1024;8192;8;32;63;42;12054400
512;1;8;1;63;30;202500480
1024;1024;8;32;42;30;14306592
2048;8192;8;8;45;39;10914112
512;1;8;1;45;30;201698304
2048;1;32;1;45;30;69660480
1024;8192;8;32;13;65;12011392
1024;8192;16;32;70;30;12888864
1024;8192;4;64;45;30;15440192
1024;8192;32;32;45;21;31012224
1024;8192;4;32;42;30;14564032
1024;2048;4;16;45;35;15101824
2048;8192;32;32;65;30;23417088
1024;1;8;1;45;30;123965088
2048;1;64;1;26;14;262547776
1024;4096;8;32;45;30;10863840
1024;8192;8;32;45;35;10359936
1024;8192;8;32;45;26;11433472
1024;4096;8;32;45;42;11899872
1024;1024;4;32;45;21;15795616
512;8192;8;32;45;30;11252672
1024;1024;8;16;45;30;12597472
128;2048;16;16;45;15;17290912
4096;8192;8;32;45;39;10860896
1024;4096;8;8;26;30;11700768
1024;8192;8;64;42;30;11795616
1024;8192;1;32;105;30;67380384
1024;4096;32;32;45;30;21831584
1024;2048;8;32;78;30;12288640
512;8192;64;32;45;39;18446744073709551615
256;8192;8;32;45;30;13082720
128;2048;8;8;195;210;21708768
8;8192;1;32;45;30;62385440
1;8192;1;32;45;30;55857440
1024;8192;8;32;4095;30;19165824
16;128;1;32;1;70;925220576
1024;1;2;1;42;630;2137663648
4;128;1;2;3;585;314814112
16;128;8;2;8190;1170;2884563552
1024;8192;64;8;117;30;17922208
256;8192;8;32;39;39;12803584
1024;1;2;1;45;30;239823104
1024;8192;8;32;45;42;11402624
32;64;1;64;126;63;67204000
1024;8192;16;32;45;30;12910720
8192;8192;8;32;45;30;11503232
1024;8192;8;32;45;7;19362048
1024;4096;8;32;90;30;11326912
512;1;8;1;117;30;202750208
1024;4096;16;16;45;26;13352832
1024;1;2;1;45;26;213010592
1024;1;2;1;126;10;185187488
2048;8192;4;32;234;182;30584704
16;8192;8;8;6;5;30837920
2;2048;2;4;13;8190;64812320
256;2048;8;64;117;35;15374240
1024;8192;8;32;45;8190;22694048
1024;8192;16;32;18;30;14483584
1024;8192;4;32;45;30;15128960
1024;4096;8;16;45;30;10229216
1024;8192;8;32;90;63;14450400
1024;8192;8;256;35;30;18446744073709551615
1024;8192;8;32;42;30;10322496
2048;1;8;1;45;30;83492352
1024;8192;8;16;21;15;12974496
1024;2048;8;16;15;18;13048480
1024;4096;4;16;63;30;14424544
1024;1024;8;16;26;30;13564064
512;4096;8;16;42;35;12275872
1024;8192;8;16;42;30;10205152
1024;4096;2;16;45;21;17922944
1024;8192;8;32;42;15;12435712
256;2048;8;16;42;30;15045344
512;8192;4;16;42;45;16806976
1024;8192;8;16;45;42;11788480
1024;4096;8;16;42;14;12569440
1024;8192;8;16;42;26;11075552
1024;8192;16;16;195;30;12094720
512;8192;8;16;42;26;12241632
1024;8192;16;32;42;30;13008896
1024;8192;2;16;42;30;19035104
1024;8192;8;16;35;30;10041504
512;8192;8;16;35;42;13175104
1024;8192;2;8;15;30;27789280
1024;8192;8;16;30;35;9868384
1024;4096;8;16;35;30;9945760
256;8192;8;32;30;35;11597312
1024;4096;8;16;39;35;10268416
512;8192;8;16;6;35;12799040
1024;8192;8;16;30;63;11789600
1024;1;8;1;39;35;100851808
1024;8192;4;16;30;35;13599552
512;8192;8;16;30;35;10973408
1024;1;8;1;30;30;123050144
4096;8192;2;16;30;35;20925408
1024;8192;8;16;30;42;11156192
1024;4096;8;64;30;35;11889472
1024;8192;16;64;26;35;29191808
1024;8192;8;2;45;35;31618272
128;8192;8;16;30;39;14707072
1024;8192;8;16;30;65;11853792
2048;8192;8;8;30;35;11266112
4096;1024;4;16;30;15;11499168
2048;8192;8;16;30;42;10884000
128;8192;8;16;21;39;14058464
1024;8192;8;16;90;35;12324128
1024;8192;8;8;30;26;11880864
1024;2048;16;16;30;21;15116832
1024;8192;8;16;30;26;10377120
1024;8192;16;32;30;35;12623648
1024;8192;4;32;45;35;17983744
512;8192;16;16;30;35;11784224
1;8192;1;64;14;18;57301856
1024;1;8;1;30;35;100112416
1024;8192;8;16;18;18;13467104
2048;8192;8;16;26;35;9804032
2048;8192;4;16;30;26;12423584
2048;8192;8;64;26;35;13063168
2048;8192;8;16;26;91;12623712
2048;4096;4;16;26;35;13746336
2048;8192;8;16;35;35;9908736
2048;8192;8;16;26;21;11128192
2048;8192;4;16;26;30;13159232
2048;8192;8;8;26;91;13019552
4096;8192;8;64;18;35;14884448
2048;8192;4;16;26;35;13515424
2048;8192;2;16;42;15;19706208
2048;8192;16;16;63;30;11601696
2048;8192;8;32;30;35;9916672
1;8192;1;16;9;35;50207360
1024;2048;16;16;26;35;12673888
2048;1;8;1;26;35;99724576
4096;8192;4;16;26;30;13780864
8192;2048;8;16;26;35;11078528
2048;1;8;1;65;35;99606592
1024;8192;8;8;26;65;11707360
4096;8192;8;16;26;10;18670752
2048;4096;8;16;26;35;9927520
2048;8192;2;16;30;35;19752000
1024;8192;8;16;70;35;11550144
2048;4096;8;16;45;35;9974624
2048;8192;8;16;6;35;12850176
2048;8192;8;16;63;35;10478688
2048;1;8;1;26;35;99616800
2048;1;8;1;14;35;99236160
2048;8192;8;16;10;35;10881824
256;4096;8;16;30;35;12712896
2048;8192;4;8;26;35;19240288
2048;1;8;1;26;35;99294304
8192;8192;8;16;9;35;13172480
4096;8192;8;16;26;70;12295200
2048;8192;16;16;26;35;12534592
2048;8192;8;16;42;18;12528192
2048;8192;2;8;9;63;42706528
2048;4096;8;8;5;35;15911808
2048;8192;1;16;42;70;35574816
2048;2048;8;16;45;35;10474144
2048;4096;16;16;26;42;10441280
2048;8192;8;16;26;39;9689664
2048;8192;8;4;26;35;18666848
512;8192;8;16;26;65;13159328
1024;1;8;1;30;39;99155712
4096;8192;8;16;26;39;9953792
2048;8192;8;4;26;39;17158752
1024;4096;8;16;26;39;10240992
2048;8192;8;16;10;9;22912896
4096;8192;8;128;26;39;40178464
2048;8192;8;8;26;39;11585952
2048;8192;4;16;26;42;14415360
8192;1;4;1;26;39;166775136
2048;8192;8;16;18;39;9490528
2048;1;16;1;26;39;63107200
2048;8192;4;16;26;39;13798528
2048;8192;8;64;26;45;12567744
2048;8192;8;32;18;39;10374880
2048;8192;8;64;21;39;13664544
2048;4096;1;16;18;39;44870400
256;8192;32;32;18;39;28237536
2048;1;8;1;18;42;62455104
2048;8192;4;16;18;39;15351424
8192;8192;2;16;18;30;28067520
8192;4096;32;8;18;42;16499072
2048;8192;8;16;9;39;10840512
2048;8192;16;16;35;18;19730144
512;8192;4;16;39;39;15466304
2048;8192;8;32;39;30;10278496
2048;8192;8;16;2;35;30295712
2048;8192;32;16;35;39;19048960
2048;8192;16;16;7;39;13045024
2048;8192;8;64;18;39;12953824
256;8192;2;16;18;63;24242720
1024;1;8;1;18;39;99592864
2048;8192;64;16;18;26;56837760
1024;4096;2;16;15;39;20140736
2048;1;8;1;39;39;99828000
2048;8192;8;16;35;39;10030208
2048;4096;2;16;18;39;25704864
2048;1;8;1;18;39;100233440
2048;2048;4;8;18;90;19406464
2048;2048;8;16;18;65;14485440
4096;8192;8;8;18;39;12798976
2048;8192;8;16;9;30;11839232
4096;8192;8;32;18;39;11003840
2048;8192;8;16;26;45;10125120
2048;8192;8;16;18;30;9927104
2048;8192;4;8;18;39;20158624
8192;4096;8;16;18;39;11016896
2048;1;8;1;5;39;100949088
512;4096;8;64;10;15;27508704
2048;4096;8;8;15;39;10137088
1024;1;8;1;18;39;99078112
4096;8192;8;16;14;39;9927712
512;8192;8;16;39;10;17367712
2048;8192;8;16;21;18;13725248
8192;8192;8;16;18;39;11132448
2048;1;16;1;18;39;63512256
1024;4096;8;16;18;39;10586400
2048;8192;8;4;18;63;16938496
2048;8192;8;8;18;6;27878720
2048;1;16;1;18;70;51393568
256;8192;8;16;18;39;11966816
1;2;1;2;2;42;29717623456
2048;8192;8;16;18;90;12341376
2048;8192;8;8;18;39;12173056
1024;8192;8;16;18;39;9695584
2048;1;8;1;105;39;99785312
2048;8192;8;4;18;39;17587776
2048;8192;2;8;15;39;30082304
2048;1;4;1;18;39;167934144
16;2048;8;32;210;78;23090528
2048;4096;8;16;18;18;13465120
8192;4096;8;8;18;39;12745952
2048;8192;8;16;18;126;13665024
8;8192;8;16;390;39;40573120
1;1;1;1;105;14;53804745504
2048;1;16;1;35;2;440883264
8;1;4;1;2;910;8324526112
2048;64;256;4;65;5;607198880
2048;8192;8;16;30;39;9891392
4096;8192;2;16;21;45;24121472
4096;1;8;1;9;39;100189728
256;1024;8;16;10;45;15743168
64;128;16;128;130;117;18446744073709551615
2048;8192;8;2;9;26;38058112
2048;8192;8;32;30;78;13941376
2048;8192;8;4;9;39;20270624
8192;8192;16;16;18;39;13199392
2048;1;8;1;18;39;100348896
512;8192;8;16;30;39;11184352
128;2048;8;32;130;90;18828480
64;2048;64;64;182;63;18446744073709551615
2048;128;4;128;45;15;22207168
256;4096;8;8;78;65;15348032
2048;8192;1;16;18;39;45599488
32;8192;8;16;18;39;17686592
2048;8192;8;128;70;39;19174624
2048;4;8;2;18;39;39430880
1024;8192;4;16;2;39;54935712
512;8192;16;8;18;39;10986720
1024;8192;8;16;18;13;14616704
256;8192;8;16;18;130;17700576
4;32;1;1;30;8190;1968818624
64;8192;4;16;3;1;263089792
8;8192;8;32;630;91;31428256
256;4;8;1;15;42;101775104
2048;1024;16;4;18;39;12636736
2048;8192;1;16;14;15;32884864
2048;8192;8;16;18;63;10022208
2048;8192;8;8;39;39;10814176
1024;8192;8;16;1;63;52513056
2048;8192;32;16;18;65;15587936
2;8192;2;128;18;39;47608736
64;8192;8;16;18;39;15966848
4;1024;1;16;18;210;69668480
2048;8192;16;8;18;63;8407936
2048;8192;16;16;18;35;13264096
2048;8192;32;64;18;39;18446744073709551615
2048;8192;8;8;18;63;11501792
2048;8192;16;8;30;63;8061856
2048;2048;32;16;18;126;10632512
512;8192;2;16;18;30;23343168
256;8192;16;8;30;63;10136096
2048;4096;16;8;30;63;7899360
4096;8192;16;8;63;63;8858592
2048;4096;4;8;30;63;16624896
2048;256;16;8;30;63;10171872
2048;4096;32;8;21;45;15025216
4096;1;8;1;30;91;114532800
2048;2048;8;16;30;63;14112096
2048;8192;16;8;39;70;8983360
8192;4096;8;8;30;18;13730720
2048;4096;4;8;30;65;17055200
2048;4096;16;8;30;65;8964448
2048;4096;16;8;30;21;14693408
2048;8192;8;8;30;63;11265408
8192;2048;16;4;30;90;9540864
2048;4096;16;8;30;18;17093728
2048;4096;16;32;30;63;9128256
2048;1024;16;32;30;63;9371520
2048;4096;16;8;35;70;8925504
2048;4096;16;8;78;63;8316416
2048;1;16;1;30;90;60160768
2048;4096;8;4;65;18;21211360
2048;4096;16;4;30;63;9059776
2048;8192;16;8;30;70;8603264
2048;2048;8;8;63;105;14995584
2048;2048;16;4;78;13;19500896
2048;4096;16;16;30;63;8153696
2048;4096;16;8;14;63;7901632
2048;4096;16;8;30;126;8449568
2048;2048;16;8;30;273;9531616
2048;8192;32;4;30;63;9977600
512;4096;16;8;15;63;8697152
2048;2048;32;8;30;63;9923680
1024;4096;16;8;30;42;9526496
2048;4096;16;8;13;63;8843616
1;2048;1;8;30;63;79657312
2048;4096;8;8;30;63;10899648
4096;4096;16;16;30;45;9258304
2048;2048;16;8;30;63;7845120
2048;4096;16;8;30;39;10238400
1024;2048;16;8;30;63;8026944
2048;2048;16;8;21;70;9031200
2048;1024;16;8;30;63;8127232
2048;2048;8;8;30;63;10927776
2048;2048;16;8;45;42;10170464
4096;2048;16;8;42;78;8054304
2048;2048;16;32;42;63;10299776
2048;2048;16;8;30;45;8853664
2048;1;16;1;30;63;81377152
512;2048;32;2;30;45;14374592
2048;2048;8;16;30;35;10429824
2048;2048;32;16;30;63;10573536
2048;512;16;8;30;18;17220352
1;2048;1;8;18;63;83477504
1024;2048;16;8;10;90;9656416
2048;2048;32;4;21;45;14707520
2048;2048;8;8;42;63;11719328
2048;2048;16;2;30;63;14493280
2048;2048;16;4;39;39;11846752
2048;2048;16;8;42;63;8158240
2048;2048;16;8;14;42;9677664
2048;2048;32;8;35;65;13201184
2048;2048;32;8;21;63;10809792
1024;2048;16;8;30;39;10264800
2048;2048;16;8;26;63;8253344
2048;2048;16;8;30;42;9480896
1024;2048;16;8;30;90;8416032
2048;2048;8;4;35;63;15162720
2048;2048;16;8;63;63;8218752
2048;512;16;8;21;63;9528608
1;2048;1;8;15;126;77704160
4096;2048;16;8;30;63;7914912
2048;2048;16;8;30;70;8382656
2048;1024;8;8;15;63;13814816
2048;1024;16;2;26;63;14366720
512;1024;8;8;14;26;13908480
2048;2048;32;8;21;105;9892512
1024;2048;8;8;42;78;13823328
4096;4096;16;8;30;63;8039520
4096;4096;4;8;30;35;17327712
4096;2048;4;8;30;63;16613760
2048;2048;16;2;30;35;19399520
1;2048;1;4;30;39;136898496
2048;1024;16;8;30;21;14643232
1;2048;1;8;15;63;77889728
2048;2048;16;8;2;42;17018560
256;4096;16;1;14;45;29459168
1;2048;1;8;42;63;60216736
1024;2048;16;8;30;65;9070112
4096;2048;16;16;30;42;9881536
2048;1024;16;8;30;45;9060064
2048;2048;16;16;30;30;10682688
2048;1024;16;4;30;63;8883168
4096;2048;16;8;35;91;8111648
1024;512;16;8;30;63;9998208
2048;2048;4;16;30;105;19320800
8192;2048;16;4;30;63;9334976
2048;2048;32;2;30;63;10275936
4096;256;16;8;30;63;10237088
2048;512;8;4;30;63;15422176
2048;2048;16;1;30;70;29265056
8192;2048;16;8;30;70;8625344
2048;4096;16;8;35;35;12386656
2048;2048;16;16;30;63;8279072
2048;2048;128;8;30;78;25286112
2048;512;16;8;35;30;11797664
2048;1024;16;8;35;63;8542752
2048;4096;16;16;30;78;7987968
512;1;16;1;30;63;201332736
2048;2048;8;8;91;63;13344064
4096;256;16;32;30;63;9899904
1;2048;1;1;10;30;298972192
2048;4096;16;8;45;63;8354592
4096;1;4;1;30;63;134072448
2048;1024;16;8;30;91;8904160
4096;512;16;2;70;63;14495008
2048;2048;16;8;63;70;8714272
2048;2048;32;4;30;63;9700128
2048;2048;8;8;15;63;11885120
8192;1024;16;8;30;63;8392896
2048;512;16;8;30;63;9018784
2048;2048;16;8;30;35;11317344
2048;2048;16;8;30;21;14640160
256;4096;16;8;42;63;10855744
2048;2048;8;4;30;63;15221888
256;8;2;2;18;63;103790624
512;1024;32;1;390;195;21254688
16;2048;1;64;195;39;143135456
4096;128;16;2;21;546;15725856
8192;2048;16;8;30;273;9641152
1024;1024;16;4;30;63;9300768
1024;2048;16;4;35;63;9481952
128;512;32;64;117;42;18446744073709551615
128;128;16;128;130;90;18446744073709551615
8192;256;8;8;30;63;14362176
2048;2048;16;8;70;65;9239136
2048;1;16;1;30;63;81591072
2048;2048;8;8;30;35;10798112
4096;2048;16;2;30;35;19624704
64;2048;1;8;4095;45;81206368
8192;2048;2;2;14;15;104938784
1024;1;16;1;63;13;137992640
1;4096;1;16;234;39;155040928
512;4096;16;32;78;26;13975680
2048;1;16;1;45;63;82063648
2048;4096;16;8;39;63;8332416
512;2048;16;8;30;90;9746784
4096;2048;16;8;30;90;7950016
8192;8192;16;8;30;63;9141600
2048;2048;4;8;18;63;19391360
2048;2048;64;4;26;63;15629504
8192;512;2;32;30;63;53302432
2048;2048;32;16;7;63;12982464
2048;4096;32;8;42;90;9610112
1;2048;1;8;30;65;79323936
2048;2048;64;8;30;63;14559136
1024;4096;4;8;65;42;17312608
2048;2048;16;4;21;63;9613152
2048;2048;16;8;9;63;9409408
2048;8192;16;8;30;39;10422880
8192;8192;8;8;30;63;12952960
2048;1024;8;8;30;18;13113248
1;4096;1;16;30;78;50855424
2048;4096;8;8;45;65;12579776
512;2048;8;16;78;42;14400992
2048;2048;16;8;35;63;8343904
2048;2048;8;8;30;130;15908608
4096;2048;16;8;26;63;8298592
4096;2048;64;8;26;63;16516512
4096;2048;16;16;15;70;9765504
2048;2048;32;8;39;63;10653888
2048;8192;32;4;26;39;17151776
4096;2048;16;16;30;63;8383584
2048;2048;16;8;15;63;8669344
2048;2048;16;8;30;105;7886496
2048;2048;16;8;70;63;8183168
2048;2048;16;16;30;65;9333600
4096;2048;8;8;30;18;12795808
4096;2048;16;8;30;45;8883808
4096;512;16;16;30;63;9232416
2048;2048;8;4;70;63;15725088
2048;2048;4;8;30;26;16489856
2048;2048;16;4;30;39;11300000
2048;2048;16;2;30;15;20521152
2048;2048;4;8;15;63;17107744
2048;4096;32;16;30;10;46050592
2048;1;8;1;30;63;77714560
2048;2048;16;32;30;63;9229280
4096;2048;1;8;30;26;51676224
2048;2048;8;8;90;63;13281312
2048;2048;16;8;30;65;8921120
4096;512;16;8;30;63;9065824
2048;2048;16;4;30;63;8866848
1024;2048;32;8;30;63;9935744
16;2048;4;256;910;130;25000096
1024;1024;4;256;126;9;25039776
128;2048;8;2;546;13;60884800
1024;2048;4;16;63;35;15049792
1024;2048;16;8;26;63;8476288
2048;2048;16;8;7;63;9471168
4096;512;16;8;3;65;14780992
2048;1024;8;8;35;63;13291552
2048;1024;4;4;30;63;26940032
2048;2048;16;8;78;63;8221216
2048;2048;16;8;30;4095;11260928
8192;2048;16;8;30;21;14764992
32;1;32;1;195;130;3065445952
1024;512;8;64;65;26;18214208
8192;2048;16;8;30;63;8096736
2048;2048;16;8;30;91;7716736
2048;2048;512;8;30;63;18446744073709551615
2048;2048;16;8;35;91;8040608
2048;2048;512;8;30;91;18446744073709551615
32;2048;16;8;13;91;12254944
2048;2048;16;8;30;630;10767616
1;2048;1;8;30;585;79089088
512;2048;16;8;30;91;9327328
2048;2048;16;256;30;26;18446744073709551615
1;2048;1;8;30;91;79758848
2048;2048;16;8;39;91;7946592
2048;64;16;8;30;1;162514944
8;2048;1;8;30;91;52859072
2048;2048;16;4;30;45;9939936
2048;2048;1;8;30;91;51294912
2048;2048;16;8;1170;91;10272512
2048;2048;16;8;910;91;9767712
2048;2;16;2;30;91;31912544
8;2048;1;8;30;105;52965408
2048;2048;16;1024;30;91;18446744073709551615
4;2048;2;8;30;91;34207904
8;2048;1;8;30;78;52992704
2048;2048;16;8;30;315;9634976
2048;2048;16;8;30;9;24599936
2048;2;16;1;30;91;31688000
2048;2048;16;8;65;91;8252960
2048;64;16;8;9;91;14218016
2048;2048;16;8;30;5;44209088
4;1;4;1;2;91;15605155904
512;4;16;2;65;26;58105184
4;16;2;1;126;234;1069214944
2048;1;1;1;1;21;313582848
8192;2048;8;32;26;7;20650880
2048;16;16;8;30;91;14714016
2048;2048;16;256;315;91;18446744073709551615
2048;1;16;1;30;91;59446912
256;2048;8;32;117;65;16064224
2048;128;2;1;70;390;169902048
256;1;64;1;1365;585;396516640
4;32;2;8;1;78;3495023488
128;1;8;1;117;78;672553056
2048;4096;4;8;30;45;17157216
512;1024;8;64;70;35;16264864
2048;2048;8;8;30;105;14053120
2048;1;32;1;30;90;64674912
4096;2048;4;8;30;91;17529248
512;8192;8;8;126;45;13912320
2048;2048;16;8;42;91;7953088
2048;2048;16;8;234;91;9490240
512;1;8;1;210;65;173154784
1024;2048;32;8;30;91;8900864
8192;2048;8;8;35;91;13030592
1024;2048;16;8;30;91;8128672
2048;2048;16;2;30;91;14532928
2048;1024;32;8;35;91;9453248
2048;2048;16;16;30;91;8265440
16;128;2;4;1;70;234941824
2048;1;8;1;42;18;95694592
4;128;1;2;90;585;205810432
16;4;8;4;8190;1170;1458083872
4096;2048;64;8;30;105;12415136
2048;2048;16;4;35;91;9190496
2048;2048;16;2;30;65;16598848
512;2048;8;32;105;63;14896608
2048;2048;8;8;30;91;13158016
2048;1024;32;8;21;91;9498624
2048;2048;16;4;30;91;8964352
2048;4;32;2;30;91;17440032
2048;2048;2;4;2730;91;72140672
32;2048;4;8;13;91;20661632
2048;4096;64;8;13;234;9811680
2048;2048;32;8;30;182;7541504
2048;2048;32;4;30;195;7784288
2048;2048;16;8;30;182;9421792
2048;8192;32;8;30;195;8098624
2048;2048;8;16;30;182;17584864
2048;2048;32;8;26;546;7596672
2048;1024;32;8;30;182;7686080
2048;2048;32;8;13;182;8092384
2048;2048;32;16;30;182;8157952
2048;2048;32;2;30;182;8498880
2048;2048;32;32;30;182;10987360
8192;2048;32;8;30;182;7750848
2048;2048;32;16;39;182;8642464
2048;4096;64;8;30;195;10027968
2048;2048;16;8;15;182;8750208
4096;2048;16;8;30;130;8667328
2048;512;64;4;30;182;8989280
2048;2048;32;16;13;182;9064992
4096;1024;16;8;30;182;10304512
2048;2048;32;4;15;182;7526624
8192;4096;32;2;15;91;11368352
2048;2048;16;4;15;182;9570368
2048;1024;32;16;15;182;8621248
2048;2048;32;4;15;126;8037568
2048;2048;8;4;15;234;17722624
2048;2048;32;4;10;182;7671680
2048;2048;32;4;9;234;7654688
4096;2048;64;8;39;117;11960480
2048;2048;32;4;30;90;8727424
2048;2048;32;8;21;390;7385888
2048;2048;32;4;7;182;7654688
1024;4096;32;4;15;234;7501920
2048;8192;32;8;21;234;7827904
2048;1;32;1;30;390;127070976
2048;2048;32;8;10;234;8342592
2048;2048;16;8;21;390;10512736
2048;2048;32;16;117;390;7563264
256;4096;32;8;26;315;7914304
2048;2048;16;8;21;585;10588736
2048;2048;32;8;45;390;7275168
2048;4096;16;2;45;234;14258656
2048;512;64;8;63;546;8147232
2048;2048;32;16;45;390;7602848
512;256;32;8;45;390;8668384
1;2048;1;8;35;390;91228864
2048;2048;32;8;91;390;7374272
4096;2048;32;8;45;390;7341664
2048;2048;32;8;65;910;7350336
2048;8192;32;8;45;315;7254080
8192;2048;32;8;45;1365;7771136
512;2048;32;4;45;390;8190112
2048;2048;16;8;45;390;10421280
1024;1;64;1;13;585;100007232
2048;8192;32;8;70;90;9610944
2048;1;32;1;45;546;174673568
2048;8192;64;8;90;455;9165312
256;8192;32;8;42;315;7991200
2048;8192;16;4;126;182;10520032
8192;8192;8;8;45;315;19022688
1024;8192;16;4;30;315;10674912
2048;8192;32;8;26;315;7503552
512;1;32;1;45;819;251655328
2048;8192;8;8;39;315;17215616
512;8192;32;4;45;315;8078528
512;8192;32;8;45;315;7322624
4096;1024;32;8;45;455;7375424
256;8192;16;8;45;315;10680224
2048;8192;32;4;45;315;7567328
2048;8192;64;8;45;315;8466752
2048;1;32;1;70;315;99439968
2048;8192;32;8;45;210;7818656
2048;8192;32;8;70;315;7204736
2048;8192;32;8;78;315;7241792
1;8192;1;8;65;315;82456768
2048;1;32;1;70;1170;356505184
4096;1;128;1;70;315;33169184
2048;1024;32;8;70;315;7050560
2048;8192;32;8;63;315;7201568
4096;8192;8;8;70;315;17884960
2048;8192;32;8;70;210;7831840
2048;1024;64;8;35;315;8515872
2048;2048;32;8;70;315;7059840
2048;1024;256;8;70;315;18446744073709551615
8192;4096;32;4;90;1365;9989408
2048;2048;32;32;70;585;11886528
1024;128;32;4;91;273;8453824
1024;1024;32;8;70;315;7039456
2048;1024;32;8;65;315;7189216
1024;4096;64;8;42;315;8406304
512;256;8;8;70;234;17774880
1024;1024;32;8;65;315;7189856
1024;1024;16;4;70;195;9843424
1024;2048;32;8;70;315;7024704
2048;256;32;8;26;315;8499552
2048;1024;32;8;105;315;7211104
1024;1024;32;8;70;630;6910208
512;2048;32;8;65;546;7428352
512;1024;32;8;70;630;6876736
1024;1024;32;16;70;1638;7258752
1024;256;32;8;39;630;7832192
512;1024;32;8;26;585;7828608
1024;1024;32;32;70;8190;11273664
512;512;32;8;70;910;7357184
512;1024;64;8;70;630;8013568
512;2048;16;8;70;630;10386272
128;1024;64;8;70;630;10186720
512;1024;32;8;70;1170;7125696
512;1024;32;8;78;630;7022080
1024;2048;32;8;78;630;7019904
256;1024;16;4;70;630;11815680
8192;512;32;8;70;390;7625024
512;1024;32;8;45;630;7102144
512;256;64;16;70;910;14311360
512;1024;32;8;70;819;6798560
512;2048;32;8;105;455;7539712
512;4096;32;8;70;455;7205536
64;256;16;8;63;210;12225504
512;512;64;8;70;819;8272640
512;1024;8;8;39;819;18214720
512;1024;32;8;182;819;6931680
512;8192;16;8;70;546;10439968
512;1024;32;32;70;1170;11634464
2048;512;64;8;45;819;8110880
512;1024;16;8;105;819;10217312
2048;512;8;4;70;819;19487232
512;1024;128;8;70;819;10811104
1024;1024;64;8;117;1170;9999296
2048;512;16;8;70;819;11562144
256;1024;32;4;63;819;8591904
512;512;128;8;42;819;11913216
512;4096;32;4;70;819;7750688
512;128;32;8;70;819;9208288
512;1024;8;8;210;819;19302784
512;8192;32;8;42;819;7105568
512;8192;32;4;70;819;7818752
512;4096;32;8;117;819;6808768
512;1024;32;16;70;819;7203648
512;1024;16;8;70;819;10117888
1024;256;64;16;70;819;10731168
512;2048;32;8;63;819;6740224
512;2048;8;8;90;819;18604576
512;1024;32;8;63;546;7016480
512;2048;32;4;63;819;7659712
512;2048;32;8;130;819;7286880
512;2048;32;8;42;2730;8017856
512;2048;16;16;63;819;8942976
256;2048;32;8;63;819;7230048
256;2048;32;4;63;819;8589632
512;512;64;8;182;8190;13436064
512;4096;32;8;63;819;6759264
512;2048;32;16;63;819;6806304
512;1024;32;8;45;910;7167072
512;256;32;2;63;910;9513248
512;2048;32;8;63;1638;7254336
512;2048;32;8;70;910;6940576
512;512;32;8;63;819;7173088
256;1024;32;8;63;819;7126752
1024;2048;32;8;63;315;6988672
256;2048;64;16;30;819;9494208
128;2048;32;8;63;819;7589472
512;2048;32;4;63;1;369373024
2048;4096;16;16;63;455;8992000
1024;4096;32;4;63;630;7737600
512;512;64;8;63;819;8548320
512;2048;16;8;63;234;10283360
512;2048;64;8;63;315;8383328
1024;2048;32;8;63;910;6941184
512;2048;64;8;63;819;7627968
512;2048;32;8;63;390;7441344
512;2048;32;16;39;546;7685408
512;2048;32;16;117;819;7007104
1024;2048;32;2;63;390;9316192
2048;2048;16;8;63;546;10813312
512;2048;32;8;26;819;7366304
1024;2048;32;8;42;4095;7717952
512;2048;32;8;39;273;7437856
512;2048;32;32;63;585;9867776
512;1024;32;4;91;630;8063808
512;2048;32;8;42;910;7291840
512;2048;64;8;45;819;7560256
128;4096;8;8;63;819;17498272
64;2048;1;8;63;819;53792928
512;2048;32;16;63;234;7925248
512;2048;32;8;65;234;8065440
512;2048;4;4;70;1365;32999520
256;2048;32;8;65;819;7497600
128;2048;32;8;39;819;7508736
2048;4096;32;4;63;819;8252800
1024;2048;32;2;63;819;9757984
512;2048;8;8;63;819;17969856
512;2048;16;8;63;2730;12293600
128;1024;32;8;63;819;7542848
512;2048;32;8;18;819;7535072
512;2048;32;8;63;910;6889536
4096;2048;32;8;63;315;7100960
2048;2048;32;8;63;390;7252096
256;4096;32;8;210;819;8004384
512;2048;16;8;63;1170;11084256
512;2048;32;8;42;819;7044480
512;1024;64;8;63;910;9154048
1024;2048;32;8;65;819;7178464
512;2048;8;8;42;819;18031648
512;512;32;8;30;390;8027136
512;1024;32;8;105;819;7048448
512;2048;64;4;117;819;9472512
64;128;2;8;63;819;39632992
1024;2048;32;32;63;910;9652544
512;2048;32;2;63;1365;9981824
512;512;32;4;90;630;7989728
512;2048;32;8;65;819;7168992
1024;2048;32;8;39;819;6859392
512;8192;32;16;63;819;6787936
512;4096;128;8;63;819;10644864
512;2048;256;8;63;819;18446744073709551615
256;2048;32;2;63;819;10887392
512;2048;16;8;63;819;10172736
512;2048;32;8;63;315;7312096
256;2048;128;8;63;819;11567520
512;2048;32;8;63;126;8404160
512;2048;16;8;63;390;10064032
512;4096;128;4;117;1638;9820160
512;2048;32;16;42;819;7079808
512;2048;16;64;63;819;10854208
256;2048;16;16;63;819;8941056
256;2048;32;8;42;1638;7468736
512;2048;32;8;90;546;7385248
512;2048;32;1;63;819;15291328
256;2048;32;8;117;4095;7239232
256;2048;64;8;63;1170;10263136
512;512;32;32;90;819;9770240
512;2048;32;8;63;630;6873312
256;2048;32;8;26;819;7549696
512;1024;32;8;35;819;7437984
512;4096;8;8;63;630;19581344
512;512;32;8;35;819;7953536
512;2048;32;8;78;819;6975936
1024;1024;32;8;78;819;6975296
1024;2048;128;8;63;455;11488352
512;1;32;1;63;910;280505504
512;8192;32;8;39;1170;6995680
512;2048;64;4;63;910;11005536
512;2048;32;4;65;234;8577344
512;2048;64;8;78;195;12492672
512;512;16;2;63;819;15573088
512;128;16;8;63;819;14013216
512;2048;32;32;105;390;11076640
512;2048;16;8;45;4095;11576832
512;4096;32;8;63;1170;7006912
512;256;32;8;70;819;7767232
512;2048;64;8;70;910;9233376
1024;2048;32;8;63;819;6789504
2048;1;8;1;42;70;87543168
512;2048;16;128;63;1170;18446744073709551615
512;2048;32;4;15;819;7236896
1024;2048;32;16;63;819;6827648
512;2048;128;8;63;1170;10581952
512;1024;32;16;63;819;6930592
512;2048;8;32;105;39;13366016
512;2048;64;32;63;819;18446744073709551615
512;2048;32;8;70;819;6755552
16;2048;1;8;45;585;53099360
2048;4096;8;64;105;18;13761024
512;8192;4;32;234;1;132455424
32;8192;8;8;6;5;30176384
2;2048;1;4;13;8190;129917824
512;256;32;8;63;819;7924160
512;2048;8;8;117;630;19551072
512;1024;16;8;63;585;9734048
512;8192;16;8;30;819;9680192
512;2048;32;2;63;630;9608672
512;2048;32;32;63;819;9514464
128;1;32;1;315;45;1011363904
1024;2048;16;4;45;819;11302560
128;2048;32;32;14;819;16237312
256;8192;32;8;63;819;7211808
512;2048;8;32;78;35;13524192
512;1024;128;8;63;819;10647328
512;2048;32;8;39;585;6884512
1024;2048;32;8;63;1365;6914720
512;1024;32;8;63;1;372226560
512;2048;64;4;63;819;8615456
1;1024;1;64;105;14;134134976
512;1;8;1;78;15;197535168
8;1;1;1;195;910;11398682816
2048;64;256;4;7;4095;13111616
512;2048;32;8;63;8190;11425216
512;2048;64;8;6;819;7494304
1024;2048;32;16;42;819;7136480
512;2048;32;8;63;1;371551424
4;32;1;2;30;195;525325280
64;8192;4;1;3;1;497915936
4096;8192;1;32;1;91;328222048
16;32;8;8;42;42;220182112
512;2048;8;32;105;45;13886784
512;4096;8;4;63;819;19587776
128;4096;32;8;63;819;7701216
512;2048;8;8;63;390;18703360
512;1;8;1;130;18;248157248
512;2048;32;8;63;234;7916864
1024;2048;32;8;90;819;7057120
512;2048;8;32;90;39;13421696
256;1;2;1;1;63;455073472
512;256;32;1;390;195;21124128
16;2048;8;64;195;1;161041184
512;4096;2;32;130;63;50781728
4096;128;16;128;21;1;18446744073709551615
64;32;1;8;4095;45;79030112
8192;1024;2;2;78;2;137760672
512;4096;16;32;90;30;12017248
512;2048;32;32;42;819;12307872
1024;1024;32;8;63;819;6758944
512;1024;8;512;45;14;18446744073709551615
2048;2048;64;16;63;546;10373824
512;2048;32;8;45;819;6921760
512;8192;8;16;117;42;15792416
512;2048;32;16;65;819;7450112
512;2048;16;32;91;35;12902720
512;2048;16;32;90;35;12827296
1024;4096;16;64;91;26;18890016
512;2048;16;32;91;39;11817024
512;8192;16;16;105;39;11929088
128;4096;8;1;234;390;67243040
16;2048;4;512;910;130;18446744073709551615
512;512;64;16;63;819;9709504
512;4096;32;8;26;455;7498432
64;2048;32;16;63;315;7983936
128;4096;16;8;91;63;12450560
4;1024;4;256;126;9;74869184
64;2048;64;2;30;13;42063712
32;64;8;8;2;819;176402528
256;4096;16;16;91;42;12211872
512;2048;32;1;117;819;16274208
128;2048;32;16;63;819;7079456
512;2048;32;128;63;819;18446744073709551615
512;2048;32;8;63;91;9473728
512;2048;32;8;63;210;7897120
512;1;16;1;91;35;254499392
2048;4096;32;32;91;819;10002880
512;512;64;8;117;1170;10075264
2048;2048;32;8;63;819;6930976
512;4;16;4;65;26;59912352
4;16;2;1;1;6;1076175104
2048;1;32;1;78;78;64716480
2048;128;1;128;70;1365;248213440
512;1024;4;8;70;819;20853600
512;2048;32;8;15;819;6836640
512;2048;32;32;26;819;10623808
512;1024;32;4;91;819;7734944
512;2048;1;8;63;819;55609312
512;4;32;1;63;819;64198176
512;2048;1;8;63;819;55240032
256;1;64;1;26;30;945402048
2;1;1;1;26;10;27804363168
16;4096;8;1;1;70;49835968
2048;128;512;2;90;585;17996736
256;1024;32;8;78;819;7367904
512;1024;64;8;63;819;7604896
1024;2048;16;8;90;585;10633088
128;2048;32;8;63;2730;7261632
16;4;4;2;8190;1170;2380409568
2048;128;4;32;1;182;108416384
1;512;1;1;6;1;480371776
2;2048;2;16;13;8190;27259296
512;2048;32;4;63;910;7952992
512;2048;256;8;70;819;18446744073709551615
256;2048;32;8;63;2730;7154304
512;8192;32;8;39;819;6831136
512;1024;32;8;63;819;6791840
512;2048;128;8;63;819;10641728
512;2048;32;256;63;819;18446744073709551615
512;64;32;8;63;819;11322784
512;2048;32;8;9;1170;9008672
512;2048;32;8;63;1170;7054848
4;2048;4;8;26;819;26689568
512;2048;32;8;63;42;15801152
512;2048;32;8;2730;2;267570784
512;2048;2;512;63;819;67983072
512;2048;32;1;13;819;14026976
512;2048;2;8;63;819;31060192
512;2048;32;8;35;819;7002304
512;2048;32;8;5;819;7391840
512;32;32;8;63;9;56103808
512;1;32;1;63;819;252970272
512;2048;32;8;63;15;32713472
64;2048;2;1;63;819;179554912
4;1024;2;64;105;14;32459328
8192;2048;32;8;126;819;7693856
8;1024;1;8;2;910;185474176
64;2;1;1;7;4095;13035135168
2;512;2;1;30;195;222484288
64;4096;4;16;3;15;48267616
1024;1;1;1;105;91;601414208
8;2048;2;8;63;819;35041088
512;4096;512;8;63;819;18446744073709551615
256;4;1;1;15;42;309270304
256;512;1;4;1;63;308917280
512;2048;32;1;390;195;21207264
1;2048;1;64;195;39;96423712
512;2048;32;8;90;819;7052864
128;2048;64;8;42;819;9183168
512;2048;32;8;105;819;7084672
32;2048;32;8;63;819;8264832
512;2048;32;8;65;455;7440992
512;16;32;8;15;819;18077632
1;128;1;2;21;42;558830400
128;8192;1;8;4095;91;61849024
8;1024;2;2;182;15;118265920
128;4096;8;16;8190;126;54196352
512;512;32;8;63;630;7101280
512;4;32;1;63;42;74260640
1;4;1;1;63;546;13042863904
1;2048;1;8;63;819;74631936
64;2048;4;128;910;130;32753824
1;1024;1;256;1;9;14590126752
4;2048;1;2;1;819;298891488
128;64;64;8;2;819;39328768
512;128;32;8;63;819;9270400
512;2048;32;8;63;7;70417376
512;2048;32;8;63;1365;6832032
512;4;16;4;90;26;59396960
4;16;1;4;126;234;1074632896
2048;1;64;1;78;8190;1215651712
4096;2048;32;128;63;819;18446744073709551615
512;2048;32;8;63;35;19056864
8192;2048;32;8;63;819;7284704
2048;1;2;1;70;390;1324709952
1;1;1;1;1365;585;51360815488
16;32;16;8;26;10;460158144
16;4096;8;128;1;70;778614688
512;2048;32;1;63;182;15011616
512;128;32;8;63;18;29172800
1;2048;1;8;63;819;74915168
8192;2048;256;8;63;273;18446744073709551615
8;128;2;2;1;585;242099168
16;1024;8;4;8190;1170;1493381792
2048;2;32;2;234;182;30218464
512;8192;8;512;1365;5;18446744073709551615
256;2048;16;8;63;819;9718272
2048;16;32;8;63;819;17240416
2;32;2;16;65;8190;1455920992
4;4096;2;64;1;1;848906912
8;4;8;1;6;390;2298304416
2048;64;1;4;1170;1;123671808
512;2048;32;8;30;195;8135168
32;1024;32;8;63;819;8440832
2;512;2;1;65;91;246447328
64;4096;2;16;3;15;65873408
32;1024;32;32;630;26;23182528
256;2;8;2;15;90;184088096
512;2048;32;64;63;819;18446744073709551615
64;128;32;8;63;819;12532608
512;2048;32;8;63;2730;7312960
512;1;32;1;63;819;252438688
1;8;1;2;18;63;7212019776
8;256;2;256;390;195;69260096
16;2048;8;1;455;39;290334784
4096;8192;16;1;21;546;30664928
512;2048;32;512;63;819;18446744073709551615
512;2048;32;8;63;105;9876256
4;8192;4;8;4095;91;1301749920
8192;1024;1;2;182;15;174125632
128;4096;8;16;234;7;27892224
4096;2048;4;128;910;130;31246624
512;2048;2;8;273;819;39813952
8192;2048;1;1024;15;819;535635808
1024;2;1;1;126;9;321559264
64;2048;4;2;26;13;63057824
128;64;64;8;91;819;15025344
512;4;4;2;65;26;68529568
512;2;2;2;63;819;1614778272
512;2048;2;8;63;182;27443552
512;2048;32;8;210;819;6955104
512;4096;32;4;63;455;7921344
4;256;2;1;130;234;245965792
1;1;1;1;78;78;49425234816
2048;4096;1;256;70;390;93504928
32;1;1;1;1365;182;2332293376
512;2048;32;8;63;455;7198848
16;2048;1;8;546;819;70265280
512;2048;256;64;63;819;18446744073709551615
4096;32;16;1;91;10;61655040
16;1;8;1;1;70;5018680704
2048;32;8;8;90;45;18093632
2048;4;256;4;8190;7;665224736
1;2048;1;8;6;819;82150592
2;2048;2;4;105;819;112671328
512;2;32;2;63;819;121729536
2048;2;256;1;234;182;49274208
32;256;4;8;6;5;53505760
2;2048;1;16;13;8190;53433600
4;1024;1;64;105;14;46879264
1;2;1;2;63;819;28661640736
512;2;32;2;63;819;121879456
8;1;1;1;2;910;11208251200
2048;64;256;4;1170;4095;17528544
2048;512;512;1;30;195;17301920
1;4096;1;16;3;15;167253856
512;2048;32;1024;63;819;18446744073709551615
32;128;1;32;630;26;50290368
256;1;8;1;15;42;387742816
512;8;32;2;18;105;26530080
1;1;1;1;1;1;81863610848
512;2048;32;8;630;819;7912608
512;2048;32;8;63;45;14841184
512;2048;32;8;10;819;7820224
512;2048;512;8;63;819;18446744073709551615
256;8192;8;64;195;65;15572224
4096;512;16;2;21;546;15007072
4096;8192;32;8;4095;91;10870560
8192;1024;32;2;182;1;373971008
512;2048;16;1;63;91;27670016
512;2048;4;8;15;819;20079936
128;128;8;16;390;39;19742464
16;2048;4;256;195;130;24997728
1024;1024;8;256;42;9;18446744073709551615
64;2048;8;4;30;13;22513344
512;2048;32;8;234;819;7406656
512;16;32;1;63;819;18848160
512;2048;32;1;63;819;15309632
256;64;64;4;91;819;13115104
512;128;16;128;65;26;18446744073709551615
256;8;16;4;130;234;57571072
2048;4096;32;2;1;78;22400096
512;2048;32;8;21;819;7106432
8192;2048;32;8;78;819;7524416
512;8;32;8;63;1638;67880320
2048;128;1024;8;70;390;18446744073709551615
256;1;64;1;1;585;406628288
256;32;16;1;91;7;98442816
16;8;8;1;1;70;620428864
512;2048;32;8;63;182;8023136
16;2048;1;8;63;819;53584704
512;2048;32;8;819;819;9227680
2048;128;512;2;63;585;18081024
2048;4;8;4;8190;78;26864320
2048;2;2;2;234;182;320603936
32;2048;8;8;6;5;30688992
512;2048;32;1;63;91;16069696
512;8;32;8;63;819;34705952
512;64;2;8;63;10;30250496
2;2048;1;512;13;8190;1436838720
4;2048;2;1;1;14;171496544
8;128;1;8;2;910;414277600
2048;64;2;8;7;4095;315571968
4096;32;32;2;30;819;12107040
512;8192;32;8;105;819;7042432
64;2048;64;8;63;819;10923232
1024;2048;16;8;63;630;10560800
512;512;32;8;91;819;7143936
512;2048;16;8;63;630;10344448
512;8192;64;8;63;819;7466656
128;1024;32;8;90;819;8193984
512;2048;32;2;63;819;9725312
512;2048;64;8;63;455;10192384
1024;512;32;8;63;819;7251584
512;8192;128;8;63;819;10634688
256;2048;32;4;63;630;8697344
128;8192;32;8;42;585;8306944
512;2048;64;8;65;819;7853152
2048;2048;16;8;63;819;11006272
1024;2048;16;8;63;819;10700224
512;2048;16;16;39;2730;11066400
512;2048;32;8;30;1;317337472
256;2048;16;4;195;819;13452576
512;2048;32;8;90;630;7175968
512;2048;32;8;63;585;6988256
512;8192;32;8;63;819;6768320
512;256;32;8;63;390;8400768
256;8192;32;8;63;1365;6832800
512;4096;32;8;63;315;7311360
4096;2048;32;8;63;910;7314784
2048;2048;64;8;63;1638;7388128
512;1024;32;8;42;819;7434400
128;1;32;1;63;819;754805728
512;1024;8;8;78;819;19069120
256;2048;32;8;78;819;7422944
512;256;128;16;63;234;18446744073709551615
1024;2048;8;4;78;819;20507968
512;512;8;8;91;819;19031968
512;2048;32;16;63;585;6994560
256;2048;32;16;63;315;7371616
4096;2048;32;8;63;1170;7472576
512;2048;128;8;26;630;11184000
512;2048;64;8;78;819;7678944
512;2048;32;8;117;390;7633696
512;2048;32;8;70;2730;7944704
512;1024;64;8;70;4095;6728864
512;2048;32;16;39;2730;7860288
512;2048;32;8;195;455;7802688
512;1024;64;8;39;1365;8976416
2048;1024;64;8;91;4095;7626560
512;1024;64;8;70;8190;11168640
512;1024;128;8;70;4095;9099488
2048;1024;8;8;90;4095;18856608
512;1024;64;8;63;4095;6827648
1024;1024;64;8;70;4095;6830208
1024;1024;64;8;70;8190;12126720
512;1024;64;2;78;4095;11529792
512;1024;64;4;70;4095;7418784
512;1024;64;32;70;4095;18446744073709551615
256;8192;32;32;30;4095;9127456
512;4096;64;8;70;4095;6773120
256;1024;64;8;70;585;11602304
64;1024;64;8;70;1;508929152
512;512;32;16;70;4095;8085344
1024;4096;256;8;70;4095;18446744073709551615
4096;2048;64;1;35;4095;14583584
512;1024;64;4;70;2730;10146304
512;1024;64;8;45;4095;7231008
2048;512;64;8;70;4095;7945376
512;1024;64;8;91;4095;7154528
128;1024;64;4;70;4095;7286048
1024;8192;64;16;70;4095;9651552
512;1024;64;16;78;4095;9224896
512;1024;32;8;105;4095;7272992
512;1024;64;8;105;4095;7258016
512;1024;16;8;70;1;186296896
512;1024;64;8;15;4095;7924576
512;512;64;16;70;4095;9939136
2048;1024;64;8;78;1170;9224672
512;1024;64;8;42;4095;7331584
512;1024;64;8;65;4095;7429504
512;1024;64;8;39;2730;8691072
512;1024;64;8;30;4095;7030848
512;1024;64;16;70;4095;9579200
512;1024;64;2;70;4095;10836256
512;512;64;8;91;4095;7475808
512;1024;64;8;70;1;381432768
512;1024;64;8;126;4095;7918976
4096;1024;64;8;70;4095;7308512
2048;1024;32;2;195;4095;19735104
512;4096;64;2;70;8190;15753760
512;1024;128;8;30;4095;9482048
512;1024;64;128;70;4095;18446744073709551615
1024;2048;128;2;70;8190;15346976
256;1024;32;8;70;1365;6873632
512;1024;32;16;70;8190;10891456
512;512;64;8;39;4095;8690144
512;1024;64;8;130;1170;10236416
1024;1024;128;8;70;910;10586208
512;1024;32;32;70;4095;10998592
512;256;64;8;65;819;9839136
128;2048;64;8;70;4095;6623136
512;1024;64;32;126;1;18446744073709551615
128;2048;64;8;65;1;410818816
128;2048;64;16;30;4095;9221248
64;1024;32;8;91;1638;9343424
512;2048;64;8;90;4095;7117536
128;2048;64;32;70;1;18446744073709551615
512;2048;128;8;70;4095;9045504
128;2048;1;8;70;4095;82729184
128;8192;64;8;70;4095;6615264
256;8192;64;16;70;4095;9485984
128;8192;64;1;70;4095;16130176
64;1;1;1;91;4095;26178186976
128;4096;64;4;39;4095;7217440
128;8192;64;8;42;4095;6807456
128;8192;1;8;65;1638;65430784
128;8192;8;8;70;4095;19428928
512;8192;32;8;70;2730;7814528
128;8192;64;8;70;2730;9603584
128;1;64;1;21;630;692939616
16;8192;2;8;182;1;98377152
64;8192;64;8;70;4095;7461440
32;8192;2;8;21;4095;33450176
32;4096;32;8;91;4095;10147392
128;8192;64;8;70;8190;11335424
128;8192;64;8;90;4095;7121984
128;8192;128;8;70;4095;9345408
128;4096;64;8;70;4095;6659104
128;4096;1;8;70;910;56804768
128;4096;128;8;91;4095;9664768
256;8192;64;16;90;1170;10604224
256;8192;64;4;70;4095;7533984
512;8192;8;8;42;1638;20615328
128;8192;64;8;105;4095;7227040
128;8192;2;4;90;4095;68918240
128;8192;64;4;70;4095;7466912
128;8192;64;8;210;4095;8192640
128;8192;128;16;45;4095;18446744073709551615
128;1;64;1;63;4095;604369376
128;8192;32;8;70;585;8097632
128;1;64;1;70;4095;609921088
128;8192;64;8;182;4095;8506592
64;8192;64;8;126;4095;8795456
64;1;64;1;130;2730;1236226880
512;8192;64;8;70;546;8294976
64;8192;1;8;70;630;53452064
128;8192;64;8;70;1170;11957696
32;8192;1;8;70;1638;56048512
128;8192;128;4;65;4095;9608128
1024;8192;64;4;70;4095;8301184
32;8192;1;8;70;4095;81002176
256;8192;64;8;70;4095;6711264
256;8192;16;4;70;1;197309728
128;1024;128;8;45;1170;13485248
128;8192;64;8;126;2730;10857152
128;8192;32;8;70;4095;6338752
128;8192;64;4;45;4095;7985952
128;8192;64;8;63;4095;6791296
128;8192;64;16;70;4095;9454144
128;1;32;1;182;1;22329396352
512;8192;16;8;70;4095;11731360
128;8192;4;32;15;4095;22915360
128;8192;64;16;70;2730;10652128
128;8192;16;8;42;4095;10416192
32;1;32;1;70;4095;2381951200
64;8192;32;8;70;4095;6234528
32;8192;1;8;91;4095;71932672
256;8192;32;8;70;1365;6820096
64;2048;32;16;45;2730;7892800
64;8192;32;8;234;4095;8319072
64;1;32;1;70;4095;1208724448
64;1;32;1;70;4095;1205590784
128;8192;32;16;70;1365;7532832
32;2048;32;8;70;4095;8173792
64;8192;32;8;126;546;9530784
64;8192;4;16;70;4095;27610624
64;4096;32;8;70;1365;7820672
128;8192;32;8;63;4095;7285984
64;8192;8;8;195;4095;22610592
64;8192;1;8;70;1;71863392
32;8192;32;8;70;4095;8587456
64;8192;64;32;70;1170;18446744073709551615
16;8192;1;2;70;2730;197054464
64;8192;32;1;90;4095;17715680
64;8192;16;8;70;8190;13958624
32;1;2;1;78;4095;14254683552
256;8192;128;4;70;2730;11186080
256;8192;32;8;126;1;312326944
128;8192;32;8;65;4095;8116352
64;4096;32;8;70;910;8369632
64;8192;32;8;39;910;8246912
64;1;32;1;105;4095;1208719904
64;1;32;1;70;4095;1205495776
64;4096;32;8;78;1365;8287936
64;8192;32;8;45;4095;6732928
64;8192;32;8;70;2730;8987200
64;4096;32;8;70;4095;6283360
64;1;4;1;70;4095;8512497440
64;8192;64;8;91;4095;9152832
64;8192;32;4;70;4095;8705920
64;8192;32;32;91;4095;9001440
64;4096;32;8;42;2730;8660800
64;8192;32;8;315;4095;9392416
64;8192;32;4;70;910;10585344
64;4096;32;8;15;4095;6368832
64;8192;1;8;130;4095;104309728
64;1024;16;16;70;4095;9907296
64;2048;32;4;45;8190;10599296
128;8192;16;8;63;4095;10492256
64;8192;32;4;35;4095;7042464
32;8192;32;16;315;4095;9657408
64;8192;64;8;105;4095;8414080
64;8192;32;8;65;1638;8856960
16;8192;1;8;70;1;67777536
64;8192;64;8;70;1638;10132416
64;8192;32;4;70;8190;11245760
256;4096;32;8;35;4095;6776768
8;8192;2;4;70;4095;77690752
128;8192;64;16;70;1638;10572064
64;8192;32;8;70;819;7827296
64;8192;32;16;70;455;8035584
32;8192;4;16;70;4095;28521856
32;8192;32;8;105;4095;7612544
64;1024;32;8;70;4095;6360992
64;8192;32;2;70;4095;12883360
64;8192;32;8;70;1;412372992
64;8192;32;8;30;4095;6437760
64;8192;64;8;65;4095;9212160
64;8192;16;8;70;1638;12054432
64;1;32;1;90;1170;1420620032
32;8192;1;4;63;4095;137126912
64;1024;64;8;45;819;10717408
32;8192;8;4;70;4095;26642144
64;8192;16;8;70;4095;10302976
64;8192;32;8;63;1;406748192
64;2048;1;4;70;390;90658080
64;8192;16;8;105;1365;12374816
64;4096;1;8;70;4095;81453440
64;8192;1;8;70;4095;83170400
64;8192;32;8;182;1;352618720
64;1;32;1;70;2730;1623618368
64;8192;32;4;70;2730;10053504
64;8192;32;32;70;4095;10589760
64;1;8;1;70;4095;4666458304
16;8192;16;8;70;4095;12745184
256;8192;32;8;39;1638;7088928
64;1024;32;8;70;2730;8675616
256;8192;128;8;70;4095;9097408
64;8192;32;64;70;4095;18446744073709551615
64;8192;32;8;117;4095;7306400
64;8192;16;8;39;4095;9416064
16;8192;1;16;70;4095;55121312
64;4096;64;4;70;4095;9810592
32;1;8;1;70;4095;4666397408
16;8192;1;8;45;2730;58635616
64;4096;32;8;45;4095;6743552
128;8192;32;16;70;4095;6723200
64;8192;32;8;39;8190;9263488
1024;8192;32;8;70;4095;7774784
64;1;2;1;35;1;2922600736
64;8192;64;4;70;4095;10066816
16;8192;1;8;21;4095;59470560
64;4096;32;8;21;4095;6584544
64;8192;32;8;42;1638;8412864
64;8192;32;16;65;819;8384768
64;8192;32;8;70;1170;8593280
64;4096;32;2;70;4095;13085856
64;1024;32;8;70;8190;10002208
4;8192;1;8;70;4095;80962016
64;8192;16;8;78;4095;11138464
64;8192;32;32;130;4095;10068992
64;8192;32;8;195;4095;10378272
16;2048;2;8;70;4095;44192320
512;8192;32;8;70;1;371466208
32;8192;32;4;21;2730;10386464
64;8192;32;8;70;630;8711232
128;8192;32;8;39;1638;7551936
512;1;32;1;70;2730;821795648
32;8192;32;8;63;4095;7932864
64;8192;32;8;70;8190;10567808
64;8192;64;8;63;4095;8516544
64;8192;32;4;90;455;13302688
64;8192;64;8;78;4095;8128128
64;1024;32;16;70;1170;7975232
64;8192;32;8;18;4095;7329568
64;8192;32;8;70;1638;8351296
64;1;64;1;273;4095;1184966656
256;8192;32;8;42;1638;7543360
64;8192;32;8;70;390;8929792
64;1;64;1;70;4095;1184907488
512;2048;64;8;70;4095;6626560
64;8192;16;8;65;4095;10403648
128;8192;32;8;234;2730;9688832
64;4096;32;4;91;4095;9814688
64;8192;32;4;126;4095;9870368
64;1024;32;8;105;4095;7022144
64;2048;32;16;70;1365;7577088
64;8192;32;8;42;819;8281056
32;8192;2;32;70;4095;62292384
64;4096;16;8;70;4095;10560672
64;8192;1;8;18;4095;70896736
8;8192;2;8;70;4095;44428672
64;8192;32;8;70;315;8691648
16;8192;4;32;90;4095;33891360
64;8192;1;32;70;8190;61839808
64;8192;8;8;70;4095;19678400
64;8192;32;8;70;910;8497376
32;8192;32;8;70;2730;9977600
64;4096;32;8;70;1638;8478912
8;8192;2;4;78;1;193342400
16;1024;1;8;70;4095;84126400
64;8192;32;4;70;1638;10174464
64;8192;8;8;42;585;19778400
128;8192;8;16;70;4095;16814624
64;8192;32;8;105;4095;7082144
512;8192;32;8;70;4095;6939296
128;8192;32;16;70;1;372858624
32;8192;32;8;182;8190;10568160
256;8192;16;16;70;8190;15387040
64;8192;32;64;45;819;18446744073709551615
16;8192;1;4;105;4095;137304768
64;1;1;1;39;4095;26178990880
64;8192;32;16;70;4095;6615296
32;8192;32;8;63;8190;9801056
64;8192;32;4;182;4095;10571968
64;8192;2;16;70;4095;35473600
64;8192;32;16;70;1170;7840992
64;8192;64;16;70;4095;9658528
16;8192;1;8;70;4095;81796160
64;1;32;1;70;1;38257024192
64;8192;32;1;65;4095;20772384
16;8192;1;4;70;4095;148948416
64;4096;32;8;65;4095;7948768
64;8192;32;16;70;8190;8681632
2048;4096;512;1;30;195;17334720
64;16;4;16;3;15;489398816
32;1024;32;32;1;26;440145664
256;4;4;1;15;1;770554752
64;8192;32;8;70;65;13069344
64;8192;32;1024;70;63;18446744073709551615
64;8192;32;16;35;8190;8164992
512;8;32;8;630;105;27908416
512;256;32;128;1;78;18446744073709551615
256;8192;32;8;195;65;13955360
64;8192;1;8;70;4095;83570016
64;8192;32;8;70;105;10759424
64;8192;16;8;70;130;12672928
64;64;32;8;70;4095;21457632
8192;512;32;2;15;546;10860992
1;8192;1;8;4095;91;4371264672
8192;1024;2;128;182;1;39093248
32;1;32;1;234;630;2516424672
64;8192;32;256;70;4095;18446744073709551615
64;8192;32;1;70;4095;22175808
32;8192;32;8;70;130;13360768
64;4096;8;8;70;4095;20084224
16;4096;4;256;195;130;24102144
1024;1024;4;16;126;9;14624512
64;2048;8;64;30;13;21280672
256;64;64;32;65;819;18446744073709551615
64;8192;32;1024;70;4095;18446744073709551615
64;8192;8;4;70;4095;26900448
4;8192;4;8;70;4095;25751488
64;8192;4;8;70;4095;29645568
512;4;16;2;65;6;153077728
256;8;16;2;130;1;803511072
2048;4096;32;2;90;78;11838560
1;128;1;128;70;390;1507109536
4;8192;2;8;70;4095;44923040
64;8192;32;32;1170;4095;14837056
64;1;32;1;130;4095;1205508384
64;32;32;8;70;4095;42098720
256;8192;4;16;1365;1170;39971360
4096;128;512;1;91;10;283568960
16;128;16;1;1;70;46161088
2048;128;512;1;90;585;15790336
2048;4;8;2;8190;126;80790272
1;8192;1;8;70;4095;80735968
64;8192;32;8;630;4095;13636192
64;4;32;1;70;4095;308975264
8192;8192;32;8;70;4095;8822656
64;8192;32;8;15;4095;6284288
1;1;1;1;234;182;51084128480
8192;8192;8;8;6;210;14141920
1;2048;1;16;13;5;57554624
4;16;2;8;105;14;1273752992
1;8192;1;8;70;35;85544704
64;8192;32;64;70;546;18446744073709551615
8;1024;1;256;195;26;89558592
2048;4;256;2;105;4095;42170464
2048;512;128;1;30;35;25821888
64;1;4;1;273;15;1284241152
64;128;32;8;70;4095;11772032
8192;8192;32;16;70;4095;8121280
64;8192;32;8;819;4095;17456992
32;1024;16;32;630;26;20144704
1;4;1;1;13;42;13058818240
8;2;2;2;455;105;4119066624
512;256;2;1;390;195;179172352
64;8192;32;8;65;4095;7843648
4;8192;2;8;70;4095;45725440
64;8192;2;8;70;4095;46432224
64;1024;32;4;70;4095;7908928
64;2048;32;2;70;4095;13171872
64;4096;32;16;70;910;7727072
64;2048;32;8;182;910;11107200
64;1024;16;8;70;1638;11661472
64;2048;32;8;70;4095;6368128
128;8192;32;8;195;65;15667104
8192;512;32;2;1;585;16735488
128;8192;32;8;1;10;81610592
8192;1024;2;1;182;1;490357632
64;8192;32;8;130;4095;7598304
32;8192;32;16;70;4095;7018560
64;4096;64;8;70;4095;7606528
64;256;32;8;42;4095;8419648
64;8192;4;8;70;4095;29637664
64;4096;32;4;30;4095;7986272
128;2048;64;2;70;4095;10595712
128;8192;16;8;70;4095;10954528
64;1;32;1;65;2730;1623723680
256;8192;32;8;70;4095;6417568
64;8192;64;4;70;1638;12915264
64;8192;1;8;45;4095;62306624
256;8192;32;8;117;1365;7308352
256;4096;32;8;70;1170;7063936
64;1;32;1;42;4095;1208750560
16;8192;16;8;70;8190;13180800
128;4096;32;8;70;4095;6459328
64;4096;16;128;70;4095;18446744073709551615
64;8192;32;8;63;4095;7054464
64;8192;16;8;65;1170;12638080
64;8192;8;32;70;4095;14957824
64;4096;32;16;70;4095;6599232
64;4096;32;8;70;8190;10709728
64;4096;32;4;70;4095;8648352
64;8192;32;4;70;455;10840992
128;8192;32;4;70;4095;8860928
64;8192;32;8;117;1;444959648
64;8192;16;8;70;1;202493920
64;8192;16;32;273;4095;9778208
64;8192;32;8;26;4095;7467744
512;8192;32;4;126;4095;9947232
64;1;8;1;26;4095;4631510272
64;4096;32;4;26;4095;8162080
128;8192;32;8;117;4095;7203232
64;1;1;1;70;4095;25849531328
16;2048;2;16;70;4095;34080000
32;8192;32;8;78;4095;9171712
64;8192;32;8;90;2730;9709376
64;8192;32;2;39;4095;11476480
64;8192;16;8;70;910;12781024
64;8192;16;2;70;4095;23048160
64;2048;16;8;26;4095;10507072
64;1;32;1;70;1170;1420701184
256;8192;32;8;70;2730;7764704
256;8192;32;8;195;4095;9943136
64;4096;16;8;70;819;11917600
64;8192;32;4;42;4095;8013120
128;2048;32;8;70;4095;6361504
64;1;32;1;70;1;38198911264
64;4096;32;8;63;8190;9856032
16;1;1;1;70;1;5471987008
64;4096;32;8;117;1;445921120
64;8192;64;1;117;630;22144224
512;8192;32;8;35;8190;10333920
64;8192;32;8;117;1638;9244128
128;8192;32;8;70;2730;7682144
128;4096;8;1;234;39;60114848
16;32;2;4;195;130;151965856
2048;1024;256;16;126;2730;18446744073709551615
64;4096;2;64;30;10;50488832
64;8;32;8;70;4095;161629536
64;8192;32;8;70;10;48924704
16;1;16;1;70;910;4785882816
64;8192;64;8;90;910;15062656
32;8192;16;8;45;1638;13571616
32;8192;32;32;70;4095;10688416
64;8192;16;32;70;4095;9330400
256;128;64;4;42;819;13312768
8;2048;8;128;1;26;1564661696
256;8;1;4;819;234;231880736
2048;4096;1;2;90;78;169210400
128;4096;32;8;70;1;380149024
64;1;32;1;90;4095;1208737152
64;8192;32;8;9;4095;7449536
128;8192;2;8;45;4095;36067136
64;8192;8;8;70;4095;20605440
4;8192;4;8;70;195;27318496
64;8192;32;128;70;455;18446744073709551615
64;1;32;1;70;1638;1487103520
64;1;32;1;14;4095;1218996864
64;8192;32;8;130;1;534869024
64;8192;32;8;90;1365;9421088
64;128;1;128;70;390;74834496
256;1;8;1;1365;1170;1365078848
4096;32;16;1;39;10;61908864
16;128;16;1;1;390;38196128
64;1;32;1;70;910;1399664832
128;1;32;1;70;4095;1219080256
256;2048;32;8;70;4095;6375296
64;1024;32;8;70;5;97927264
64;8192;1;8;70;65;49802656
256;8192;16;8;70;4095;11238688
128;8192;32;8;42;1638;7971424
2048;128;1;1;90;2;374407360
1;4;1;4;8190;78;15427916320
2048;2;64;2;234;182;32565248
8192;8192;8;8;455;210;20319360
64;8192;32;8;585;117;17586080
64;256;32;8;70;4095;7442848
64;8192;8;8;117;4095;18999680
64;2048;32;8;39;4095;6676512
8;2048;4;8;90;4095;21820032
1;2048;1;16;1;130;450421056
4;1024;2;64;105;1;79206528
512;64;1;2;195;26;161552448
2048;64;16;4;7;4095;46156288
64;1;32;1;70;4095;1208735456
64;8192;32;8;70;15;32649760
64;8192;32;8;35;4095;6697824
64;8192;64;8;70;819;11076192
64;8192;32;32;45;4095;10886976
2048;512;1;2;7;195;179855648
64;4096;4;16;3;8190;51476800
32;1024;16;256;630;26;18446744073709551615
256;1024;8;8;15;42;14695488
64;2;16;2;70;4095;1242849728
64;8192;32;16;70;1;393892192
64;8192;32;8;39;2730;7968608
128;8192;32;8;15;455;7463712
512;8;32;2;18;105;26766976
512;256;32;1;10;195;15293792
256;8192;8;8;195;65;17272704
8;512;2;2;130;3;243937120
8;8192;2;8;70;13;41808832
1;16;1;8;70;4095;4377623456
16;8192;1;8;42;4095;64302080
64;1;1;1;39;4095;26042281632
64;8192;32;8;90;630;9969696
16;8192;1;8;105;8190;137338144
4096;128;32;8;390;65;12908864
8192;128;2;128;195;1;148539168
1;4096;1;16;234;39;155011968
16;8;4;1;195;182;608418112
64;1;32;1;70;4095;1208744608
64;8192;16;8;70;4095;10407136
64;8192;1;8;70;2730;63126784
64;8192;16;16;35;4095;9395584
64;8192;32;8;126;8190;10470208
1024;1024;2;1;234;630;219812800
16;128;8;64;1;13;3623346720
256;8;32;2;91;819;62293696
512;1;64;1;65;26;544856608
4;8192;4;8;10;4095;26864352
64;8192;32;8;78;4095;6952544
128;8192;32;8;70;90;10280064
64;2048;16;1;117;4095;46529792
32;4096;2;8;78;4095;45721056
256;2;16;2;3;210;269491616
2048;4096;32;1;14;78;17877184
2048;128;4;128;39;390;29444544
256;8192;4;1;1365;1170;399733216
64;8192;32;2;42;4095;9554400
64;1;8;1;70;4095;4678224576
64;8192;32;8;546;45;26402880
256;8192;32;8;70;1;370810048
64;8192;8;2;70;2730;32429920
64;8192;64;8;117;4095;8790432
64;8192;32;8;117;8190;10551200
4096;4096;4;512;91;10;18446744073709551615
16;128;4;1;1;390;100885312
2048;128;512;1;21;455;16922496
2048;4;8;1;3;91;57636416
8;8192;4;8;70;4095;30330688
64;8192;32;8;91;4095;7713696
2048;2;128;2;234;182;39682112
8192;8192;2;8;6;210;41440256
2;512;2;256;13;8190;1459657664
4;1024;1;64;105;91;44525184
4096;8192;32;8;70;4095;8261920
8;1024;1;4;195;1;176893056
2048;64;256;16;7;26;18446744073709551615
2048;1024;512;1;1365;195;34450080
128;4096;4;16;3;15;48029952
64;8192;32;8;90;1;372693632
256;8192;64;8;90;4095;7227200
64;8192;32;2;14;4095;8759776
2048;8192;32;8;70;4095;8004480
64;256;32;16;455;4095;11425408
128;8192;32;8;70;8190;11270816
32;256;16;4;130;70;15171488
256;1024;4;8;14;42;17918144
512;64;32;1;18;105;17665664
32;256;32;1;10;195;24251104
64;8192;32;2;45;2730;14082304
64;8192;8;8;70;1365;17633568
16;8192;1;8;70;4095;85213728
64;32;4;8;105;4095;371520320
64;8192;2;8;70;195;29409792
64;8192;32;4;39;4095;7494656
256;8192;32;1;7;65;20520960
8192;512;32;2;15;455;10577728
4096;64;32;8;14;63;10934080
128;1024;2;128;182;1;164033696
128;8192;8;8;70;1365;17768000
64;8192;32;8;70;78;11756256
64;32;32;8;105;117;54011744
32;1;32;1;70;8190;2428973312
64;8192;32;8;210;4095;6748480
128;1;8;1;234;39;691501152
16;4096;1;64;195;130;147821248
1024;512;8;1;126;9;97754304
64;2048;64;64;30;13;18446744073709551615
64;8192;32;1;546;13;284389216
64;8192;32;128;70;4095;18446744073709551615
64;512;32;8;70;4095;7618208
64;8192;16;8;210;4095;12860448
64;8192;32;32;70;1;387093632
1;64;1;4;91;819;1073399424
512;4;256;2;65;1;12323201984
1024;8;1;4;130;234;237242240
2048;4096;32;2;90;1;379353824
2048;128;4;128;1;390;740696672
32;8192;32;16;1365;1170;30014272
256;1;16;1;91;10;696630048
16;128;16;1;585;390;354955328
64;8192;1;1024;70;4095;177521248
64;128;32;8;70;2;286298368
2048;128;512;16;6;26;18446744073709551615
2048;4096;8;1;8190;18;95079168
2048;2;32;2;234;1;782211392
1024;8192;8;8;6;210;13262048
64;64;32;8;4095;4095;79279008
64;4;2;4;70;4095;4279790112
64;1;32;1;70;195;1428010496
2;16;2;8;13;8190;2533901824
4;1024;2;64;105;45;33188512
8;1024;1;8;195;26;61963648
2048;1;256;1;7;4095;162660512
1;8192;1;8;26;455;77709408
64;8192;32;512;70;4095;18446744073709551615
128;512;2;1;90;195;157405472
128;4;4;2;18;15;175306720
32;256;16;4;1638;13;225915296
256;512;1;8;15;42;50301984
16;8192;1;8;70;78;51604576
32;64;8;1;9;195;75261312
512;256;32;1;10;5;122092224
256;1;32;1;6;65;468623104
1;8192;1;2;15;455;194655232
1;8192;1;8;70;4095;80940864
4096;8192;128;8;70;4095;10093536
4096;8192;32;8;4095;1;399091488
8192;1024;2;128;182;3;25382688
128;4096;8;16;234;42;20099904
16;8192;4;256;195;130;23582624
64;1024;32;8;70;234;9581824
64;16;32;4;70;4095;78431552
64;8192;1;16;70;4095;59190656
1024;1024;4;2;126;9;68608736
8192;2048;1024;1;26;13;668384128
256;64;64;4;91;819;13228736
512;4;16;2;6;90;46560288
64;8192;32;1;70;4095;22158976
