GLOBAL_SIZE_0;GLOBAL_SIZE_1;GLOBAL_SIZE_2;LOCAL_SIZE_0;LOCAL_SIZE_1;LOCAL_SIZE_2;cost
128;256;256;2;8;32;18446744073709551615
128;1;64;1;1;2;490623017
32;64;256;8;2;2;194013043
64;32;1;16;4;1;337799087
32;8;256;8;1;2;197516090
32;64;256;8;2;16;233331632
8;32;4;4;32;2;290275804
16;256;1;8;128;1;18446744073709551615
32;32;256;8;4;2;202092547
64;64;1;4;2;1;291180672
64;64;256;4;2;1;210366544
1;1;256;1;1;4;1785813702
32;64;256;8;4;2;200082675
256;8;16;256;2;2;18446744073709551615
16;8;16;8;2;8;227206669
32;64;128;8;4;2;221602672
32;64;32;8;2;2;197652042
32;64;256;8;8;2;218424507
64;32;128;16;8;8;18446744073709551615
2;1;1;2;1;1;20377838265
4;4;128;4;1;32;262785506
64;128;1;1;16;1;2455729402
32;64;256;4;2;2;194282048
32;64;256;8;2;1;200011375
16;64;256;16;2;2;191540800
32;128;128;8;1;8;223921963
16;64;128;16;1;2;192645377
16;64;128;16;2;2;192599423
8;64;128;2;2;4;268231842
16;64;64;16;2;8;200122375
16;32;256;16;4;2;197276916
16;64;256;16;2;1;205684960
16;128;256;16;128;2;18446744073709551615
16;8;256;16;1;2;199030132
64;8;2;64;1;2;258104128
16;128;32;8;1;2;194223127
32;64;128;8;2;2;195048837
8;64;256;2;2;2;167934087
16;128;256;16;1;2;191704712
8;64;128;2;1;2;177743798
8;64;256;2;2;1;176554629
4;32;256;1;4;2;702837733
8;128;256;2;1;4;165349084
8;64;256;2;2;4;193867920
8;64;256;2;4;2;236311050
8;128;256;2;128;4;18446744073709551615
4;256;256;1;1;2;319719005
8;128;128;2;2;2;168891335
4;32;128;1;4;4;902856834
8;128;1;2;1;1;390666137
8;256;256;2;256;4;18446744073709551615
8;128;256;2;1;2;170149839
8;128;256;1;1;4;165830292
8;128;256;2;2;4;164824416
4;1;256;1;1;4;495997931
8;256;256;2;1;4;165881506
8;256;256;1;1;4;168399709
8;128;1;2;2;1;193673710
16;128;256;16;2;4;183107417
8;128;128;2;2;4;192521548
8;32;256;2;8;1;368053928
8;128;256;2;2;8;210100128
4;128;1;2;2;1;839264350
16;128;256;16;2;8;189452340
8;64;256;1;4;4;686726101
8;128;256;1;2;4;313891715
1;128;1;1;2;1;1203538125
32;128;256;8;1;4;197563590
8;256;128;2;1;4;166927340
4;128;256;1;2;4;450488384
4;128;256;1;2;16;551396062
8;128;256;1;2;2;168334460
4;128;128;4;2;4;174078629
8;128;256;2;2;2;168156043
8;64;256;2;4;4;256462251
8;128;1;8;2;1;207691377
4;128;256;1;128;4;18446744073709551615
4;64;256;1;4;4;659810428
32;64;64;8;4;4;275760218
4;128;256;4;2;4;167593548
8;128;64;2;2;4;261839839
8;128;256;1;1;2;343652545
8;128;1;2;2;1;194997918
8;128;128;1;128;2;885289191
8;64;128;2;4;4;303474168
16;128;256;8;2;4;183968673
8;32;256;2;8;4;329947340
8;128;256;2;2;1;176369420
8;256;1;1;1;1;718180527
8;64;256;2;64;4;18446744073709551615
4;64;16;1;4;4;1663135125
8;256;1;1;256;1;2152786426
8;64;256;2;4;1;177752379
2;128;256;2;2;4;199936175
8;128;128;1;2;4;534890936
2;128;256;1;1;4;276460629
32;64;128;8;4;4;242126592
64;128;64;4;2;4;227767050
8;128;1;2;2;1;194616003
16;32;16;8;2;1;217754795
8;256;256;2;1;1;351477634
8;256;64;2;1;4;195696713
4;256;64;1;1;4;277475669
8;64;1;2;1;1;395781460
16;128;64;16;2;4;184960340
128;1;1;64;1;1;430736918
4;256;1;1;64;1;1468279174
1;1;64;1;1;16;2058344316
1;1;256;1;1;4;1790270923
8;64;128;2;4;16;369417175
2;128;128;2;2;4;225753962
8;128;1;1;1;1;729519606
64;8;128;32;2;4;300999463
16;64;256;16;4;4;188087505
8;128;32;1;2;8;1165575244
16;256;256;16;1;4;188466584
16;1;1;16;1;1;3214268173
8;4;256;2;1;4;388609338
8;4;256;1;1;4;251589800
8;128;64;1;32;4;996154001
8;64;256;2;1;4;167744253
16;128;128;4;2;4;186786837
32;4;8;2;2;4;752367886
1;16;256;1;1;8;933627889
128;16;32;16;1;1;261183635
64;16;2;32;8;2;18446744073709551615
1;1;1;1;1;1;40719098959
8;64;1;2;4;1;248538626
4;128;128;1;1;8;657642059
128;4;64;64;4;8;18446744073709551615
8;128;256;4;2;4;165320586
8;32;256;2;8;128;18446744073709551615
8;32;256;1;8;4;880674265
32;128;256;4;2;2;195663549
4;256;256;1;1;8;372125761
16;64;256;16;4;8;18446744073709551615
1;1;1;1;1;1;40719292488
32;1;1;8;1;1;1504553207
64;128;256;4;32;16;18446744073709551615
1;1;256;1;1;8;1791446884
16;16;16;2;16;4;1981143835
32;16;8;32;8;8;18446744073709551615
16;32;8;8;1;8;232086505
32;16;64;16;2;16;18446744073709551615
8;128;256;8;2;4;169258258
8;32;128;2;8;8;434580256
16;128;256;16;2;2;191227919
2;128;1;2;2;1;668197903
64;128;256;4;2;4;203590298
8;128;256;1;2;32;647875047
8;256;256;2;1;4;166185376
8;32;128;2;8;4;368379427
16;64;32;1;2;1;423162386
64;64;32;1;1;1;1006379293
32;64;32;16;1;1;204724339
64;256;128;8;128;4;18446744073709551615
2;256;256;2;1;4;196122174
32;16;16;32;4;16;18446744073709551615
128;8;64;32;1;16;18446744073709551615
8;128;1;2;128;1;1955728505
8;128;256;2;2;16;226354589
32;128;256;8;2;4;197767213
8;128;32;2;2;4;304733043
2;64;1;1;32;1;700252434
8;128;256;2;8;4;246152631
4;32;256;1;8;2;764747517
8;128;256;4;128;4;18446744073709551615
8;32;4;8;1;2;232675341
2;128;256;1;128;8;18446744073709551615
4;32;2;1;8;1;1409139024
16;8;256;8;8;32;18446744073709551615
4;16;16;4;16;16;18446744073709551615
8;128;256;2;4;16;241775716
8;128;32;2;2;4;316258637
8;128;256;2;2;4;168606340
8;16;16;8;1;16;227332466
4;16;1;2;2;1;1509988336
1;64;64;1;4;64;1208508647
256;1;128;32;1;2;292843719
2;2;32;2;2;8;615574897
1;128;256;1;8;1;558664186
8;16;4;1;2;2;258129719
4;128;256;1;2;2;192297625
4;128;256;1;2;8;529064019
16;128;256;16;1;1;200122133
8;32;256;2;4;4;301179000
8;64;256;2;4;8;260452339
8;1;256;2;1;4;425104879
8;128;128;1;2;2;172075877
8;128;128;2;1;2;173663629
4;128;256;1;1;8;512116506
8;64;256;8;4;4;173810797
8;256;1;2;1;1;380268212
32;128;128;8;2;4;203306627
8;128;256;2;1;8;232750712
8;256;256;2;1;16;222871757
16;128;1;16;2;1;209594542
4;128;256;1;1;4;200010509
4;64;256;1;4;8;656919020
8;128;1;1;2;1;370357424
8;256;256;2;1;2;173114129
4;128;1;1;2;1;349629001
2;128;256;2;2;2;200209591
16;64;256;8;2;4;188056758
4;128;256;2;2;2;169257503
16;128;256;4;2;16;217979089
4;64;1;1;4;1;1220027676
4;32;256;1;8;4;756750669
8;1;256;2;1;2;196746460
8;128;256;1;2;1;349715925
8;128;32;2;2;2;172656629
4;128;256;2;128;2;18446744073709551615
8;256;1;1;128;1;1900988458
8;128;256;1;128;4;18446744073709551615
8;256;64;2;1;8;297250134
8;1;256;2;1;4;393457041
8;128;128;1;1;4;173044625
8;1;256;1;1;4;215802546
16;256;256;16;1;2;193517754
8;128;1;8;2;1;206160335
4;128;128;1;1;4;287513752
4;64;256;1;4;1;226168676
8;256;1;2;1;1;381266629
8;1;256;8;1;2;206306256
4;64;256;1;4;2;601266184
8;32;128;2;4;2;349022382
8;1;64;2;1;4;223489752
8;128;128;2;1;4;186146837
4;128;256;2;2;4;201573583
16;128;128;16;2;2;192148041
8;128;1;2;1;1;391717636
8;128;64;1;2;16;1079065997
16;128;1;16;1;1;225622336
16;64;256;16;2;4;183000834
8;256;256;1;256;4;18446744073709551615
8;64;1;2;2;1;201053213
16;256;256;16;128;2;18446744073709551615
32;128;256;4;2;4;197797798
32;64;256;8;4;4;217549965
16;128;256;16;1;4;190373168
4;256;256;1;1;4;176992129
32;256;256;8;1;4;196646335
16;128;256;8;1;2;191427417
8;128;128;2;2;8;244700502
8;64;64;2;4;4;358494472
16;128;256;8;2;8;190654170
4;128;64;1;2;4;721863377
16;128;128;16;2;4;184557421
8;128;1;2;2;1;233492210
8;256;256;2;1;8;179480839
16;64;256;16;4;2;192617380
16;128;256;4;2;4;183635462
8;64;1;4;4;1;208883083
8;1;1;2;1;1;5746883511
16;64;128;8;2;4;190614084
8;64;256;1;1;2;347919297
8;128;64;2;2;8;291360259
8;128;128;2;2;16;250791136
16;64;1;16;4;1;222385843
4;64;128;1;4;4;788254529
4;1;256;1;1;4;851152804
16;1;256;16;1;1;228339255
2;256;256;2;64;4;18446744073709551615
128;128;256;2;2;4;211577380
256;128;256;1;2;8;266521631
8;128;256;2;2;256;18446744073709551615
8;16;256;2;16;4;367469137
16;128;128;16;1;4;193001212
8;128;64;2;1;4;193255710
4;16;8;4;4;4;1691741439
1;64;1;1;2;1;2320797970
32;64;1;1;64;1;2514574643
16;4;1;1;2;1;1569112000
8;16;8;8;16;2;183422209
32;128;1;4;2;1;195875711
2;16;2;1;4;2;1482646184
4;256;256;4;256;4;18446744073709551615
8;128;256;2;64;4;18446744073709551615
8;2;256;2;2;4;390236126
1;128;256;1;128;4;18446744073709551615
4;16;4;4;2;1;1327142249
32;16;32;32;2;1;202698585
2;128;8;1;1;8;2036004259
2;32;1;1;4;1;1461017102
64;32;1;4;8;1;536511295
2;1;1;2;1;1;20378109667
64;16;32;2;2;16;1834715056
16;16;8;16;2;1;226675920
8;1;256;2;1;128;847367343
8;8;256;2;1;4;360221636
8;128;256;2;32;4;261534543
256;128;256;1;2;1;484409389
64;4;32;8;1;16;468364850
16;32;8;8;1;1;226055462
4;128;1;1;2;1;350153335
4;4;128;2;1;32;717449884
64;256;1;1;16;1;2124746979
1;256;1;1;64;1;1095835357
1;256;64;1;16;16;659356211
16;4;64;8;1;64;18446744073709551615
8;64;256;2;1;2;174055418
8;64;128;1;4;4;834282751
16;32;16;8;1;16;288077256
8;256;256;2;256;4;18446744073709551615
8;1;64;2;1;4;264943132
1;1;256;1;1;4;1796216475
16;16;16;16;1;2;201193668
16;32;16;8;1;1;223283257
16;32;8;8;32;2;18446744073709551615
16;16;8;16;1;2;206532005
8;128;2;2;8;1;1495421187
64;128;128;4;2;4;214023086
8;1;256;2;1;64;612685691
1;16;1;1;1;1;3256010187
128;2;1;16;2;1;218176381
64;16;32;32;8;2;18446744073709551615
1;1;1;1;1;1;40719124905
8;16;16;8;1;1;206001085
32;1;1;8;1;1;1505013063
16;32;8;8;32;1;255506300
64;64;256;4;32;4;18446744073709551615
16;4;8;8;4;2;357833381
64;128;256;1;2;4;204150666
8;16;2;2;16;1;342572094
8;128;4;2;2;4;1405330231
16;8;8;8;2;2;255648876
1;2;256;1;2;1;594148438
16;64;32;1;64;2;1562625925
64;64;32;1;64;1;1990029210
32;64;1;32;1;1;205338461
16;64;8;8;32;2;18446744073709551615
8;128;256;2;2;32;250484593
8;128;256;2;4;4;217161300
16;16;8;8;1;2;206377504
128;128;256;16;2;4;210004710
8;128;256;2;2;64;324087717
16;4;8;8;4;8;263231671
8;256;128;1;256;4;18446744073709551615
32;128;256;8;2;8;203981132
16;32;16;8;32;1;258355341
64;256;1;8;16;1;381256460
2;128;256;2;128;8;18446744073709551615
4;1;64;1;1;16;602053085
16;4;2;8;4;2;559279458
16;1;1;16;1;1;3222325805
1;1;64;1;1;64;2076850362
256;1;64;32;1;2;308804757
8;1;32;2;1;4;207178751
1;128;128;1;2;8;610227857
128;1;256;2;1;4;415380753
8;128;256;8;2;8;167008417
8;8;256;2;2;4;316646677
2;2;1;2;2;1;10166799048
8;128;256;8;8;1;179348048
1;64;1;1;4;1;2015889376
16;64;1;16;32;1;18446744073709551615
8;128;1;2;2;1;210306752
8;1;256;2;1;8;541921673
16;4;1;1;2;1;1570123393
2;128;8;1;1;8;2028779584
64;32;1;8;8;1;402294891
8;128;256;1;2;32;643922964
8;128;256;2;128;4;18446744073709551615
8;128;1;4;2;1;230863922
1;128;256;1;2;4;505142224
8;128;256;2;4;128;18446744073709551615
8;128;8;1;2;4;1554607634
8;128;256;2;1;1;350044970
8;4;256;8;1;1;194704757
8;1;256;1;1;4;207295425
8;128;256;2;16;4;264731052
8;128;256;2;2;4;164857756
8;128;256;1;2;4;281838293
8;128;8;2;2;4;1327391635
8;128;256;4;2;4;165538959
8;1;256;2;1;16;499528501
8;128;1;2;2;1;246789917
1;2;256;1;2;4;1118709596
64;2;256;4;2;4;301033918
8;128;256;1;128;4;18446744073709551615
8;128;256;1;2;1;349542718
8;1;256;2;1;4;437161884
64;128;128;4;2;16;287075048
8;128;256;2;2;4;167237255
1;128;256;1;2;4;503889480
16;128;8;16;2;4;185401631
8;128;256;2;32;2;263192882
8;128;16;2;2;4;833678923
8;8;256;4;2;4;203331505
1;64;256;1;1;256;1719330191
256;128;256;8;2;4;243027833
8;256;256;8;1;4;169213085
2;4;256;2;1;4;496212393
1;2;256;1;2;256;18446744073709551615
8;128;256;8;2;4;169672292
8;128;256;2;2;128;18446744073709551615
256;16;256;1;16;4;700063387
8;8;1;2;2;1;771734212
16;32;256;16;8;4;18446744073709551615
8;128;2;2;2;1;192466168
8;128;1;4;2;1;228250591
8;2;256;1;2;4;1028334248
128;128;256;2;2;1;225453921
8;128;32;2;2;8;346854426
8;16;256;2;16;128;18446744073709551615
64;1;2;4;1;2;514263587
2;1;32;1;1;8;1369782053
4;4;64;4;1;32;1218063071
64;256;1;64;16;1;18446744073709551615
8;128;256;4;2;32;192455840
256;8;256;1;8;4;774997460
1;32;1;1;1;1;3193505260
1;256;64;1;1;16;766485606
1;1;256;1;1;2;1125011099
1;1;256;1;1;1;833692743
8;128;32;2;1;4;370765263
8;128;32;2;2;4;326892460
128;1;32;16;1;1;272708087
64;128;2;32;8;2;18446744073709551615
1;8;1;1;8;1;5173122917
32;1;1;1;1;1;3760430638
1;128;2;1;2;1;1036246009
16;128;256;16;32;4;18446744073709551615
8;128;8;2;4;4;1515893883
256;128;256;1;2;256;18446744073709551615
8;128;128;2;2;1;178048670
1;128;256;1;32;1;559164467
32;2;256;8;2;1;214084300
64;64;32;1;2;1;503903711
64;1;1;16;1;1;1078969408
32;128;256;8;2;1;203104380
8;2;256;4;2;4;238502009
8;32;256;1;32;1;886809489
32;2;1;8;2;1;758996310
1;1;256;1;1;2;1122772959
4;1;64;4;1;16;364516304
8;128;256;1;2;4;312773763
1;128;256;1;2;32;537186226
1;128;256;1;32;4;566887770
8;128;256;1;2;16;585558726
16;16;1;16;1;1;216007667
1;64;2;1;4;1;1140042618
256;1;128;1;1;2;466130798
2;2;32;2;2;1;568410175
4;128;256;4;2;8;166562792
8;128;256;8;4;1;179482255
1;64;1;1;2;1;2296403212
32;64;1;1;4;1;274314548
128;4;1;1;2;1;583120093
2;128;8;1;64;1;1686150167
64;32;1;2;4;1;266345002
1;2;2;1;2;2;9967449915
2;1;32;1;1;1;2508016353
256;128;256;2;2;4;236949088
1;4;1;1;1;1;9956531750
2;2;32;2;1;1;733294467
1;256;256;1;64;1;515448597
1;2;32;1;1;4;2022591836
64;128;256;2;2;64;645208275
8;1;256;2;1;4;404833099
4;32;256;4;8;64;18446744073709551615
2;1;256;2;1;32;622085691
1;1;256;1;1;1;832330043
128;2;1;16;1;1;290617341
64;16;2;32;1;2;321788340
8;128;256;2;2;1;176278128
8;32;256;2;16;4;343118010
1;8;1;1;1;1;5075246089
32;32;1;8;8;1;405404724
1;1;1;1;1;1;40719199333
4;2;256;1;2;1;373100848
8;128;256;2;1;4;165826132
16;64;32;16;2;1;218389506
64;64;32;1;1;1;1006275461
32;64;32;16;1;1;204701044
1;256;1;1;16;1;1093147450
8;128;1;8;2;1;207141129
64;128;256;4;2;128;18446744073709551615
8;2;256;1;2;4;972803903
2;1;256;2;1;2;629391560
4;1;64;1;1;4;319398461
16;16;1;16;8;1;217549712
4;64;1;1;4;1;1151762586
8;128;256;1;2;256;18446744073709551615
128;128;256;1;2;4;214391212
256;1;128;32;1;8;296270628
1;2;128;1;2;64;1479727174
8;128;256;1;8;1;434415250
1;16;1;1;16;1;3309549260
8;1;256;2;1;4;424382085
8;1;256;2;1;4;401059265
32;64;256;1;4;1;234922381
128;4;1;1;4;1;220714459
1;2;8;1;1;1;2855578243
64;1;1;4;1;1;1079009103
16;128;1;16;2;1;211557545
16;128;256;16;2;1;200685925
16;128;256;16;1;8;193353588
4;128;128;4;1;4;190244210
16;128;128;16;2;8;194442462
8;128;1;8;1;1;224058213
8;128;128;2;128;4;18446744073709551615
8;128;256;8;2;8;167872751
8;256;128;2;256;4;18446744073709551615
4;128;128;1;2;4;584882353
8;1;256;1;1;8;1040214972
16;256;128;16;1;4;190912460
4;128;64;4;2;4;186006631
8;256;64;2;256;4;18446744073709551615
16;1;256;16;1;8;227673547
8;1;128;2;1;4;277515178
4;256;256;4;1;8;168002128
16;256;1;16;1;1;213495383
8;128;1;1;128;1;2043656014
32;128;256;4;2;8;221273508
4;128;128;2;2;4;232350170
4;128;256;4;2;2;168022839
16;64;256;4;4;4;211931006
8;64;64;2;4;16;476424934
8;128;256;4;2;8;176156546
16;64;128;16;4;2;197096694
2;128;32;2;2;4;350787295
8;256;1;2;256;1;18446744073709551615
8;128;256;2;128;2;18446744073709551615
4;256;256;4;1;4;166118419
2;128;256;2;2;8;210278800
16;256;128;8;1;4;186869421
2;128;64;2;2;4;264522885
4;64;256;4;2;4;175402918
2;128;128;2;128;4;18446744073709551615
1;128;256;1;2;4;502738309
8;64;64;2;2;4;319059136
2;128;256;1;2;4;478491515
2;64;256;2;4;4;232068215
16;32;256;16;8;8;18446744073709551615
16;128;256;16;128;8;18446744073709551615
8;128;256;1;2;8;535702342
8;128;256;2;128;8;18446744073709551615
8;16;256;2;4;4;329335632
8;32;128;2;4;4;343172877
4;32;256;1;4;4;748453353
8;64;256;8;4;2;171702294
16;128;1;8;2;1;209751256
2;64;256;1;4;4;616303333
16;64;256;8;1;4;186762293
4;64;256;1;2;8;657895348
8;256;256;8;1;2;174107378
32;32;256;8;8;4;254413135
16;64;256;8;4;4;184293255
1;128;256;1;2;1;422536836
1;128;256;1;1;4;513726683
32;256;64;8;1;4;204188962
16;32;1;16;8;1;217675753
