epoch;GLOBAL_SIZE_0;GLOBAL_SIZE_1;LOCAL_SIZE_0;LOCAL_SIZE_1;v_TP_715;v_TP_716;cost
1505165126;64;1;2;1;124;3;4778348681
1505165127;1;2048;1;128;372;4092;18446744073709551615
1505165127;128;256;64;16;62;33;18446744073709551615
1505165130;16;4;1;4;11;6;1839337450
1505165131;2;1024;2;2;44;124;521160086
1505165134;1;1024;1;1;1;93;1712442025
1505165134;32;256;8;128;341;11;18446744073709551615
1505165135;128;8;16;8;124;2046;18446744073709551615
1505165136;32;8;4;8;4;186;664347097
1505165137;2;64;2;64;1023;93;18446744073709551615
1505165138;256;4;8;4;12;186;393391302
1505165141;4096;8;1;4;132;682;1664238569
1505165142;2048;512;1;4;93;4;334416428
1505165143;4096;16;2;16;11;33;497219880
1505165147;2;16;2;16;11;1023;3512140335
1505165149;4096;1;4;1;1;62;931521606
1505165149;4;256;4;64;6;11;18446744073709551615
1505165151;8;32;1;32;66;1023;1091455306
1505165152;128;16;16;2;132;1364;597636917
1505165155;1;2048;1;4;1;93;1390931716
1505165155;256;1024;16;64;1;682;18446744073709551615
1505165156;4096;2048;4;1;372;22;453282389
1505165157;128;8;8;4;93;31;414521291
1505165159;32;2048;1;2;93;1364;1011302700
1505165161;32;512;8;4;12;4;572148434
1505165162;2048;512;1;4;62;33;392603793
1505165163;2048;512;1;64;93;4;419057392
1505165164;1;512;1;4;93;12;622063688
1505165165;16;128;4;32;132;341;18446744073709551615
1505165166;4096;2048;8;128;33;372;18446744073709551615
1505165247;1;1;1;1;93;22;80196264342
1505165248;4;1024;2;4;93;124;403328168
1505165249;2;512;2;4;93;4;515012166
1505165250;4096;64;1;2;66;4;507359183
1505165251;2048;512;2;128;93;4;18446744073709551615
1505165251;2048;32;128;4;93;4;18446744073709551615
1505165252;256;512;1;256;186;372;18446744073709551615
1505165253;4096;1;32;1;4092;132;485450919
1505165257;64;1;4;1;2;186;2303576242
1505165385;4;1;2;1;1;1;127615130150
1505165386;2048;256;128;4;132;4;18446744073709551615
1505165387;4096;512;1;4;93;4;332187710
1505165388;1024;512;1;4;31;4;323970839
1505165388;8;256;2;128;93;124;18446744073709551615
1505165389;1024;128;1;4;31;4;338310256
1505165390;256;512;1;4;31;4;327238923
1505165391;1024;512;1;4;12;2;497804212
1505165393;1024;1;1;1;11;4;941271238
1505165394;256;1024;1;8;33;4;344889169
1505165395;1024;512;256;4;31;4;18446744073709551615
1505165395;1024;128;256;4;31;4;18446744073709551615
1505165396;128;512;2;4;31;4;338247253
1505165397;1024;2048;256;4;31;3;18446744073709551615
1505165398;128;1024;2;4;12;4;332961918
1505165399;512;512;1;4;12;3;451892013
1505165401;1024;1024;1;1;31;4;854221188
1505165402;1024;1024;1;4;31;4;324008962
1505165403;1024;512;256;16;31;3;18446744073709551615
1505165404;1024;512;1;4;31;6;402236509
1505165405;1024;512;1;4;62;4;329495762
1505165406;1024;512;1;4;33;4;339626177
1505165407;2048;1024;1;4;31;4;315927592
1505165408;2048;1024;1;1;31;4;846874333
1505165410;1;512;1;4;31;4;866618170
1505165411;256;512;1;4;31;2;494246718
1505165412;2048;1024;256;4;31;4;18446744073709551615
1505165413;2048;1024;1;2;124;4;521769931
1505165414;2048;1024;1;4;22;4;320907344
1505165415;2048;2048;1;8;22;4;300417466
1505165416;1024;2048;1;4;31;2;479222792
1505165417;2048;1024;256;2;31;4;18446744073709551615
1505165418;2048;4096;1;8;22;4;304887593
1505165418;2048;4096;256;8;31;4;18446744073709551615
1505165419;2048;4096;1;16;31;11;413387295
1505165420;2048;2048;1;8;31;4;300314884
1505165421;2048;2048;256;16;31;4;18446744073709551615
1505165422;2048;2048;1;8;11;6;526375972
1505165423;2048;1024;1;8;22;4;311617427
1505165424;2048;2048;1;8;22;12;394379966
1505165425;2048;512;1;8;31;4;314308210
1505165427;4096;2048;1;8;31;3;471492846
1505165427;2048;2048;256;4;12;12;18446744073709551615
1505165429;2048;1024;1;2;31;6;731348945
1505165430;2048;1024;1;8;31;3;465527263
1505165431;1;2048;1;8;44;4;556560417
1505165433;2048;2048;1;8;6;2;785732065
1505165433;2048;4096;256;8;124;4;18446744073709551615
1505165435;2048;2048;1;8;31;3;466332548
1505165436;256;2048;1;32;31;4;358150098
1505165437;2048;2048;1;32;31;4;366994261
1505165438;2048;2048;1;8;12;4;333123000
1505165553;1;1;1;1;31;2;114757187875
1505165554;1024;2048;1;8;33;4;343119338
1505165555;1;4096;1;8;6;4;523394764
1505165558;2048;1;1;1;31;22;1774034343
1505165558;2048;2048;256;16;31;2;18446744073709551615
1505165559;2048;2048;256;8;12;4;18446744073709551615
1505165561;4096;1;32;1;1023;124;555757458
1505165561;256;256;8;128;341;62;18446744073709551615
1505165564;256;1;1;1;31;3;1858518679
1505165565;512;2048;1;4;11;4;331927262
1505165566;2048;32;4;8;31;4;377749387
1505165567;2048;2048;1;8;31;4;300722626
1505165568;8;2048;2;8;682;4;470750684
1505165570;2048;2;1;2;31;3;865602952
1505165570;2048;1;256;1;31;1;18446744073709551615
1505165571;2048;4096;1;8;31;12;380575548
1505165572;2048;2048;1;16;31;6;433280171
1505165574;2048;2048;1;8;22;3;490164548
1505165574;512;256;128;1;2046;1;18446744073709551615
1505165589;1;256;1;1;372;1;14469741000
1505165591;16;256;8;4;132;44;403898336
1505165593;256;32;8;1;1364;372;1057732086
1505165595;32;32;1;16;11;341;630786543
1505165596;2048;2048;1;8;33;3;506768837
1505165596;2048;2048;256;8;31;3;18446744073709551615
1505165597;64;64;32;32;33;132;18446744073709551615
1505165598;2048;2048;1;8;44;4;315913136
1505165599;2048;2048;1;4;31;4;318344718
1505165600;2048;2048;256;8;31;4;18446744073709551615
1505165601;2048;2048;1;8;44;6;412605417
1505165602;2048;1024;1;8;12;4;341801879
1505165603;2048;1024;1;8;31;11;392234056
1505165604;2048;2048;128;8;44;4;18446744073709551615
1505165605;512;512;1;8;31;4;324789169
1505165606;1;2048;1;8;31;4;711553684
1505165607;512;2048;1;8;31;4;316388010
1505165609;2048;1024;1;8;132;2;485283811
1505165610;2048;2048;1;8;33;22;425022128
1505165611;4096;2048;1;32;33;4;505963084
1505165612;4096;2048;128;8;33;4;18446744073709551615
1505165613;2048;1024;1;8;31;4;299882842
1505165613;2048;1024;256;8;44;4;18446744073709551615
1505165614;2048;256;1;8;31;4;328502421
1505165615;1024;1024;1;8;31;4;316685469
1505165616;2048;512;1;8;22;4;328177885
1505165617;2048;1024;1;4;124;4;346697507
1505165618;2048;1024;1;8;62;3;458171425
1505165619;2048;1024;256;8;3;1;18446744073709551615
1505165621;4096;1024;1;16;4;12;1376771833
1505165622;1024;2048;256;8;31;4;18446744073709551615
1505165623;2048;512;1;8;31;6;407298963
1505165624;2048;1024;1;8;11;4;359741884
1505165625;2048;1024;1;8;33;4;323413930
1505165626;4096;1024;1;8;31;6;406509294
1505165627;4096;1024;1;8;31;4;291441927
1505165629;2048;1024;1;8;12;1;805346926
1505165630;2048;1024;1;8;31;2;498576752
1505165631;4096;2048;1;8;31;4;293755008
1505165632;4096;1024;1;8;12;4;343434718
1505165633;4096;1024;1;16;31;4;316649466
1505165634;4096;256;1;8;31;4;322997714
1505165635;1;1024;1;8;31;4;721927007
1505165636;4096;2048;256;8;31;4;18446744073709551615
1505165637;4096;1024;1;1;31;4;859890845
1505165639;2048;1024;1;8;31;6;404758135
1505165640;4096;1024;1;8;44;4;305816085
1505165641;4096;4096;1;8;44;4;316480215
1505165641;4096;1024;256;8;6;4;18446744073709551615
1505165643;1;512;1;8;66;3;573869595
1505165644;4096;512;1;16;31;4;325947629
1505165644;4096;1024;256;8;31;3;18446744073709551615
1505165645;4096;1024;1;8;31;3;468607014
1505165646;2048;1024;1;16;31;4;308259512
1505165648;4096;2048;1;8;31;2;515530091
1505165649;1024;1024;1;8;33;4;341283801
1505165650;4096;1024;1;4;31;6;401222134
1505165651;1;1024;1;4;31;4;868449590
1505165652;4096;256;1;32;31;4;393019294
1505165654;4096;2048;1;8;31;11;395131179
1505165655;1;1024;1;8;33;11;487302086
1505165656;4096;1024;1;16;31;3;498110227
1505165657;4096;1024;1;8;66;6;418052916
1505165658;4096;1024;1;8;44;11;402882848
1505165659;2048;512;1;4;31;6;400192050
1505165660;4096;1024;1;32;31;4;388507884
1505165661;4096;1024;1;16;31;6;440608140
1505165663;4096;1024;1;8;31;2;512498253
1505165664;4096;1024;1;8;22;4;305763837
1505165665;4096;1024;1;8;33;3;506849979
1505165666;4096;4096;1;8;33;4;326387261
1505165667;1;512;1;8;31;4;716821815
1505165668;4096;256;256;2;31;4;18446744073709551615
1505165669;2048;256;256;8;31;1;18446744073709551615
1505165670;4096;1024;1;8;44;22;391888633
1505165671;2048;1024;256;8;31;4;18446744073709551615
1505165672;4096;512;1;8;11;4;376214932
1505165673;4096;1024;1;8;33;4;316787341
1505165674;4096;4096;1;8;31;1;676030010
1505165675;4096;1024;256;8;31;4;18446744073709551615
1505165676;4096;1024;1;2;31;4;485406845
1505165677;512;1024;1;8;31;3;466142259
1505165678;4096;256;1;4;31;12;394640969
1505165679;4096;4096;1;8;31;6;416797545
1505165681;1;512;1;4;31;4;857034226
1505165682;4096;512;1;8;31;4;306523336
1505165683;4096;512;1;8;66;4;316610132
1505165684;4096;1024;1;16;31;1;765973092
1505165685;4096;1024;128;8;31;4;18446744073709551615
1505165686;4096;1024;1;8;6;6;571552131
1505165687;4096;2048;1;4;31;4;306309543
1505165688;4096;512;1;8;22;6;434565171
1505165689;256;1024;1;8;11;4;374710009
1505165690;4096;1024;1;16;11;4;400210183
1505165692;1;1024;1;8;33;3;604741354
1505165693;4096;1024;1;4;31;31;395962391
1505165694;1024;1024;256;32;31;33;18446744073709551615
1505165695;512;1024;1;8;31;2;507820354
1505165696;4096;1024;1;16;93;4;319725840
1505165697;4096;1024;1;8;31;1;665553777
1505165699;4096;1024;1;4;6;6;524002849
1505165700;1;1024;1;8;44;4;561725250
1505165701;4096;1024;1;2;62;4;489584428
1505165702;4096;1024;1;4;12;4;296314838
1505165703;1;4096;1;16;44;11;448416641
1505165704;128;32;64;8;132;124;18446744073709551615
1505165705;128;1024;16;32;11;124;18446744073709551615
1505165706;8;512;1;16;124;44;383397637
1505165707;16;128;2;16;66;372;434048803
1505165708;4096;1024;1;8;31;11;392617714
1505165709;4096;1024;1;4;31;4;303356501
1505165710;4096;1024;128;2;31;31;18446744073709551615
1505165714;64;1;2;1;124;11;3333222791
1505165718;16;4;1;2;11;6;3290692834
1505165737;1;8;1;8;4;93;18734273738
1505165741;2;64;2;4;1023;372;2419218517
1505165742;4096;512;1;8;31;3;468240464
1505165744;4096;1024;1;8;4;6;739027478
1505165745;4096;1024;1;8;31;1023;494415922
1505165746;4096;1024;1;8;341;4;392658224
1505165747;4096;1;1;1;31;4;917031903
1505165748;4096;1024;1;8;124;4;329098880
1505165750;4096;4096;1;8;31;2;522660005
1505165750;4096;1024;256;8;4;4;18446744073709551615
1505165752;1;1024;1;8;33;4;561735794
1505165753;4096;1024;1;8;12;11;474856305
1505165754;4096;512;1;4;31;4;302285045
1505165755;4096;1;1;1;31;4;913102813
1505165757;1;1024;1;8;31;2;757375009
1505165758;4096;256;1;4;31;1;632067644
1505165760;4096;1024;1;8;3;4;665954723
1505165761;4096;2048;1;4;31;11;397878675
1505165762;256;4;8;4;44;341;455568473
1505165764;4096;8;1;2;62;682;1660613945
1505165765;2048;64;1;4;93;4;347334466
1505165854;1;1;1;1;11;11;87471140186
1505165855;4;512;2;16;66;124;406005006
1505165856;32;512;32;16;124;93;18446744073709551615
1505165857;4096;1024;1;1;6;4;927760384
1505165858;2048;1024;1;2;33;4;489013474
1505165860;2048;512;1;8;22;12;405755168
1505165860;4096;512;1;8;44;4;312817420
1505165861;2048;1024;256;8;44;6;18446744073709551615
1505165862;4096;128;1;8;31;4;337107597
1505165863;4096;1024;1;8;31;31;393840388
1505165864;4096;1024;1;8;341;4;392013219
1505165917;1;2;1;2;31;4;52088583792
1505165918;4096;1024;256;8;66;4;18446744073709551615
1505165919;4;64;4;16;31;186;353527298
1505165920;4096;1024;1;16;44;11;416047923
1505165922;4096;4096;1;8;31;3;478161585
1505165923;4096;512;1;32;11;4;723562107
1505165924;4096;1024;1;16;31;22;395110806
1505165925;4096;2048;1;8;22;4;302729884
1505165926;4096;1024;1;8;66;4;317997591
1505165927;4096;1024;1;8;11;4;367342763
1505165929;4096;1024;1;2;31;2;927069905
1505165930;4096;2048;1;8;33;4;320162339
1505165930;4096;1024;256;8;31;12;18446744073709551615
1505165932;4096;1024;1;16;12;6;529267546
1505165933;4096;1024;1;16;11;3;658650224
1505165934;4096;128;1;8;31;6;419007385
1505165935;512;1024;1;8;31;4;317383338
1505165936;4096;512;1;8;44;11;405413007
1505165937;4096;4096;1;4;31;4;312435421
1505165939;4096;1024;1;8;33;11;437502221
1505165939;4096;1024;128;8;33;4;18446744073709551615
1505165940;4096;256;1;4;31;4;319266255
1505165941;4096;1024;1;8;22;11;415931135
1505165944;1;1024;1;1;31;4;1806438468
1505165945;1;1024;1;8;22;4;596267128
1505165946;4096;1024;256;8;22;1;18446744073709551615
1505165947;2048;4096;1;8;31;4;303302719
1505165948;4096;1024;1;8;62;11;393158093
1505165949;2048;2048;1;8;31;6;405482637
1505165951;2048;1024;1;8;11;1;882467941
1505165952;4096;2048;1;2;11;4;508898962
1505165953;4096;4096;1;8;31;4;300968633
1505165954;2048;1024;1;8;44;4;313473792
1505165955;4096;1024;1;8;31;22;381454593
1505165956;1024;2048;256;32;31;4;18446744073709551615
1505165957;4096;2048;1;8;11;4;366841757
1505165958;4096;4096;1;8;62;6;414156379
1505165959;4096;1024;1;8;31;12;377743337
1505165960;4096;1024;1;8;6;4;414340551
1505165974;1;16;1;16;6;372;12581673916
1505165974;4096;1;256;1;31;4;18446744073709551615
1505165975;4096;1024;128;8;11;4;18446744073709551615
1505165977;8;16;4;16;11;1023;896445571
1505165979;4096;1;2;1;1;62;1760421905
1505165980;4;256;4;64;186;11;18446744073709551615
1505165983;8;16;1;1;66;1023;2758150763
1505165984;2048;1024;256;16;31;4;18446744073709551615
1505165985;4096;1024;256;16;12;4;18446744073709551615
1505165986;4096;1024;1;8;11;2;675465843
1505166007;1;16;1;4;4092;124;19586231982
1505166008;4096;1024;1;16;62;4;315685463
1505166009;1;1024;1;8;66;11;455950170
1505166011;4096;1024;8;8;31;682;369332461
1505166012;4;64;4;8;341;124;465415254
1505166013;4096;1024;1;8;31;66;377472252
1505166014;4096;1024;1;8;682;4;528506883
1505166015;4096;1024;1;32;31;3;604890056
1505166016;1024;1024;256;8;31;4;18446744073709551615
1505166017;4096;1024;256;8;44;1;18446744073709551615
1505166018;1;2048;1;8;33;124;467122802
1505166019;4096;256;1;8;93;31;386848472
1505166020;4096;1024;256;32;31;4;18446744073709551615
1505166021;1024;4096;1;8;31;4;318885721
1505166022;4096;1024;1;8;62;4;308957087
1505166023;4096;2048;128;8;31;4;18446744073709551615
1505166024;4096;512;1;16;31;3;491555379
1505166025;1;512;1;8;33;4;555871630
1505166026;4096;1024;1;8;93;4;319805133
1505166028;1;2048;1;8;31;2;746343605
1505166028;2048;2048;256;8;4;4;18446744073709551615
1505166029;4096;1024;1;4;62;4;322204214
1505166031;1;1024;1;16;31;4;597441093
1505166032;2048;1024;1;16;31;6;431553928
1505166033;1024;256;1;8;31;1;673583226
1505166034;4;512;4;8;62;124;390067676
1505166036;1;512;1;16;62;11;509801802
1505166037;4096;512;1;8;6;4;417329433
1505166038;4096;1024;1;8;33;12;423310043
1505166039;256;16;8;4;132;186;394040338
1505166041;1;2048;1;1;1;93;1709842355
1505166043;256;8;16;4;372;682;552005938
1505166044;1024;2048;4;1;372;22;452994502
1505166045;4096;1024;256;8;31;6;18446744073709551615
1505166046;16;16;4;4;186;124;409591674
1505166047;4096;512;1;8;31;33;382533515
1505166049;4096;1;1;1;31;4;911583507
1505166050;1;1024;1;8;44;2;670016096
1505166051;4096;1024;1;4;31;3;449263753
1505166052;8;64;8;32;124;124;18446744073709551615
1505166053;1;1024;1;8;31;12;491651964
1505166054;1;1024;1;8;6;4;534826554
1505166056;1;1024;1;8;4;11;707940981
1505166057;4096;1024;256;8;12;2;18446744073709551615
1505166058;1;1024;1;16;11;4;499514501
1505166059;4096;1;1;1;33;4;908510076
1505166061;1;1024;1;8;31;4;714197816
1505166062;4096;4096;256;8;31;4;18446744073709551615
1505166062;4096;512;256;8;31;3;18446744073709551615
1505166063;4096;4096;1;4;44;12;394002639
1505166065;4096;1024;1;8;66;1;656090650
1505166066;1;1024;1;8;31;4;732345694
1505166067;4096;1024;1;4;62;31;398286137
1505166068;512;1024;128;32;31;3;18446744073709551615
1505166069;4096;2048;1;8;12;4;344751167
1505166070;4096;1024;1;8;12;3;556094588
1505166073;4096;1024;1;8;1;33;2500284125
1505166074;4096;64;256;8;31;4;18446744073709551615
1505166075;4096;4096;256;8;6;4;18446744073709551615
1505166076;1;1024;1;8;12;4;587206429
1505166078;1;1024;1;4;31;4;862835218
1505166079;512;1024;256;8;31;4;18446744073709551615
1505166080;4096;4096;1;8;11;4;374795010
1505166081;4096;1024;1;4;31;1;634473670
1505166082;4096;1024;256;8;31;2;18446744073709551615
1505166082;4096;1024;256;8;31;11;18446744073709551615
1505166083;4096;4096;256;2;31;4;18446744073709551615
1505166084;2048;2048;1;8;6;4;388482885
1505166085;8;256;1;16;62;93;412166807
1505166086;4;256;4;16;44;132;362566884
1505166088;4;256;1;16;44;132;400920182
1505166088;8;128;8;16;44;341;18446744073709551615
1505166090;1;1024;1;8;124;3;908417348
1505166091;4;64;4;16;93;132;347909628
1505166092;4096;4096;1;8;31;1;676351728
1505166094;4;256;4;8;33;132;411415923
1505166095;4096;1024;1;32;31;12;443774176
1505166096;4096;512;1;8;33;4;330173376
1505166097;4096;4096;256;8;12;22;18446744073709551615
1505166097;4096;512;256;32;11;4;18446744073709551615
1505166099;4096;1024;1;2;31;1;1224187899
1505166100;256;1024;1;8;31;4;319810014
epoch;GLOBAL_SIZE_0;GLOBAL_SIZE_1;LOCAL_SIZE_0;LOCAL_SIZE_1;cost
1505166133;1;1024;1;16;2924200089
1505166168;2;1;1;1;34428680750
1505166169;4096;2048;1;2;554357137
1505166173;32;128;8;32;3653385984
1505166176;128;256;2;1;2592530814
1505166177;4096;8;128;8;18446744073709551615
1505166180;2;256;2;32;2204769675
1505166187;1;16;1;4;6332543292
1505166189;256;1;4;1;1111832074
1505166198;8;1;4;1;8439328060
1505166233;2;1;2;1;34414565392
1505166303;1;1;1;1;69509169188
1505166338;2;1;1;1;34428935375
1505166373;2;1;2;1;34414082041
1505166391;2;2;1;2;16899427533
1505166426;2;1;2;1;34413883017
1505166433;2;8;2;4;6071962800
1505166442;2;4;1;1;8475318436
1505166459;2;2;2;2;16886972120
1505166494;2;1;1;1;34429211476
1505166529;2;1;2;1;34414870225
1505166533;2;16;2;2;3021761501
1505166568;2;1;2;1;34414921917
1505166570;512;1;1;1;1144449065
1505166573;64;1;4;1;2635377360
1505166591;4;1;4;1;17142509959
1505166661;1;1;1;1;69510700396
1505166679;2;2;2;1;16883371292
1505166681;2048;1;1;1;1123579276
1505166716;2;1;2;1;34414937642
1505166751;2;1;2;1;34414666184
1505166757;2;8;1;2;6117242186
1505166759;4096;1;2;1;693097424
1505166763;16;2048;2;2;4026815792
1505166765;2048;64;2;8;828086019
1505166766;1024;2;8;1;922673827
1505166784;4;1;1;1;17141230797
1505166786;128;1;2;1;1498792251
1505166795;4;2;1;1;8461626641
1505166805;2;4;2;1;8470243561
1505166822;4;1;4;1;17142228708
1505166857;1;2;1;1;34502818271
1505166893;2;1;2;1;34414890517
1505166928;2;1;2;1;34414996500
1505166937;8;1;1;1;8436869620
1505166955;4;1;1;1;17141489256
1505166973;4;1;1;1;17141410297
1505166982;8;1;2;1;8426548375
1505167052;1;1;1;1;69510325625
1505167087;2;1;2;1;34415096267
1505167157;1;1;1;1;69510312084
1505167175;4;1;2;1;17145011875
1505167210;2;1;1;1;34429263934
1505167228;4;1;1;1;17141559880
1505167237;2;4;2;4;8470657583
1505167255;2;2;2;2;16887245000
1505167290;2;1;2;1;34415029934
1505167295;16;1;16;1;4574565471
1505167330;2;1;1;1;34429295500
1505167339;8;1;2;1;8427554143
1505167374;2;1;2;1;34414852308
1505167379;4;4;1;2;4339431765
1505167384;4;4;1;4;4337166709
1505167387;16;32;16;16;2360455545
1505167390;8;4;2;2;2221317782
1505167397;2;8;2;2;5857794964
1505167400;8;4;2;4;2223634963
1505167404;4;4;1;1;4341943043
1505167410;4;4;4;2;4334626430
1505167416;1;16;1;1;6241075503
1505167420;4;8;4;8;2659390332
1505167429;4;2;1;1;8461721103
1505167434;4;4;2;2;4340199764
1505167437;8;4;4;2;2224605643
1505167440;4;8;2;1;2658823474
1505167449;2;4;1;2;8473254083
1505167451;32;8;4;1;1596842866
1505167456;8;4;1;1;4533072691
1505167459;8;4;1;2;2224319653
1505167462;4;16;2;16;1924941266
1505167467;4;4;1;2;4339274361
1505167485;4;1;4;1;17142837786
epoch;GLOBAL_SIZE_0;GLOBAL_SIZE_1;LOCAL_SIZE_0;LOCAL_SIZE_1;cost
1505167508;64;4096;4;8;236095675
1505167510;1;4096;1;2;686505230
1505167511;4096;4096;8;1;352266470
1505167513;8;128;4;64;1596850135
1505167514;64;4096;2;8;312587971
1505167515;8;4096;4;16;323122751
1505167516;64;2048;2;8;432237516
1505167519;64;1;4;1;1958760238
1505167520;4;512;1;2;556664981
1505167522;64;1;2;1;1889933208
1505167592;1;1;1;1;69519817916
1505167596;16;2;16;1;3152726526
1505167597;64;4096;4;32;282414720
1505167598;4;4096;4;8;298431928
1505167600;1;4096;1;8;748821417
1505167600;64;4096;4;64;276336716
1505167602;16;1024;2;1;390498343
1505167605;256;4;8;4;2559111056
1505167606;1024;1024;1;8;534629313
1505167607;2;512;2;8;461490682
1505167678;1;1;1;1;69520089791
1505167678;64;4096;4;4;231732916
1505167679;16;512;4;4;350209848
1505167680;64;1024;2;2;293859512
1505167683;64;1;8;1;1904985335
1505167684;64;4096;4;2;233113462
1505167685;32;4096;4;4;247990006
1505167686;64;2048;4;4;254264169
1505167687;64;2048;4;8;276115959
1505167687;256;4096;4;4;220409967
1505167688;512;4096;2;4;224802300
1505167689;512;4096;8;1;246400002
1505167690;512;1024;4;4;247335256
1505167691;256;4096;4;2;222612917
1505167692;256;1;4;1;536923598
1505167694;128;1;4;1;1077337875
1505167695;1024;4096;4;4;237205753
1505167696;512;4096;4;4;226895004
1505167697;256;512;4;4;305374963
1505167698;256;1;8;1;547557472
1505167699;256;4096;16;4;225880084
1505167700;256;1024;4;2;248295551
1505167700;256;4096;4;8;230889298
1505167702;128;1;8;1;1083051743
1505167703;256;2048;2;4;227983960
1505167704;256;4096;8;4;224807626
1505167705;256;4096;4;1;237611049
1505167706;256;2048;8;4;231357340
1505167707;256;4096;2;2;227079260
1505167708;4;1024;4;4;306338923
1505167709;256;1024;4;4;253439833
1505167709;256;2048;4;8;252849754
1505167710;128;4096;4;4;220855585
1505167713;512;1;16;1;1995477999
1505167714;128;4096;8;4;219989049
1505167715;256;4096;1;4;227270708
1505167716;128;4096;16;4;224310006
1505167717;128;2048;8;1;251757918
1505167718;128;1;8;1;1100977171
1505167719;128;4096;4;2;224184255
1505167720;128;4096;8;8;228023838
1505167721;32;4096;8;2;245631259
1505167722;128;4096;8;2;226520339
1505167723;1024;4096;8;4;234018298
1505167724;128;2048;8;4;236267794
1505167725;16;2048;8;4;250287926
1505167726;128;2048;8;16;247790255
1505167728;4;16;2;8;1266831586
1505167728;512;128;256;32;18446744073709551615
1505167729;128;2;8;2;482199924
1505167730;4;4096;1;4;299080423
1505167731;16;4096;8;4;221245338
1505167732;128;1024;8;4;249916167
1505167733;1024;2048;8;4;222169583
1505167734;64;2048;8;4;235214339
1505167735;16;2048;16;8;245262425
1505167736;32;2048;4;4;260302133
1505167736;16;2048;16;4;252098044
1505167739;8;64;8;16;1662104958
1505167743;2048;4;8;4;3891718926
1505167744;4096;4;32;2;376250258
1505167745;256;4096;4;256;18446744073709551615
1505167746;2048;256;128;1;279869544
1505167747;64;4096;8;16;225297711
1505167748;128;1024;8;16;254800128
1505167749;256;1;8;1;513143338
1505167751;128;1;8;1;1058198777
1505167751;256;4096;8;64;18446744073709551615
1505167755;2048;1;8;1;3382125000
1505167756;512;4096;8;4;214966550
1505167757;64;4096;16;4;227890381
1505167759;128;1;8;1;1057413325
1505167760;64;2048;16;4;240797584
1505167760;512;2048;4;8;237253510
1505167761;512;1024;8;4;229159633
1505167762;512;4096;16;8;210904462
1505167763;512;1024;16;8;235891422
1505167764;512;4096;16;4;213532086
1505167767;512;1;64;1;2128832918
1505167768;256;4096;16;8;207578375
1505167769;256;4096;32;8;209267547
1505167769;256;1024;16;16;247288800
1505167770;64;4096;32;8;234685794
1505167771;256;256;16;8;495315133
1505167772;256;2048;16;4;219832750
1505167773;128;4096;16;8;205878835
1505167774;128;2048;16;8;230474839
1505167775;128;4096;32;8;216429793
1505167776;16;4096;1;8;957881201
1505167777;128;4096;16;16;210270003
1505167778;128;4096;16;32;18446744073709551615
1505167780;128;1;16;1;1287698442
1505167783;64;1;16;1;2022441459
1505167783;128;2048;16;4;233941091
1505167784;64;512;16;8;309148677
1505167785;128;1024;16;8;252901128
1505167786;128;1024;32;8;263931795
1505167787;64;4096;16;16;227282545
1505167788;64;4096;16;8;224036708
1505167789;128;4096;4;8;223152543
1505167790;512;4096;32;8;214446461
1505167792;128;1;32;1;1051109356
1505167792;256;4096;16;2;214177041
1505167793;128;4096;64;8;18446744073709551615
1505167794;256;4096;8;8;209907626
1505167796;128;1;8;1;1092134337
1505167798;128;1;16;1;1066998953
1505167798;32;4096;32;8;240383256
1505167799;128;4096;32;16;18446744073709551615
1505167800;32;2048;16;8;252438927
1505167801;4;4096;4;8;298314884
1505167802;256;1;16;1;559415856
1505167807;32;1;16;1;3519507308
1505167808;256;1;16;1;626446468
1505167809;64;4096;64;8;18446744073709551615
1505167810;32;4096;16;8;238687713
1505167810;128;4096;8;32;219591795
1505167811;64;4096;16;2;231251958
1505167812;512;2048;16;16;214479128
1505167813;64;4096;8;8;222798460
1505167814;128;4096;16;64;18446744073709551615
1505167815;32;4096;16;32;18446744073709551615
1505167816;1024;4096;8;8;224998463
1505167816;1024;4096;16;4;221565042
1505167817;2048;4096;16;4;243448420
1505167818;128;1024;32;4;251246136
1505167819;128;2048;8;8;234677209
1505167820;256;2048;16;8;213132384
1505167821;128;2048;16;32;18446744073709551615
1505167822;128;512;16;4;303405251
1505167823;128;2048;16;16;230455919
1505167825;512;1;16;1;2081091478
1505167826;128;1024;16;16;258376750
1505167827;128;4096;16;2;211452375
1505167828;128;4096;2;8;250845925
1505167829;128;4096;32;4;209301425
1505167830;128;4096;8;16;217215881
1505167834;32;1;16;1;3290005393
1505167837;64;1;16;1;2587497816
1505167838;32;4096;16;16;239234918
1505167839;256;256;8;2;375897760
1505167840;8;4096;2;16;459503675
1505167841;128;4096;64;4;215661670
1505167842;256;4096;32;2;213536500
1505167843;64;4096;8;4;219333673
1505167845;8;4096;1;8;957109587
1505167846;512;4096;8;16;221897751
1505167848;128;1;32;1;1313690229
1505167849;128;1024;4;8;305542046
1505167850;128;1;64;1;1085789360
1505167851;8;4096;8;8;241071218
1505167852;32;4096;16;4;242264841
1505167856;32;1;16;1;3148580041
1505167857;512;4096;64;8;18446744073709551615
1505167859;128;1;16;1;1114992704
1505167860;128;512;16;2;301031137
1505167861;4;4096;1;16;384798468
1505167862;32;4096;8;8;231737587
1505167863;256;1;16;1;522836265
1505167864;1024;4096;16;8;218144048
1505167865;128;512;16;8;300268470
1505167866;256;512;16;16;290962210
1505167868;128;4096;1;8;579623555
1505167868;128;2048;64;8;18446744073709551615
1505167869;1024;4096;64;8;18446744073709551615
1505167870;64;4096;16;32;18446744073709551615
1505167871;128;2048;16;2;248301591
1505167872;256;1024;16;32;18446744073709551615
1505167875;64;1;16;1;1836750951
1505167877;64;1;2;1;1714769792
1505167878;256;1024;16;8;255636135
1505167879;1024;4096;32;8;233216964
1505167881;32;4096;1;16;977138585
1505167882;256;2048;16;16;231860504
1505167883;256;1;64;1;525451635
1505167884;128;1024;64;16;18446744073709551615
1505167885;256;2048;8;32;237202000
1505167886;256;4096;16;16;221860334
1505167887;256;2048;8;8;238014293
1505167894;16;1;1;1;6073479837
1505167895;1024;4096;16;16;229384046
1505167896;256;4096;16;32;18446744073709551615
1505167897;128;4096;4;16;231484379
1505167898;256;1;32;1;588348889
1505167899;512;2048;8;8;223088418
1505167900;512;4096;16;32;18446744073709551615
1505167901;128;1024;16;4;258529960
1505167902;64;1024;1;2;384315099
1505167903;4096;8;4;1;436675625
1505167904;4;256;1;8;706857591
1505167915;8;1;8;1;10461441882
1505167918;64;1;8;1;1896237947
1505167921;64;1;32;1;2086069993
1505167922;32;2048;8;8;258193091
1505167923;256;512;32;8;298967468
1505167924;1024;4096;128;8;18446744073709551615
1505167925;16;256;8;16;749430354
1505167927;1;4096;1;8;748325980
1505167928;128;4096;16;1;216086212
1505167929;32;1024;8;16;268885501
1505167930;256;1;4;1;520262334
1505167934;32;1;8;1;3224955778
1505167935;512;2048;16;8;214336545
1505167936;32;2048;8;16;240608711
1505167936;32;512;8;64;18446744073709551615
1505167938;1;1024;1;128;867166211
1505167939;16;512;8;64;18446744073709551615
1505167942;1024;2;2;2;3263994883
1505167943;32;2048;32;32;18446744073709551615
1505167944;128;4096;16;1;221196004
1505167945;128;4096;2;4;213340251
1505167946;128;2048;32;8;245960588
1505167947;2048;4096;16;8;245831298
1505167948;128;2;16;2;514312961
1505167949;128;4096;16;128;18446744073709551615
1505167953;1024;1;16;1;2963161327
1505167954;128;1024;8;8;265512129
1505167956;128;1;32;1;1125198313
1505167957;512;2048;32;8;227000502
1505167958;1024;4096;16;2;230874208
1505167963;1;16;1;16;4287967220
1505167968;512;32;1;32;4413331010
1505167969;2;4096;2;1;566664219
1505167971;1;256;1;1;1146818780
1505167972;32;2048;4;32;303328175
1505167973;1;2048;1;8;795231067
1505167974;64;4096;4;4;218388339
1505167975;256;4096;128;128;18446744073709551615
1505167976;4096;512;16;1;358832085
1505167977;4096;1;8;1;906156344
1505167978;512;1;2;1;523920377
1505167982;1;32;1;2;3178586503
1505167984;1;128;1;64;1374897209
1505167986;1;128;1;4;1369385631
1505167988;1024;1024;1;16;689391842
1505167990;1;512;1;8;942558939
1505167992;1;128;1;32;1366681368
1505167994;8;128;8;32;1423484316
1505167997;512;4;16;1;2691148478
1505168002;2048;32;1;32;4473828747
1505168007;512;32;1;16;4120286265
1505168008;256;32;1;1;800617317
1505168010;512;16;1;1;857829423
1505168014;256;64;1;32;3961954383
1505168015;1024;32;256;2;18446744073709551615
1505168016;512;32;256;32;18446744073709551615
1505168019;64;32;4;32;3098381437
1505168020;256;32;256;32;18446744073709551615
1505168021;512;32;128;32;18446744073709551615
1505168024;512;32;128;2;2723456209
1505168029;1024;64;1;16;3728158477
1505168030;512;32;1;2;429640669
1505168030;512;128;128;32;18446744073709551615
1505168035;512;64;1;32;3967840958
1505168038;512;128;1;16;2675783279
1505168039;512;128;256;8;18446744073709551615
1505168040;256;4096;4;64;259557426
1505168041;64;256;8;1;472424851
1505168042;64;1024;2;1;380779419
1505168043;16;4096;4;16;277996754
1505168044;512;32;64;32;18446744073709551615
1505168048;512;128;1;32;3163075000
1505168053;256;32;1;32;4310834747
1505168058;1024;32;1;32;4473969085
1505168062;512;4;1;4;3508111375
1505168066;256;64;1;16;3676528515
1505168067;256;32;128;32;18446744073709551615
1505168072;1024;32;1;16;4322103015
1505168073;256;32;1;2;405788797
1505168076;256;32;128;1;2655680098
1505168078;512;32;1;1;824034598
1505168081;128;32;2;32;3103673167
1505168085;128;32;2;8;2721490257
1505168086;256;16;1;2;403762254
1505168090;256;64;1;8;3081727115
1505168094;2048;64;1;16;3657786278
1505168096;128;256;2;32;1546712227
1505168100;64;32;4;16;2933316364
1505168101;256;64;1;1;799085016
1505168102;256;32;256;8;18446744073709551615
1505168103;256;16;1;1;833199119
1505168108;256;32;1;8;3728329397
1505168111;256;32;256;1;2713957940
1505168112;128;32;128;32;18446744073709551615
1505168113;256;64;128;32;18446744073709551615
1505168114;32;4;8;4;924861763
1505168118;256;128;1;32;3197972216
1505168121;256;256;1;32;2242371086
1505168123;256;8;1;1;862807015
1505168124;1024;32;1;1;871844282
1505168126;32;32;8;32;1516469937
1505168127;128;32;32;32;18446744073709551615
1505168128;256;8;1;2;452549392
1505168131;1024;32;256;1;2600066875
1505168132;128;64;128;32;18446744073709551615
1505168134;4;256;1;256;1476239879
1505168145;8;1;8;1;10461626542
1505168146;32;512;8;1;348539301
1505168148;1;1024;1;128;867167367
1505168152;256;16;256;1;2927555152
1505168156;1;32;1;8;3269588506
1505168157;256;4096;1;32;542360436
1505168158;256;1;1;1;745461527
1505168161;32;32;4;16;2419973635
1505168166;128;32;1;32;3911822095
1505168169;32;32;4;32;2626261338
1505168170;256;8;256;2;18446744073709551615
1505168171;32;8;8;2;521051726
1505168172;128;16;2;1;476291549
1505168175;16;512;1;64;1954090114
1505168178;256;8;2;8;2526001480
1505168181;2;16;1;16;2220001412
1505168182;8;4096;1;2;379442084
1505168186;128;32;2;16;3114167639
1505168191;256;32;1;16;4150461256
1505168192;16;16;16;1;477375512
1505168193;256;1;2;1;539134340
1505168197;256;32;1;4;3354010399
1505168198;256;32;256;16;18446744073709551615
1505168203;1024;4;1;4;4168265229
1505168206;512;32;64;1;2654433571
1505168209;512;1;16;1;2223507509
1505168211;2;4096;1;1;1071185828
1505168212;1;1024;1;1;1153462721
1505168213;32;2048;16;2;257946959
1505168218;256;64;1;64;3978750079
1505168220;256;2;1;1;766059610
1505168224;256;16;128;1;3148559774
1505168227;4096;32;1;32;2796385498
1505168230;256;4;1;4;2493865084
1505168234;256;32;64;1;2706556375
1505168234;256;256;256;32;18446744073709551615
1505168235;256;64;256;32;18446744073709551615
1505168236;256;32;128;8;18446744073709551615
1505168236;256;32;32;32;18446744073709551615
1505168240;2;32;2;32;2449482485
1505168243;1;128;1;1;2370939822
1505168247;64;32;1;32;3557818681
1505168251;64;64;4;32;2748667458
1505168252;64;4;4;1;543509885
1505168253;128;32;2;1;456739836
1505168258;256;128;1;128;3727507803
1505168259;1;2048;1;8;794760976
1505168261;64;256;4;4;1020472833
1505168263;64;4096;1;128;1202761758
1505168264;128;512;16;16;301674970
1505168269;1024;64;1;32;4019599833
1505168271;256;128;1;8;1964379696
1505168276;256;8;1;8;3636386788
1505168279;256;128;1;16;2732885581
1505168283;1;64;1;32;2645922397
1505168284;512;16;1;2;473636141
1505168284;256;32;64;32;18446744073709551615
1505168286;8;32;2;32;1383821106
1505168292;256;32;1;32;4386754198
1505168295;128;128;1;32;3171607236
1505168366;1;1;1;1;69519804396
1505168370;32;1;2;1;3272384136
1505168371;4;2048;4;2;302684085
1505168376;1;32;1;1;5022203085
1505168379;64;32;4;2;2168282097
1505168384;256;32;2;32;3486699726
1505168388;256;32;1;8;3712403440
1505168393;256;16;1;16;4269193708
1505168394;64;16;2;1;511773219
1505168397;128;128;2;32;2404835733
1505168401;128;64;2;32;2943166591
1505168405;256;256;1;64;2662578360
1505168408;32;32;8;16;2060485919
1505168411;256;4;1;4;2650421075
1505168412;512;8;1;2;463265301
1505168414;16;32;8;32;892678767
1505168415;16;32;16;32;18446744073709551615
1505168418;1024;16;256;1;3101613666
1505168422;64;64;4;64;3037367078
1505168426;128;16;2;16;3189277125
1505168429;128;16;2;2;2652228554
1505168439;1;8;1;2;8429160625
1505168443;256;16;1;8;3927917824
1505168447;64;16;4;1;2574909315
1505168451;256;128;1;64;3481563040
1505168451;1024;32;256;32;18446744073709551615
1505168455;256;16;128;2;3089301409
1505168456;1024;32;128;32;18446744073709551615
1505168460;256;8;1;4;3592968267
1505168463;128;4;1;4;2130991553
1505168465;1024;16;1;1;889864260
1505168468;128;8;2;2;2696297599
1505168469;512;128;256;64;18446744073709551615
1505168473;128;32;1;16;3609178308
1505168477;128;64;2;64;3002220416
1505168480;32;32;2;32;2289685155
1505168482;256;2;1;2;924344604
1505168487;512;16;1;16;4459170667
1505168488;2048;64;256;32;18446744073709551615
1505168490;256;16;256;16;18446744073709551615
1505168491;512;64;256;32;18446744073709551615
1505168493;64;256;4;32;1491061544
1505168497;256;8;256;1;3142312166
1505168502;512;64;1;64;4079050558
1505168504;256;4;1;2;1337019055
1505168507;2048;256;1;32;1980987629
1505168510;256;512;1;32;1416901012
1505168511;256;2;1;2;717538184
1505168513;1;512;1;4;941390453
1505168514;1024;1024;1;2;391099714
1505168517;2;16;2;8;2220141565
1505168519;1;128;1;32;1361788395
1505168521;64;128;4;32;2016393624
1505168525;64;32;2;32;3006960500
1505168526;256;32;256;2;18446744073709551615
1505168527;256;128;256;32;18446744073709551615
1505168531;128;64;1;8;3022614798
1505168535;128;64;1;32;3803560833
1505168536;64;4;1;4;530470718
1505168540;128;32;2;2;2569706279
1505168543;256;32;1;4;3292929024
1505168548;256;32;4;32;3620918683
1505168550;256;1024;1;32;984703514
1505168551;256;2048;1;32;696720750
1505168555;1;32;1;32;3171324611
1505168559;256;64;2;32;3152323577
1505168562;32;32;8;4;2093457954
1505168563;512;64;1;2;448819429
1505168564;256;128;256;8;18446744073709551615
1505168564;2048;256;256;32;18446744073709551615
1505168569;512;32;1;8;3853502642
1505168572;64;64;2;32;2716142357
1505168575;1;128;1;32;1360852163
1505168580;4;4;4;2;4307484433
1505168584;256;64;4;64;3332462209
1505168586;512;1;128;1;2286475399
1505168588;64;1024;4;1;271759300
1505168589;512;4096;4;16;235214676
1505168590;4096;256;2;8;491234384
1505168601;8;1;8;1;10461915417
1505168602;32;512;4;16;589613050
1505168604;1;1024;1;2;722087762
1505168611;16;1;1;1;7087348841
1505168613;16;8;2;8;937100636
1505168615;2;4096;1;1;1070956533
1505168685;1;1;1;1;69520156272
1505168689;1;32;1;32;3164609542
1505168690;2;512;2;1;564736125
1505168692;1;256;1;1;1156903470
1505168693;32;2048;2;8;583765259
1505168694;4096;2048;1;8;345285005
1505168695;64;4096;64;32;18446744073709551615
1505168700;4;4;2;2;4283589250
1505168705;4;4;1;2;4290080233
1505168707;16;4;2;2;1754225052
1505168725;2;2;2;1;16981179249
1505168730;4;4;4;1;4305661189
1505168748;4;1;4;1;17614212483
1505168753;4;4;2;1;4293881645
1505168762;4;2;4;2;8552383754
1505168781;4;1;4;1;17614207026
1505168790;2;4;2;1;8500779459
1505168792;4;16;4;16;1171211629
1505168796;4;4;1;1;4296983858
1505168801;4;4;1;4;4281793190
1505168803;4;32;1;8;1188203045
1505168808;4;4;4;4;4305641625
1505168813;1;16;1;4;4248405364
1505168822;2;4;1;2;8491460374
1505168832;4;2;1;2;8537059772
1505168841;2;4;1;1;8492986353
1505168859;4;1;1;1;17618888400
epoch;GLOBAL_SIZE_0;GLOBAL_SIZE_1;LOCAL_SIZE_0;LOCAL_SIZE_1;v_TP_167;v_TP_168;cost
1505168885;512;512;16;1;682;1;2491869417
1505168889;32;8;1;8;124;1023;3388371231
1505168901;2;4;2;4;4092;22;10552547107
1505168902;256;32;32;1;33;4092;407659553
1505168906;64;1;2;1;1;33;3927169702
1505168914;512;1;1;1;1;186;7224779894
1505168918;32;32;1;2;4092;66;3060777404
1505168919;4096;4;64;2;33;682;481508916
1505168922;256;128;16;1;33;1;2460276890
1505168924;256;32;32;1;682;4092;914735627
1505168925;256;32;32;1;31;4092;388927586
1505168926;4096;32;128;1;33;4092;352692880
1505168927;512;1;16;1;6;31;674576001
1505168928;256;512;32;32;4;186;18446744073709551615
1505168931;4;512;2;64;3;3;2448480806
1505168933;512;512;32;8;22;3;1824519399
1505168934;8;32;8;1;33;4092;370890590
1505168935;4096;32;128;1;2;4092;385181302
1505168936;4096;32;128;2;33;4092;374307417
1505168937;256;32;128;1;33;4092;384813551
1505168944;1;32;1;1;12;4092;6149255221
1505168945;4096;64;128;1;33;682;405405549
1505168946;4096;32;128;1;31;1364;421236476
1505168947;4096;64;128;1;31;4092;357943465
1505168948;1024;128;128;1;33;1364;381079264
1505168949;4096;16;128;1;6;4092;356216543
1505168951;4096;32;128;1;33;1364;415874514
1505168952;4096;64;128;1;33;4092;373133304
1505168953;128;32;128;1;33;4092;351693125
1505168954;4096;32;128;1;33;4092;352643806
1505168958;2;32;2;1;62;4092;3501090188
1505168959;4096;1;128;1;33;4092;809861979
1505168961;128;1;128;1;33;4092;810451394
1505168962;128;32;128;1;372;4092;384758670
1505168964;4;32;2;1;33;4092;1571042577
1505168965;512;8;256;1;33;4092;429934292
1505168967;32;4096;1;16;1364;1364;1731610058
1505168971;64;32;1;4;33;4092;3137897375
1505168972;128;32;128;16;33;4092;18446744073709551615
1505168979;1;32;1;1;33;4092;6104396250
1505169007;4;1;1;1;1;2;27389032625
1505169007;128;32;128;4;33;1;18446744073709551615
1505169009;128;32;2;1;33;341;683117600
1505169010;128;32;128;1;44;1364;438114086
1505169012;32;512;1;16;124;1;1250458438
1505169013;128;1;128;1;33;4092;674337128
1505169015;128;1;128;1;11;4092;793876505
1505169023;2048;1;1;1;1;124;7550465587
1505169024;128;32;128;1;66;4092;351344797
1505169025;128;32;128;1;31;4092;351656208
1505169027;128;1;16;1;33;31;1564089349
1505169028;128;32;64;2;66;4092;373673002
1505169030;128;4096;1;1;66;186;1335892084
1505169031;128;32;128;8;66;4092;18446744073709551615
1505169032;128;32;8;2;66;4092;345061883
1505169033;128;32;8;8;66;4092;383255712
1505169034;128;32;8;32;66;4092;484182793
1505169035;128;32;8;2;66;1023;357711465
1505169036;128;32;8;2;66;31;574909043
1505169037;128;32;8;2;12;4092;357474176
1505169039;128;32;8;1;66;4092;663743058
1505169040;128;32;8;2;1;1364;500757416
1505169041;128;32;128;16;66;4092;18446744073709551615
1505169042;128;32;8;4;66;4092;354733931
1505169043;128;32;8;8;66;4092;383262883
1505169044;128;32;8;2;11;4092;394274140
1505169044;128;4096;8;128;66;4092;18446744073709551615
1505169045;128;32;8;8;12;4092;457215599
1505169048;128;32;8;2;66;1;1649084437
1505169049;128;16;64;1;66;4092;428362250
1505169049;128;512;16;256;66;4092;18446744073709551615
1505169051;16;256;1;64;31;6;1166646250
1505169062;2;32;2;2;2046;4092;9860432214
1505169064;16;32;8;2;66;33;1166202451
1505169065;4096;2048;4;2;44;4092;654218840
1505169071;8;2;1;1;682;66;5819582060
1505169073;4096;2;4;1;33;3;811295901
1505169074;4;4096;1;4;44;124;980864383
1505169076;64;32;4;2;66;4092;651339885
1505169079;128;8;4;8;132;4092;2600216866
1505169080;32;32;8;2;124;4092;490061920
1505169083;128;8;8;2;44;1;1749437875
1505169174;1;1;1;1;1;6;90184402924
1505169175;128;32;2;2;66;4092;1269341974
1505169176;128;1024;8;64;66;1;18446744073709551615
1505169177;128;32;8;2;2;4092;357965126
1505169180;8;16;4;2;682;22;2029608949
1505169181;128;16;8;4;22;4092;722784303
1505169182;128;32;8;2;66;1364;431150881
1505169184;128;64;8;1;66;4092;663940220
1505169185;128;16;32;8;12;12;985305675
1505169187;128;32;32;2;33;6;1033027084
1505169191;64;1;4;1;124;11;3102891116
1505169192;128;64;4;1;93;132;368947757
1505169194;128;32;8;2;11;1;1930628803
1505169196;8;32;8;2;1;4092;649685342
1505169197;128;32;8;2;66;62;522835921
1505169198;128;2048;8;128;66;4092;18446744073709551615
1505169199;32;32;4;2;132;4092;654661678
1505169200;32;16;8;4;66;2046;705625139
1505169201;128;32;8;2;186;4092;481667502
1505169202;128;32;16;2;93;4092;494465799
1505169209;4;16;2;1;22;1;5687664919
1505169210;32;8;8;4;44;132;476802965
1505169212;4;512;1;1;62;12;1754775897
1505169213;512;512;16;128;1;1023;18446744073709551615
1505169214;128;32;8;2;66;4;737720101
1505169215;128;2048;8;128;66;22;18446744073709551615
1505169216;128;32;8;16;66;4092;408750377
1505169217;128;32;4;2;66;4092;654574442
1505169219;512;32;32;1;12;11;749817104
1505169222;32;2;8;2;124;31;2761985385
1505169223;128;512;8;128;66;31;18446744073709551615
1505169224;256;32;8;2;6;4092;337624877
1505169225;1024;32;8;2;6;4092;340591508
1505169228;256;32;2;1;6;4092;2488766184
1505169229;256;32;8;1;6;4092;649559305
1505169231;4096;32;8;2;6;44;481969803
1505169232;256;32;4;2;6;31;955715242
1505169235;256;32;8;32;6;4092;1763117238
1505169236;256;32;1;2;6;31;857373060
1505169240;1;32;1;2;6;4092;3239983917
1505169241;1024;16;8;4;33;4092;734637224
1505169243;256;32;8;2;1;4092;647854772
1505169244;256;32;8;2;33;4092;374140472
1505169245;256;1024;8;1;372;4092;940330301
1505169246;512;32;8;2;6;4092;337757422
1505169247;256;32;8;2;6;4092;337900173
1505169248;256;32;8;2;6;372;377001760
1505169251;256;32;8;2;2046;4092;2509431897
1505169253;256;32;8;4;6;4092;438704800
1505169254;256;32;8;2;682;2046;462825752
1505169255;256;32;32;1;6;4092;357095006
1505169256;256;64;8;1;6;4092;649489689
1505169259;256;32;8;32;6;2046;1828223113
1505169260;256;32;32;2;124;4092;388407426
1505169261;512;16;8;4;6;4092;865449191
1505169262;256;32;4;2;6;1364;453133808
1505169263;512;32;8;2;4;4092;384872297
1505169265;256;32;4;2;3;4092;859904848
1505169267;1;1024;1;4;66;124;2084544677
1505169270;4;512;2;4;372;22;1899078400
1505169295;4;1;4;1;44;33;24041376711
1505169297;512;1;128;1;3;22;2125863855
1505169298;512;512;256;64;1;62;18446744073709551615
1505169301;2048;32;8;2;6;1;1815026050
1505169302;512;32;8;2;132;4092;347845221
1505169303;256;32;16;2;6;4092;510694209
1505169304;128;4;8;1;66;12;724574713
1505169305;2048;32;16;2;6;4092;357852251
1505169307;256;32;8;16;6;33;697435716
1505169308;32;32;8;2;6;4092;337575459
1505169309;32;256;8;1;6;4092;367055295
1505169310;32;32;8;4;6;4092;861689820
1505169314;4;32;1;2;6;4092;2763606062
1505169315;4;4096;1;32;6;4092;966898831
1505169316;32;32;8;2;66;4092;345010920
1505169317;2048;32;64;2;6;4092;366579051
1505169318;32;32;8;2;44;4092;347244297
1505169320;32;32;8;8;6;124;528634428
1505169323;4;32;1;2;6;4092;2763333816
1505169324;32;32;8;2;1;4092;629461275
1505169325;32;256;8;128;6;44;18446744073709551615
1505169330;32;2;8;2;6;4092;4945962130
1505169338;32;32;2;32;6;4092;6675537638
1505169339;32;32;8;32;1364;4092;348335588
1505169340;32;32;8;2;6;66;507058542
1505169341;32;2048;8;1;6;4092;367236835
1505169342;32;32;2;2;6;4;628890180
1505169356;32;32;1;32;6;4092;13299333012
1505169359;32;16;8;4;1;4092;2495851707
1505169363;512;4;8;2;6;4092;2688768352
1505169364;32;32;8;1;6;682;394846302
1505169366;2048;128;64;2;1;11;1241536832
1505169377;32;1;8;1;6;4092;10037726625
1505169378;512;32;8;32;6;93;856248685
1505169380;32;32;8;8;3;4092;1759234747
1505169383;32;8;4;8;6;2046;1813053050
1505169384;32;16;8;4;6;4092;863790860
1505169385;64;32;32;2;22;4092;437521714
1505169387;512;32;32;8;11;12;933009106
1505169388;16;512;4;8;22;4092;379690378
1505169390;1024;256;2;2;372;341;639288045
1505169391;1024;4096;4;16;22;341;379591005
1505169392;1024;4;4;1;12;93;959951970
1505169394;32;8;8;8;132;12;859351048
1505169397;32;32;8;2;6;1;2032039256
1505169398;32;32;8;4;11;4092;729132970
1505169399;512;8;8;2;22;44;481530920
1505169400;2048;32;8;2;6;4092;351316126
1505169402;32;8;8;4;6;4092;1672401623
1505169404;32;32;8;2;6;31;604175774
1505169406;1024;16;4;8;66;66;1358887634
1505169416;8;512;4;1;4092;682;9733539905
1505169417;64;64;16;32;4092;62;18446744073709551615
1505169418;256;32;32;8;1023;124;509771629
1505169419;128;32;8;2;6;4092;336876794
1505169421;32;8;8;8;6;22;822735055
1505169423;4;32;2;2;6;4092;1402594009
1505169424;32;32;4;2;6;1364;446488303
1505169425;128;32;8;2;132;4092;347770259
1505169425;128;128;8;128;6;4092;18446744073709551615
1505169426;128;128;8;8;6;4092;341657799
1505169428;4096;32;8;2;6;31;569524675
1505169429;128;32;8;2;6;4092;337575587
1505169439;128;1;8;1;4092;4092;10234284487
1505169440;128;512;4;128;6;4092;18446744073709551615
1505169441;128;32;16;2;6;4092;509374627
1505169443;128;32;8;16;6;4092;885114394
1505169445;1024;32;8;32;6;4092;1763821208
1505169446;128;32;8;2;31;4092;400967010
1505169448;128;32;8;2;1;4092;729923057
1505169449;128;32;2;2;6;2;658892934
1505169452;128;32;1;2;6;4092;2491957623
1505169453;128;32;64;2;6;4092;345220421
1505169454;128;2048;8;128;6;4092;18446744073709551615
1505169456;128;32;8;8;6;2;2014746331
1505169467;16;1;8;1;6;4092;10037760207
1505169468;128;32;8;2;33;4092;374637345
1505169469;128;32;128;8;6;4092;18446744073709551615
1505169471;128;32;2;2;6;4092;1241569841
1505169481;128;1;8;1;6;4092;10037478960
1505169483;16;32;8;8;6;1364;593520003
1505169484;128;64;8;16;6;4092;447504713
1505169485;128;32;8;2;6;1023;431617628
1505169486;128;32;8;2;3;4092;450629513
1505169488;256;16;4;4;11;4092;1374599343
1505169489;128;512;8;128;3;1364;18446744073709551615
1505169490;256;16;32;8;22;22;836614380
1505169491;128;2048;4;128;6;4092;18446744073709551615
1505169492;128;64;8;1;6;4092;649344596
1505169493;128;32;8;8;6;4092;443849586
1505169495;64;4;4;1;124;66;590841092
1505169496;512;1;8;1;6;44;520397469
1505169502;1;1024;1;256;4;124;5198540484
1505169503;32;4096;8;16;4092;372;436926142
1505169504;128;8;8;8;62;44;491324348
1505169506;128;32;4;2;124;4092;937651828
1505169506;128;32;64;16;6;4092;18446744073709551615
1505169512;128;2;8;2;6;4092;4946030909
1505169514;256;2;4;1;93;93;933188480
1505169516;128;8;8;8;6;4092;1762972363
1505169517;128;32;8;2;62;4092;399994425
1505169518;64;32;8;2;6;4092;337049418
1505169520;128;32;2;2;6;4092;1241922588
1505169521;256;32;8;2;1;4092;659134351
1505169523;256;16;32;8;31;31;726566611
1505169524;128;32;8;2;93;4092;378528420
1505169606;1;1;1;1;1;93;81198648383
1505169608;1;256;1;2;22;132;1176209292
1505169618;2;8;2;2;682;4;9625873041
1505169624;2;32;1;1;3;62;5524366063
1505169627;64;1;4;1;132;341;2406869975
1505169628;128;32;8;2;341;4092;443881501
1505169630;128;32;8;2;6;62;534082221
1505169631;512;16;32;4;31;22;811933029
1505169633;128;32;8;2;6;11;755961513
1505169637;2;32;1;2;6;4092;3232651331
1505169640;128;32;2;2;1;4092;2442280991
1505169644;4;32;1;2;3;4092;3651319234
1505169645;128;512;8;128;6;4092;18446744073709551615
1505169647;128;32;2;4;6;4092;1706635496
1505169648;128;32;8;4;6;4092;438886931
1505169650;2048;32;8;2;6;11;749077178
1505169651;128;32;8;2;6;1364;447375137
1505169652;128;32;8;2;124;6;799266734
1505169653;128;32;8;8;6;4092;443460130
1505169654;128;32;8;2;1;4092;643478768
1505169656;128;32;128;2;186;4092;364250553
1505169658;128;32;8;32;6;4092;1763072125
1505169659;128;256;8;128;6;4092;18446744073709551615
1505169660;128;32;8;1;6;4092;649985264
1505169661;8;32;8;2;6;4092;336775634
1505169665;1;32;1;2;6;4092;3239126083
1505169667;8;32;8;2;93;93;1771887696
1505169669;8;32;2;1;6;4092;1376520621
1505169671;2048;32;8;1;6;4092;651900047
1505169672;8;32;8;2;6;62;1028325330
1505169678;8;32;8;2;6;1;4939252583
1505169679;4096;16;8;1;6;4092;652795641
1505169682;8;32;8;2;6;2;2375109307
1505169685;8;32;8;2;2046;4092;2510308269
1505169687;64;32;8;4;6;4092;865155961
1505169688;8;32;4;2;66;4092;650600188
1505169689;8;32;8;2;132;4092;347416508
1505169691;8;32;2;2;6;4092;1242713197
1505169693;8;8;8;8;6;4092;1766593782
1505169694;8;32;8;2;11;4092;447929463
1505169696;8;32;8;2;6;124;492106385
1505169697;1024;32;8;16;11;4092;952243373
1505169698;8;32;8;8;6;4092;444231084
1505169699;8;32;8;4;6;4092;438600301
1505169705;1;32;1;2;124;4092;4431494601
1505169708;8;32;1;1;6;4092;2751365530
1505169709;8;64;8;1;6;4092;368727757
1505169720;8;1;8;1;6;4092;10042990293
1505169722;1;128;1;128;124;4092;1360633375
1505169727;1;32;1;2;124;6;4823779750
1505169732;1;32;1;2;124;44;4413592275
1505169737;1;32;1;4;124;4092;3994951832
1505169742;1;32;1;2;124;1023;4481958912
1505169783;1;2;1;2;124;44;40444147750
1505169788;1;32;1;2;124;44;4407039341
1505169870;1;1;1;1;6;44;81546151292
1505169872;1;1024;1;128;124;44;798426799
1505169883;1;8;1;8;124;44;10500594688
1505169889;1;32;1;2;1;44;5084236146
1505169890;64;32;2;2;124;44;549372479
1505169891;64;1024;2;128;124;44;425467088
1505169900;1;64;1;1;124;44;8298875958
1505169904;2;32;1;2;124;44;3607114692
1505169925;1;32;1;2;2046;44;19933107580
1505169934;1;64;1;1;124;44;8301457650
1505169938;1;32;1;8;124;44;3656618362
1505169940;128;32;1;2;124;1364;1265638644
1505169942;8;32;1;2;124;44;922235170
1505169947;1;32;1;2;124;44;4415367351
1505169956;1;32;1;2;124;1;8020330250
1505169962;1;16;1;4;124;44;5781796797
1505169971;1;32;1;1;124;44;8295537154
1505169972;16;512;8;128;124;44;18446744073709551615
1505169980;1;32;1;2;124;1;8020913792
1505169981;256;32;256;2;124;44;18446744073709551615
1505169984;1;256;1;8;132;44;2242639250
1505170011;1;4;1;1;124;4;26017498167
1505170016;1;32;1;2;124;186;4364193140
1505170025;1;64;1;1;124;44;8296515983
1505170030;1;32;1;2;124;132;4376329344
1505170031;8;32;1;2;33;186;993547004
1505170032;2048;32;256;2;124;186;18446744073709551615
1505170037;1;32;1;2;124;682;4360922018
1505170038;2048;32;256;2;124;186;18446744073709551615
1505170039;1;1024;1;128;124;682;782061560
1505170045;1;32;1;2;1;682;5001653125
1505170052;1;32;1;4;124;1;6612066250
1505170053;32;32;4;2;124;682;386256627
1505170057;1;32;1;32;124;682;3421178458
1505170068;1;8;1;8;124;682;10222876292
1505170070;64;8;2;8;124;682;1185192296
1505170071;256;32;256;2;124;186;18446744073709551615
1505170077;1;32;1;2;124;2;5862376714
1505170082;1;32;1;2;124;682;4361210621
1505170163;1;1;1;1;124;682;80006524625
1505170172;1;32;1;1;124;682;8216649084
1505170177;1;32;1;2;124;682;4360621178
1505170181;64;32;2;2;4092;682;3295274882
1505170186;1;32;1;2;124;682;4360544004
1505170186;32;128;4;128;124;682;18446744073709551615
1505170188;4096;32;2;2;124;682;456529181
1505170192;1;32;1;16;124;682;3540406439
1505170194;64;32;2;2;682;682;1176958611
1505170204;1;8;1;8;124;682;10225205875
1505170206;512;32;2;2;124;682;660087140
1505170207;1;512;1;128;124;682;820647335
1505170288;1;1;1;1;124;682;80006608458
epoch;GLOBAL_SIZE_0;GLOBAL_SIZE_1;LOCAL_SIZE_0;LOCAL_SIZE_1;v_TP_2103;v_TP_2104;cost
1505170314;8;8;1;8;682;124;2066183939
1505170315;128;4;2;2;11;4;393902965
1505170316;1;1024;1;256;1;1;18446744073709551615
1505170317;64;64;64;32;1;11;18446744073709551615
1505170318;256;4;1;2;11;4;634427638
1505170319;64;4;4;2;11;4;605269477
1505170399;1;1;1;1;31;186;79351203806
1505170400;4096;512;256;16;66;2046;18446744073709551615
1505170401;2;4096;1;256;186;11;18446744073709551615
1505170402;1;1024;1;4;124;31;563748271
1505170403;128;4;8;2;11;2;871349848
1505170411;2;8;1;2;1;93;6791298357
1505170412;128;4;2;4;11;341;387687887
1505170413;128;64;2;2;11;4;406475890
1505170415;128;8;64;2;11;4;1493021626
1505170417;4096;2048;1;2;11;11;841129009
1505170418;128;4;2;4;11;31;445454306
1505170425;128;4;2;4;372;1;6260748855
1505170426;128;4;2;4;11;341;387552795
1505170427;2048;2;1;2;11;341;706010721
1505170428;128;256;2;32;11;341;390978514
1505170430;128;4;2;4;124;341;647579515
1505170431;64;32;2;32;11;341;391835509
1505170432;128;4;2;4;3;341;485165300
1505170433;128;4;32;4;44;341;18446744073709551615
1505170434;1024;4;2;4;22;341;358449753
1505170436;128;4;1;2;11;3;1312309165
1505170437;128;4;2;2;11;341;432953800
1505170438;64;4;4;2;341;341;551903265
1505170439;1024;4;32;4;22;341;18446744073709551615
1505170440;1024;4;256;4;22;341;18446744073709551615
1505170441;1024;4;1;4;22;341;373474424
1505170442;2;4096;1;64;372;62;533185375
1505170482;1;2;1;2;22;341;39049059877
1505170483;4096;4;2;4;22;341;358378876
1505170484;1024;4;2;1;22;341;878370549
1505170504;1;4;1;2;31;341;19283490750
1505170506;4096;4;2;2;22;341;426422253
1505170507;512;4;1;4;22;341;374125473
1505170508;4096;4;2;4;22;132;365648472
1505170509;4096;4;2;4;66;341;373714541
1505170510;4096;4;2;4;22;682;354411503
1505170511;4096;4;2;4;11;341;386599385
1505170512;4096;32;2;32;22;124;415670675
1505170513;4096;4;256;4;22;132;18446744073709551615
1505170514;4096;4;4;4;22;682;377469047
1505170515;4096;4;2;4;22;44;378578669
1505170516;4096;4;2;2;22;372;402916430
1505170517;64;4;2;4;22;682;354525003
1505170518;4096;4;2;4;22;2046;426050552
1505170519;4096;4;2;4;3;682;484346052
1505170520;1024;4;2;4;22;682;352776012
1505170521;1024;64;8;32;22;66;18446744073709551615
1505170522;1024;8;2;8;22;682;358272377
1505170523;1024;2;2;2;22;682;437051804
1505170529;4;4;2;4;22;682;4880946057
1505170530;1024;4;2;4;22;33;420191930
1505170533;1024;4;2;4;682;682;1850977691
1505170535;1024;4;2;1;22;682;891085885
1505170536;1024;4;2;4;22;124;370449583
1505170537;1024;4;2;4;62;682;473007387
1505170539;1024;8;1;2;22;682;790613195
1505170540;1024;16;2;1;22;682;888946847
1505170541;1024;4;2;4;22;1023;369225418
1505170542;1024;4096;64;32;22;682;18446744073709551615
1505170543;1024;64;2;32;22;682;357087509
1505170545;1024;4;2;1;22;682;884975299
1505170549;16;4;2;4;22;3;3043078325
1505170550;1024;128;2;32;22;682;358035924
1505170551;1024;4;2;4;22;62;399129667
1505170552;1024;4;2;4;31;682;417380292
1505170553;1024;1;4;1;22;4;614149012
1505170554;1024;128;1;32;22;682;366993127
1505170560;64;2;1;1;93;1;5486472582
1505170561;128;512;128;1;1364;1;18446744073709551615
1505170562;16;1024;8;128;372;62;18446744073709551615
1505170563;128;2048;2;16;3;372;506192087
1505170564;64;4;8;2;341;11;604292515
1505170566;1024;4;2;4;1;1364;777374680
1505170566;1024;1024;64;32;22;682;18446744073709551615
1505170568;32;4;2;4;22;682;705232235
1505170569;2048;4;2;4;22;682;352636887
1505170570;1024;4;2;4;22;186;366623047
1505170572;2048;4;2;1;22;682;888352467
1505170573;2048;4;2;4;11;682;388851385
1505170574;2048;256;2;32;22;682;357603425
1505170575;2048;4;2;4;22;1364;362066667
1505170576;256;4;2;4;22;682;352855385
1505170577;2048;2;32;2;31;682;379688754
1505170578;2048;4;2;4;22;66;385176177
1505170579;2048;4;2;4;22;11;499962750
1505170586;2048;4;2;4;372;1;6264324583
1505170587;2048;4;8;4;22;682;380483466
1505170589;2048;4;2;4;1;62;805536627
1505170590;2048;256;2;32;22;33;777573755
1505170591;2048;4;2;4;22;22;443989542
1505170593;2048;4;2;1;22;682;882597576
1505170595;2048;4;2;4;22;2;1144507587
1505170703;1;1;1;1;1;1023;107516064958
1505170705;2048;16;2;1;22;682;895743437
1505170715;2;4;1;4;22;682;9841791244
1505170717;2048;4;2;1;22;682;890617820
1505171042;1;1;1;1;1;1;324344602584
1505171150;1;1;1;1;1;1023;107539171750
1505171155;16;2048;16;1;2046;1023;2378463500
1505171263;1;1;1;1;1;1023;107516127791
1505171589;1;1;1;1;1;1;324344415515
1505171697;1;1;1;1;1;1023;107551544022
epoch;GLOBAL_SIZE_0;GLOBAL_SIZE_1;LOCAL_SIZE_0;LOCAL_SIZE_1;v_TP_2116;v_TP_2117;cost
1505171722;256;2;32;2;4092;33;909085530
1505171745;2;32;2;8;2046;4;22807462825
1505171772;2048;1;128;1;4092;1364;25823047992
1505171772;16;4096;4;128;4;4;18446744073709551615
1505171775;8;64;1;32;12;93;1473629209
1505171776;2048;128;256;2;4;2046;18446744073709551615
1505171777;32;64;8;32;1;12;1112193070
1505171779;256;32;2;4;1;341;805845768
1505171801;4;1;1;1;1;62;21626485969
1505171804;16;128;4;16;186;682;1956886625
1505171805;1024;512;2;1;12;44;725598194
1505171806;8;128;4;128;132;341;18446744073709551615
1505171807;2048;32;128;4;4092;1364;18446744073709551615
1505171833;1024;1;128;1;4;1364;25798507625
1505171834;2048;1;128;1;4092;2;612599939
1505171861;2048;1;128;1;12;1364;25809131950
1505171888;1024;1;128;1;1023;1364;25872232667
1505171901;1024;2;128;1;4;1364;12936885872
1505171905;1024;1;128;1;11;132;2953732573
1505171912;1024;1;128;1;4;372;6990710999
1505171939;2048;1;128;1;2;1364;25797299617
1505171940;128;4;128;4;4;682;18446744073709551615
1505171966;1024;1;256;1;6;1364;25806135541
1505171971;1024;1;128;1;4;186;3810406534
1505171978;2048;1;128;1;2;372;6995823750
1505172005;2048;1;1;1;2;1364;25835334417
1505172006;2048;4;128;4;2;1364;18446744073709551615
1505172088;2048;1;64;1;2;4092;82074468253
1505172099;8;1;8;1;2;66;10037828373
1505172100;2048;512;128;256;2;1364;18446744073709551615
1505172101;2048;128;128;8;2;1364;18446744073709551615
1505172102;2048;1;128;1;2;22;1092946054
1505172114;1;8;1;8;44;62;10767840208
1505172116;128;1;4;1;132;1;1755268646
1505172130;2048;2;256;1;2;1364;12893505620
1505172156;1024;1;128;1;2;1364;25783875533
1505172167;2048;2;256;1;1;1023;10091391424
1505172181;1024;2;256;1;2;1364;12913857917
1505172182;2048;2;256;2;1;132;18446744073709551615
1505172182;2048;4;256;2;1;1364;18446744073709551615
1505172189;1024;2;256;1;2;682;6393943708
1505172203;2048;2;256;1;1;1364;13499412208
1505172245;1;2;1;1;2;4092;40709190280
1505172246;2048;2;256;2;2;1364;18446744073709551615
1505172267;2048;2;256;1;1;2046;20878046292
1505172281;2048;2;1;1;6;1364;12984952417
1505172282;4096;2;256;2;2;1364;18446744073709551615
1505172295;1024;2;128;1;2;1364;12913276709
1505172297;512;1024;1;1;372;1;1083893507
1505172337;1;2;1;1;2;1364;39330871333
1505172338;2048;1024;256;256;2;1364;18446744073709551615
1505172345;2048;2;256;1;124;682;6624622927
1505172347;128;512;4;4;341;11;1413044470
1505172361;4;2;1;2;186;682;12841898535
1505172362;64;512;4;2;11;12;459200518
1505172363;64;256;2;256;186;33;18446744073709551615
1505172365;64;2048;2;32;132;62;1255107170
1505172366;32;128;8;4;1;44;676158555
1505172370;32;1;2;1;1023;11;3644600473
1505172375;8;1024;1;8;1023;132;3570757541
1505172376;2048;2;256;2;2;1364;18446744073709551615
1505172380;1024;2;128;1;2;372;3503177188
1505172407;2048;1;1;1;1;1364;27020663084
1505172434;2048;1;256;1;2;1364;25787906125
1505172437;2048;2;2;1;2;124;2673911486
1505172439;2048;32;1;4;2;1364;1305374788
1505172441;2048;2;64;1;2;62;1205805160
1505172455;2048;2;256;1;93;1364;13016172500
1505172479;4;1;2;1;11;4;23000395542
1505172481;256;64;1;4;66;93;1244391280
1505172485;1;4096;1;128;124;12;3806337649
1505172496;1;8;1;1;66;372;10553721375
1505172497;2048;4;256;4;44;4092;18446744073709551615
1505172504;4096;2;256;1;2;682;6433441971
1505172518;4096;2;256;1;1;1364;13521041314
1505172522;2048;2;256;1;2;186;2611069098
1505172535;128;2;1;1;2;1364;12959821663
1505172549;2048;2;64;1;2;1364;12891556370
1505172550;2048;32;256;4;2;1364;18446744073709551615
1505172550;2048;2048;64;256;2;124;18446744073709551615
1505172592;2048;2;64;1;2;4092;41064478625
1505172596;2048;2;1;1;2;93;2901271946
1505172598;2048;2;64;1;2;12;1572077708
1505172612;2048;2;64;1;62;1364;12984195959
1505172638;2;2;1;1;62;1364;25869026661
1505172652;2048;2;64;1;4;1364;12922149744
1505172656;2048;2;64;1;2;341;3222853195
1505172658;2048;2;8;1;2;124;1596336891
1505172661;2048;2;64;1;2;4;1716100334
1505172674;2048;2;32;1;2;1364;12897766292
1505172678;2048;8;64;1;2;1364;3222477129
1505172682;2048;2;64;1;2;372;3519457646
1505172709;2;2;2;1;2;1364;26021414084
1505172723;4096;2;64;1;2;1364;12890891959
1505172723;2048;32;64;8;2;1364;18446744073709551615
1505172750;4096;1024;64;1;4092;1364;25855043952
1505172755;4096;2;64;1;4;1;3964092910
1505172757;4096;2;64;1;2;6;1540742517
1505172770;4096;2;64;1;31;1364;12984841250
1505172784;128;2;64;1;2;1364;12908045754
1505172798;4096;2;1;1;3;1364;12963855668
1505172838;1;2;1;1;2;1364;39332102083
1505172845;4096;4;64;1;2;1364;6446833018
1505172885;1;2;1;1;2;1364;39329377292
1505172899;4096;2;64;1;2;1364;12895260704
1505172909;4;2;1;1;2;31;10035389543
1505172912;4096;2;64;1;2;11;1561572635
1505172925;4096;2;64;1;2;1364;12900907204
1505172939;4096;2;256;1;2;1364;12893798829
1505172941;4096;2;64;1;2;93;1369087430
1505172955;64;2;1;1;2;1364;12944746873
1505172968;4096;2;32;1;2;1364;12894061662
1505172982;32;2;32;1;2;1364;12840830709
1505172996;4096;2;64;1;372;1364;14150934465
1505173001;2;256;1;16;341;62;4017354668
1505173006;8;1024;8;16;1023;124;3959616074
1505173033;2;2;1;1;186;1364;25882437833
1505173035;4096;2;2;1;2;12;1229670269
1505173048;8;2;4;1;2;1364;12841689709
1505173052;4096;8;64;1;132;1364;3357673291
1505173066;4096;2;16;1;2;1364;12895783463
1505173092;2;2;1;1;2;1364;26009572375
epoch;GLOBAL_SIZE_0;GLOBAL_SIZE_1;LOCAL_SIZE_0;LOCAL_SIZE_1;v_TP_64;v_TP_65;cost
1505173119;128;32;32;1;31;66;2305513324
1505173132;1;2048;1;8;2046;682;12804729908
1505173134;32;16;32;1;341;1;1078211289
1505173136;16;1024;16;2;1;124;1382973959
1505173148;8;1;4;1;132;66;10612849634
1505173151;64;16;32;2;341;1;3251421167
1505173159;128;16;8;2;1364;1023;6578269274
1505173162;8;16;2;1;341;11;2344715403
1505173167;32;16;32;1;4092;66;4986606707
1505173169;256;16;32;1;341;1;1166058362
1505173172;2048;16;32;1;341;1;2122773718
1505173175;32;16;32;1;1;1;2453453857
1505173177;32;16;32;1;682;66;1151560559
1505173178;32;16;32;16;4092;22;18446744073709551615
1505173185;32;16;32;1;4092;372;7096618037
1505173191;32;16;32;8;4092;66;4990391375
1505173197;32;16;2;1;4092;66;5001307625
1505173200;32;8;32;1;1023;66;2504426979
1505173206;1024;16;32;4;4092;66;4984800164
1505173208;32;16;32;1;22;66;1463814955
1505173209;1024;512;1;4;1;66;467299680
1505173211;1024;16;32;4;682;66;1169023208
1505173217;1024;16;32;1;4092;33;5056564880
1505173220;1024;2048;32;4;4092;66;2508273690
1505173221;1024;512;1;4;1;66;466251061
1505173222;1024;32;1;4;1;66;475450183
1505173224;1024;512;1;4;22;66;707179142
1505173227;1024;512;32;4;4092;66;2512654872
1505173229;1024;512;1;1;4;66;1487078940
1505173231;1024;512;1;4;682;66;1054819508
1505173234;1;512;1;4;1;66;2065444936
1505173235;1024;512;1;4;1;1;410155180
1505173239;128;64;32;4;1;1;3840925236
1505173240;1024;512;1;4;1;1;410581844
1505173242;1024;512;1;4;1;2046;766588007
1505173248;1024;512;64;4;31;1;5380563865
1505173251;128;512;1;4;1;1;2859139715
1505173252;1024;512;1;4;1;12;410598888
1505173253;1024;512;32;4;1;341;649321754
1505173256;1024;512;16;4;1;1;1517996963
1505173258;4;32;1;4;93;1;1819768511
1505173260;256;512;1;4;1;1;1762203602
1505173263;1024;8;64;4;1;1;1616077670
1505173267;1024;512;1;4;22;1;3381151026
1505173269;1024;512;1;1;1;1;1354111323
1505173270;1024;128;1;4;1;1;423497626
1505173273;1024;512;1;256;372;1;2603609367
1505173274;1024;8;256;2;1;1;18446744073709551615
1505173278;1;128;1;4;341;186;3745856031
1505173280;128;64;2;64;132;31;869524846
1505173282;128;1;16;1;11;1023;2103677458
1505173285;512;512;4;4;4092;1;2088535493
1505173287;1024;512;64;4;1;12;664930777
1505173288;1024;512;1;256;1;1;341693631
1505173290;1024;512;1;16;22;1;1633834204
1505173293;1024;512;1;64;132;1;2664113487
1505173294;1024;512;1;64;1;1;361470001
1505173295;1024;512;1;256;1;2;388629965
1505173296;1024;128;1;128;1;1;350844797
1505173298;1024;16;1;8;6;1;1380139973
1505173299;1024;512;32;256;1;1;18446744073709551615
1505173300;1024;1024;1;256;1;1;343459292
1505173300;1024;256;8;256;341;1;18446744073709551615
1505173301;1024;512;1;8;1;1;375082849
1505173302;2048;2048;1;256;1;1;367086876
1505173304;1024;512;1;256;1;11;427330596
1505173305;1024;512;1;256;1023;33;1125191672
1505173307;16;512;1;256;124;1;1533832347
1505173309;1024;256;1;256;1;1;345223722
1505173316;4096;4;16;4;1023;1364;6498102438
1505173320;8;4;1;4;44;11;3557241477
1505173321;1024;512;1;256;1;1;341425717
1505173323;1024;8;1;1;1;2;1603797125
1505173324;1024;512;1;256;1;1;343313712
1505173325;1024;512;32;256;1;1;18446744073709551615
1505173327;1024;512;1;2;12;1;1052799103
1505173328;1024;512;1;256;1;682;876214693
1505173329;1024;512;1;256;22;1;409094211
1505173332;1024;512;1;256;186;1;1730264526
1505173333;1024;512;1;256;11;1;346553051
1505173333;32;512;16;256;66;1;18446744073709551615
1505173334;256;512;1;256;1;1;372210922
1505173336;16;512;1;128;1;341;737857064
1505173337;64;512;1;256;31;1;673273255
1505173338;1024;1024;1;256;1;1;343052461
1505173365;1;4;1;1;6;1364;25884906125
1505173366;128;512;1;4;4;62;662398184
1505173369;16;128;1;1;44;341;2022389382
1505173369;1024;512;2;256;1;1;18446744073709551615
1505173384;1;16;1;8;1;682;13395236949
1505173410;1;4;1;1;4092;1364;25882109037
1505173437;1;2048;1;8;6;1364;25851958792
1505173517;1;1;1;1;6;1364;79021734709
1505173518;1024;1024;1;8;1;62;503583001
1505173544;1;2048;1;256;6;1364;25847599368
1505173597;1;2;1;2;6;1364;52155151875
1505173624;1;512;1;8;6;1364;25828248034
1505173627;1024;1;1;1;11;31;2146984327
1505173655;1;1024;1;8;1;1364;27058758084
1505173681;1;512;1;8;6;1364;25849819625
1505173689;4;4096;2;8;6;1364;6596367441
1505173715;1;512;1;8;341;1364;25933977830
1505173742;1;512;1;8;6;1364;25834050667
1505173768;1;512;1;8;44;1364;25861640958
1505173795;1;256;1;8;6;1364;25850899743
1505173796;256;1024;64;8;11;372;18446744073709551615
1505173822;1;512;1;8;6;1364;25824261660
1505173849;1;512;1;8;6;1364;25832065708
1505173857;4;256;4;8;186;1364;7080677382
1505173883;1;512;1;8;124;1364;25928806414
1505173936;1;2;1;2;6;1364;52153681964
1505173943;1;512;1;8;62;341;6446968269
1505173970;1;512;1;8;6;1364;25840549541
1505173997;1;512;1;8;1023;1364;25890533787
1505173998;256;512;4;16;6;1364;805778803
1505174025;1;32;1;8;6;1364;25850643452
1505174051;1;512;1;8;66;1364;25892046537
1505174053;1;512;1;8;6;11;1128038278
1505174080;1;512;1;8;6;1364;25834263451
1505174082;1;512;1;8;6;11;1111685889
1505174108;1;512;1;8;4;1364;25830276076
1505174149;1;4096;1;8;6;2046;39926056289
1505174162;2;512;1;8;6;1364;12847102077
1505174164;512;512;4;8;6;62;673027690
1505174190;1;512;1;64;2;1364;25825886083
1505174197;4;512;4;8;6;1364;6606575600
1505174198;2048;64;256;8;3;186;18446744073709551615
1505174219;1;8;1;4;3;1023;19631645609
1505174219;1024;64;128;8;6;186;18446744073709551615
1505174222;512;32;64;1;22;682;2287455363
1505174249;1;64;1;8;6;1364;25835361208
1505174275;1;64;1;8;2;1364;25814786992
1505174302;1;512;1;8;2046;1364;25888889791
1505174329;1;4;1;1;186;1364;25949098458
1505174355;1;2048;1;8;2;1364;25820598209
1505174357;128;512;4;8;2;1364;729144088
1505174383;1;64;1;32;2;1364;25823146909
1505174410;1;32;1;8;124;1364;25891219662
1505174436;1;64;1;64;2;1364;25820434584
1505174438;512;64;8;8;2;1364;700136183
1505174518;1;1;1;1;341;1364;79064826127
epoch;GLOBAL_SIZE_0;GLOBAL_SIZE_1;LOCAL_SIZE_0;LOCAL_SIZE_1;v_TP_141;v_TP_142;cost
1505174553;2048;256;2;128;1023;1;11543892584
1505174557;32;2;8;1;33;44;3174508199
1505174559;8;256;4;1;33;372;1899666041
1505174589;256;1;256;1;3;12;28878479828
1505174591;256;32;64;4;4;2046;1382889337
1505174593;32;64;2;4;132;1364;1075763244
1505174594;16;2048;4;1;2;66;895005544
1505174596;8;256;4;1;33;66;1366670500
1505174599;8;32;1;1;4;1;1632155550
1505174618;4;2;4;2;31;2;19039787585
1505174621;4096;2048;1;2;31;1;2181262962
1505174623;1;512;1;16;2;682;1331871041
1505174625;512;128;128;1;12;93;1403832301
1505174705;2;1;2;1;1023;1;78684224695
1505174729;1;4;1;4;1023;33;24197431508
1505174731;2048;32;8;8;12;93;494480268
1505174732;2048;16;8;16;12;93;575247922
1505174733;2048;16;8;16;31;93;516489378
1505174734;2048;64;32;4;12;93;606551771
1505174735;2048;32;8;8;31;93;492084547
1505174737;2048;32;8;8;22;62;508729050
1505174741;1;32;1;8;3;93;3326834458
1505174762;4;1;1;1;132;124;20916172375
1505174763;2048;32;8;8;66;93;576162333
1505174809;2;1;2;1;186;6;44910848621
1505174811;16;2048;2;64;682;4;1373400547
1505174819;1;16;1;16;6;66;7642651068
1505174830;1;128;1;8;93;1;9573710148
1505174985;1;1;1;1;3;1;154915774417
1505174987;2048;32;16;8;31;93;532114765
1505174988;2048;64;8;4;12;93;482473762
1505174989;2048;16;8;16;22;93;540414645
1505175150;1;1;1;1;1;1;160099686833
1505175151;1;2048;1;16;1;132;500093042
1505175306;1;1;1;1;3;1;154915399125
1505175462;1;1;1;1;3;1;154915803542
1505175465;4096;1;1;1;3;1;1937386851
1505175494;8;1;4;1;3;1;28448444519
1505175497;1;1024;1;16;12;1;2828164925
1505175653;1;1;1;1;341;1;155009608917
1505175675;2048;1;256;1;1;1;21366641959
1505175677;8;256;2;16;341;3;1067030097
1505175678;4;256;1;32;1;132;539603764
1505175679;1;1024;1;64;62;33;931446233
1505175682;16;8;8;4;22;31;1522746252
1505175763;1;1;1;1;3;372;80465210603
1505175767;1;1024;1;16;3;1;3289511594
1505175918;1;1;1;1;11;1;150215561791
