GLOBAL_SIZE_0;GLOBAL_SIZE_1;LOCAL_SIZE_0;LOCAL_SIZE_1;cost
1;512;1;8;78631008
1024;4;1;2;102028960
1;4;1;4;8587216800
1;1024;1;128;71821120
1;1024;1;1;139900416
1024;1;1;1;179806976
64;8192;1;512;209779936
16;32;8;32;88797920
2;1024;2;128;30395552
4;1024;4;128;20595040
2;2048;2;128;23027264
4;1024;1;128;44364800
4;1024;4;64;19249824
4;1024;4;512;18446744073709551615
4;2048;4;128;20114816
2;1024;1;256;40108480
2;1024;1;64;39121408
2;2048;1;64;47721824
16;1024;4;64;31453952
4;512;1;16;32559744
8;4096;1;32;121661536
1;512;1;128;142162432
4;1024;1;32;32205088
4;1024;4;32;18468576
512;1024;256;64;18446744073709551615
4;32;4;1;297245504
1;128;1;2;245309408
1;1024;1;32;71808128
512;1024;256;32;18446744073709551615
4;64;4;32;197975648
4;1024;4;16;18427840
512;1024;256;16;18446744073709551615
4;32;4;16;394622432
256;1024;128;16;18446744073709551615
4;256;4;16;51166272
4;1024;2;16;23062208
1024;32;512;16;18446744073709551615
1;1024;1;16;52553344
4;1024;4;1024;18446744073709551615
4;16;4;16;786853856
4;1024;2;16;23102336
4;256;4;1;72984768
2;1024;1;16;29137888
8;4096;8;16;17839904
1;4096;1;16;35301056
8;4096;4;16;26107328
32;512;2;8;26090048
4;2048;2;16;25872608
4;4096;2;16;23625120
8;512;8;16;13902208
32;4096;8;16;23668224
4;8192;2;8;21383776
4;1024;2;16;23123232
16;512;4;64;24452544
32;512;2;16;67993888
8;512;8;32;14401088
8;512;1;16;44430304
8;512;8;8;14051456
2;512;2;4;37121760
16;512;4;32;23579488
32;128;2;16;44910560
1;512;1;16;99750464
1;512;1;8;79031648
8;64;8;16;89066432
1;512;1;16;99798176
64;512;1;16;126823968
8;8;8;1;593198016
32;512;4;16;39384512
8;512;1;32;42379488
4;512;2;16;32716064
64;1024;2;32;76748960
64;1024;64;2;14161504
4;1;2;1;9173184096
512;128;128;1;15691488
8;1024;8;16;11928864
16;512;4;16;24014624
2;512;2;16;53891744
8;512;2;16;17642144
8;4096;1;16;32572864
8;1024;8;64;12146144
8;8192;8;16;17443968
32;1024;2;16;68429472
2;1024;2;16;29364832
16;1024;4;16;29099424
4;1024;4;8;18581248
8;1024;8;4;16022944
8;2048;8;16;13459296
8;128;1;16;60137792
8;128;8;16;45004224
8;2048;8;32;13166144
8;1024;1;16;40084576
16;1024;1;16;47454528
16;4096;4;16;27129984
8;1024;4;16;13701664
8;2048;4;16;26105824
8;512;8;4;14064736
8;1024;8;8;12032768
8;256;8;64;24950240
8;512;4;16;15752096
8;8192;1;8;30517728
8;128;8;8;45063520
8;4096;2;32;62202912
32;4096;2;8;19803360
8;2048;4;32;29753472
64;1024;1;16;109984640
16;1024;2;32;64537632
8;2048;1;16;36689056
16;1;4;1;2353919520
4;256;2;16;60031360
16;1024;4;8;17880160
4;128;2;16;117449504
2;1024;2;32;29339744
32;1024;4;32;39782560
4;1024;2;8;29435616
8;1024;8;32;11835808
2;1024;1;8;42828160
8;32;4;16;196100352
4;2048;4;32;20334496
4;1024;2;64;27725472
8;512;1;64;43905536
8;1024;1;128;133259040
8;1024;2;32;49483200
8;512;8;64;15474976
64;512;1;32;154306752
2;512;2;32;53950880
64;1024;64;32;18446744073709551615
8;256;8;8;23242880
1;2048;1;32;40304448
8;1024;2;16;23456352
32;1024;2;64;90970464
8;2048;2;64;67249504
8;256;8;32;24479008
128;1024;64;32;18446744073709551615
8;1024;1;32;126902752
4;1024;1;64;36644224
8;1024;4;32;19746016
32;1024;2;32;82351584
8;512;4;32;21015776
8;2048;1;32;124331104
16;1024;4;32;31225792
1;1024;1;32;71795680
2;1024;2;32;29329856
8;1024;4;128;17296480
2;256;2;32;106585472
1;1024;1;64;71740224
4;512;4;32;27148128
8;256;4;32;27312544
16;2048;8;32;19413824
8;1024;8;128;13622080
64;256;2;32;84720224
2;1024;2;8;23524192
8;512;2;32;25701664
4;1024;2;32;22937888
2;1024;2;64;29426272
32;1024;2;128;91309856
32;1024;4;4;24848480
4;256;2;32;59959648
8;256;8;4;23287232
32;512;8;32;23292352
8;4096;8;32;17721632
16;1024;16;32;6811648
4;4096;1;32;91167392
32;1024;8;32;24509824
16;512;16;32;7768928
16;4096;1;32;117918016
16;2048;16;16;10965280
16;1024;1;32;129994144
16;1024;16;16;6963360
64;512;8;64;25781632
32;1024;4;16;39133984
16;1024;16;8;6873344
16;1024;8;8;16453856
16;2048;16;32;10888576
4;2048;2;32;38728960
128;1024;4;32;42955904
16;1024;16;1;12588384
16;2;16;2;1339080768
1;1024;1;32;71783072
2048;1;512;1;30207936
16;1024;16;64;7215584
4;512;2;32;32722944
32;2048;8;32;24374400
16;1024;1;16;48187040
32;256;4;1;50595040
16;4096;16;16;10080672
16;1024;16;128;18446744073709551615
128;2048;2;32;74242624
16;1024;2;64;67903136
16;1024;2;32;64820960
16;512;8;32;13417664
8;16;8;1;295539968
16;256;16;32;12134368
16;1;2;1;2285550080
8;1024;2;128;48833696
2048;1024;512;32;18446744073709551615
4096;1024;512;32;18446744073709551615
64;2048;1;256;207653664
4096;2;512;2;11827904
1;2048;1;1;139562880
1024;1;128;1;50932832
64;512;4;64;42125024
256;1024;1;32;113439616
16;2048;8;16;19594240
16;8192;16;32;9432064
64;2048;2;32;73061280
2;64;2;1;228883072
16;512;16;8;8009568
64;1024;4;32;41400640
16;1024;8;32;16364992
1;1;1;1;27024253760
16;2048;4;32;35120640
4;2048;1;32;93515872
8;1024;4;32;20365120
128;4096;2;8;18872160
8192;1;32;1;20589536
1024;256;4;128;45067136
512;128;128;2;13940256
8;1024;8;16;11913152
16;512;1;32;132424384
32;1024;16;64;17108320
4;256;1;32;82126720
4096;128;8;8;15324960
16;1024;16;1024;18446744073709551615
16;16;2;16;281872000
64;2048;4;32;40743808
64;1024;8;32;24853184
1;32;1;32;2263588544
16;32;1;4;81747712
1024;1;4;1;87513728
64;512;16;512;18446744073709551615
256;8192;32;1;7335808
16;4;16;1;612370784
16;4096;16;32;9981824
16;512;16;64;8285024
32;1024;8;16;24462496
256;2048;16;16;16765952
64;2048;8;32;24602368
2048;2048;1;1;196683840
32;256;8;32;20688192
128;128;32;2;13506688
64;512;16;256;18446744073709551615
32;4096;2;256;93741696
32;128;1;1;182987680
128;32;2;32;64128224
1;16;1;1;1656026560
16;2048;1;32;126895008
32;512;32;16;5495840
16;2048;8;64;19262560
256;512;4;8;24600384
32;256;32;16;6872448
32;1024;32;32;7033184
32;512;8;16;23358400
32;512;32;64;18446744073709551615
32;4096;16;16;15597920
32;512;16;16;15002112
32;512;32;32;5980160
32;1024;32;16;8596384
32;1024;32;64;18446744073709551615
32;512;32;8;5985888
8;8192;4;16;23605536
64;512;16;32;19231904
64;128;16;16;15080032
1024;512;16;256;18446744073709551615
512;512;64;128;18446744073709551615
128;128;32;128;18446744073709551615
512;128;8;4;21033568
64;2048;16;16;18128544
32;512;32;4;5823872
8;512;8;16;13888224
16;512;2;32;53150496
64;512;16;16;19393984
32;256;32;8;7112064
16;128;2;16;37465920
32;512;8;8;23289088
2;4096;2;2;42385632
4;8192;2;2;48869856
8;2048;8;512;18446744073709551615
2;512;2;16;53876576
32;512;16;4;16036128
16;2048;2;16;30738208
64;512;8;16;24985216
1;512;1;512;173032384
512;512;2;16;58813984
4;512;4;16;27132448
256;512;2;32;80522624
8192;1024;4;1;94827392
16;512;2;16;46099488
128;512;8;16;25985792
2048;512;8;1;26595264
512;1;8;1;89033920
1024;32;512;4;18446744073709551615
128;64;4;2;42316864
4096;64;1;16;38750016
32;8192;32;2;5997792
32;2048;32;32;5841312
32;2048;32;8;7234784
32;8;32;4;163642848
64;256;1;16;129238048
32;2;32;1;655500608
64;256;16;16;18003008
32;128;32;16;11421056
2048;128;4;4;19884800
8192;64;2;16;22337408
16;4096;2;8;23737856
256;512;4;16;40225984
32;512;16;32;14455648
128;4096;32;2;6170208
32;1;2;1;1266613568
512;512;512;512;18446744073709551615
1024;2;1;1;187163808
4096;128;4;8;13907328
32;256;32;4;7191072
2048;8;8;4;24765440
4;512;4;64;28550144
2048;32;8;16;26042880
32;4096;32;16;6815360
64;512;8;16;24986208
2048;512;1;16;27771680
2048;128;4;8;18835456
2048;128;8;8;22321440
2048;256;8;4;13454240
8192;2048;4;8;15541088
256;4;4;2;49350944
512;128;512;2;10596064
64;128;16;32;15590336
64;512;64;2;15003648
32;256;32;64;18446744073709551615
16;512;8;16;14121696
64;1024;16;32;19118208
4;512;2;16;32724768
128;512;1;16;123258112
512;1;2;1;153382208
512;128;128;32;18446744073709551615
4096;2;256;2;13147712
1;2048;1;1;139674752
32;512;32;128;18446744073709551615
32;2048;32;16;7167008
8192;1;16;1;30793472
8192;1;512;1;11230720
1;512;1;16;99769184
32;8;32;1;162774528
1024;8;4;8;35074048
8192;128;128;2;7560704
16;32;1;4;81794496
64;1;16;1;662222752
32;512;1;16;137841856
4096;4096;1;16;23309856
32;512;1;16;136298976
256;1;32;1;173784672
128;128;32;16;12626304
8192;4096;128;256;18446744073709551615
128;64;64;2;10432768
1;4096;1;2;78888928
4;8192;1;32;88768032
4;2048;1;512;100034240
64;4;32;2;162606112
32;512;32;1;8850880
32;512;16;512;18446744073709551615
512;1;32;1;91861888
1024;32;64;4;15102592
128;64;64;2;10496640
32;4096;32;2;6012064
32;512;8;16;23416416
4096;512;1;16;27980384
32;4;32;4;327010976
32;1;8;1;1272198176
512;512;2;512;105723744
1024;2;1;1;186386624
8192;2048;4;1;99574912
32;512;4;16;39099776
32;512;2;16;69320320
32;512;32;2;7680352
16;4;2;2;645234880
1;512;1;256;147437344
1024;1;1;1;179864320
1;1024;1;2;93944416
32;32;32;16;42732544
32;512;32;1;8880384
32;512;32;256;18446744073709551615
1;1;1;1;26467283648
16;256;4;1;46413920
4096;64;8;1;29698688
1;2;1;1;13249623360
32;512;32;512;18446744073709551615
2;1;1;1;14878452224
1;1;1;1;27359710752
1024;8;4;4;32164416
32;128;1;1;181894080
32;256;32;4;7207872
16;64;1;64;83030304
64;1;16;1;654342560
512;8192;1;1;181351936
1;128;1;16;397020640
32;1;32;1;1326016480
32;4;32;2;329241600
32;2;32;2;653388352
8;1;8;1;4811529824
128;64;8;2;24886112
2;64;2;1;228863040
4;1;2;1;9196624096
32;512;32;2;7648640
32;64;32;16;21698304
32;512;32;1;8862656
1;4096;1;512;50700288
2;1;2;1;14798393120
512;1;8;1;89039328
1024;32;1;4;56700576
32;512;16;2;13680096
16;2048;2;256;70914848
32;1;32;1;1317092896
32;8192;2;1;85986976
32;512;2;512;90940864
32;512;4;1;48443456
32;512;16;16;15086912
32;2048;32;128;18446744073709551615
128;256;64;4;15543744
2;1;1;1;16054557408
2048;1;1;1;189881248
512;128;512;8;18446744073709551615
32;512;4;256;42304960
64;1;16;1;661425920
64;128;2;2;63219328
64;1024;32;64;18446744073709551615
512;1024;2;1;88268192
1;512;1;16;99812000
4096;2;1;2;113893184
4096;2048;1024;1;4574848
8192;1;4;1;92676064
8192;1;512;1;11222880
1024;1024;4;64;38548320
8192;128;256;2;7125856
16;1;1;1;2300483904
1;1;1;1;26468479008
256;256;8;1;30740000
128;1;32;1;333753568
32;64;2;2;70462752
32;16;1;8;95489024
1;4096;1;2;78950944
256;32;16;2;18271968
1;4096;1;4;44670464
2;128;2;16;212139808
512;4096;8;16;16951200
1024;2048;4;256;42172448
128;1;64;1;337743424
8;4096;2;2;48365536
32;16;2;1;153504768
2048;64;1024;4;18446744073709551615
128;2048;64;64;18446744073709551615
8192;2048;128;8;5866304
256;1;4;1;166723808
512;1;64;1;92230624
1024;128;1;32;139930944
32;1024;1;8;30797024
512;1;8;1;89086624
512;128;32;1;9940896
4096;2;512;1;14496896
4096;2048;1024;1;4550528
8192;1;32;1;20193824
8192;1;8;1;47867008
1024;8;1;4;56342112
32;128;4;1;52254272
16;32;1;8;97246912
64;1;64;1;664378432
256;8192;32;1;7338816
128;128;8;16;25741728
32;64;2;1;98257504
128;1024;64;256;18446744073709551615
2;8192;2;2;42279488
4096;32;16;2;15629696
1;4096;1;16;35107328
1;512;1;64;142117248
512;256;8;16;25636480
1;1;1;1;26518294752
128;2;64;1;167269184
32;4;32;2;327190304
64;8192;16;1;12488192
2048;512;2;2;53853024
128;8;8;4;48920352
8192;2048;128;1;4898304
256;1024;1;1024;263808960
256;4096;8;2;13413920
64;128;64;32;18446744073709551615
256;1024;64;2;13900320
512;1;2;1;152824992
1;1;1;1;26518191008
4096;2;1;1;210206304
512;2048;1;1;173801856
8192;1;1024;1;11761632
8192;1;4;1;92566400
256;64;64;64;18446744073709551615
8192;128;1;2;186437600
16;32;2;4;90440736
1;1;1;1;26502873248
256;8192;32;16;5958592
128;1;32;1;335849856
256;64;256;2;11983040
128;64;1;2;97203712
2;8192;2;1;75843680
4096;32;1;2;113996064
1;4096;1;1;139496512
2;2048;2;512;41532224
2048;4096;1;512;98889824
1024;32;64;4;15216640
128;2;16;2;179081760
32;32;32;32;43501664
1024;256;16;4;12223648
2048;512;16;2;11234944
128;256;64;1;11712224
8192;2048;128;1;4894464
512;4;1;2;103016128
512;128;16;2;16220768
64;1;32;1;671065824
256;1;64;1;173220000
512;1;64;1;91661600
512;128;1;1;175647648
128;256;2;2;50578880
64;128;8;8;21402720
8192;1;1024;1;11873856
8192;1024;512;16;18446744073709551615
1024;1;4;1;88996352
8192;128;32;64;18446744073709551615
64;32;32;32;23264704
64;512;2;2;50307616
256;8192;32;8;5135072
128;8192;32;16;8436608
256;8192;256;256;18446744073709551615
2048;64;64;32;18446744073709551615
128;32;8;2;28790656
1024;1;16;1;50611104
1;1024;1;16;53210624
2;16;2;16;1688889696
512;4096;8;1;23756512
1;8192;1;256;79792320
128;1;64;1;337714464
4096;4096;32;2;5087488
1024;8;16;4;17328256
2048;32;1;16;132920160
2048;256;64;1;9149664
32;2048;1;1;168450304
256;4;4;4;54332160
8192;128;1;2;186404672
64;128;4;1;55108192
8192;1024;64;2;6488736
512;1;16;1;91758144
512;1;2;1;153175296
1;1;1;1;27354224704
4096;2048;1024;4;18446744073709551615
2048;1;1024;1;31526656
32;1;8;1;1278876608
1024;1;4;1;87283200
8192;1;16;1;30838752
64;1;32;1;652941216
1024;512;256;2;9403360
4096;16;1024;2;18446744073709551615
4096;2048;1024;32;18446744073709551615
4;2048;4;128;20138304
4096;8;1024;8;18446744073709551615
512;4096;32;8;5526528
128;4096;2;512;100786560
256;1;128;1;174055616
128;4;128;4;87159072
512;8192;64;1;5373056
4096;128;1024;8;18446744073709551615
256;2048;64;32;18446744073709551615
4096;32;32;2;8867936
4096;128;16;2;11562368
1;4096;1;1;139465504
2;2048;2;512;41572800
128;2048;4;32;41936512
4096;2048;1024;512;18446744073709551615
4;2048;2;1;86889504
4096;2048;1024;2;18446744073709551615
4096;512;1;2;115719136
4096;1024;1024;1;5526304
8192;2048;1024;1;5476704
4096;2048;1;512;104145440
4096;2048;16;1024;18446744073709551615
4096;2;1024;1;11251872
4096;4;1024;4;18446744073709551615
4096;2048;64;256;18446744073709551615
512;4096;4;16;9775200
256;32;4;4;31401216
128;64;128;2;10227456
4096;16;32;2;10315456
512;2048;1;1;173860064
1;2048;1;1;139602624
1024;4;16;4;18701952
2048;4096;16;1;14397472
1024;256;64;16;8841184
1;2048;1;1;139593408
4096;2048;1024;8;18446744073709551615
4096;2048;256;1;4158752
4096;2048;1024;256;18446744073709551615
4096;2048;1024;128;18446744073709551615
4096;2048;64;1;5262432
4096;8;256;8;18446744073709551615
4096;2048;256;256;18446744073709551615
4096;8192;256;1;3868928
4096;2;1;2;113818400
8192;64;256;16;18446744073709551615
4096;2048;2;4;33242016
4096;1;256;1;20652000
4096;8192;1;1;278916416
4096;1;512;1;20383840
4096;8192;128;1;3827072
4096;8192;1;1;278882112
4096;2048;128;1;4063648
8;8192;8;1;23378176
8192;8192;128;1;5004128
512;8192;128;128;18446744073709551615
1024;4;128;4;14065184
4;8192;2;1;86082560
4096;8192;1024;4;18446744073709551615
4096;8192;512;1;4117952
4096;2048;128;4;4625920
4096;8192;128;1;3840800
256;8192;128;1;4711264
4096;8192;512;32;18446744073709551615
4096;8192;1024;1;5076320
512;8192;2;1;92453312
4096;8192;8;1;35799392
4096;8192;128;128;18446744073709551615
128;8192;128;1;5628192
4096;8192;128;4;3901184
4096;8192;128;64;18446744073709551615
4096;1;128;1;20023136
4096;8192;16;1;18404320
16;8;4;8;389265792
4096;2048;1;1;227181600
4096;8192;32;1;9790784
4096;8192;16;16;4080896
1;8192;1;1;139333728
64;2;1;2;329609472
4096;1024;128;1;5334368
4096;8192;128;2;3690240
1;8192;1;1;139354976
4096;1024;128;2;5907168
4;8192;2;2;48875776
32;8192;2;2;47848448
2048;8192;128;2;3933152
8;8192;4;2;25176512
4096;8192;1;2;148092128
64;8192;1;2;93666432
4096;8192;512;2;4755360
256;8192;128;2;4815072
4096;8192;128;512;18446744073709551615
4096;32;128;2;13050208
512;8192;128;2;4413248
4096;128;128;128;18446744073709551615
4096;1024;128;64;18446744073709551615
4096;2;128;1;12134048
4096;256;128;2;9372608
2;8192;2;2;42240672
4096;8192;32;2;5139776
4096;8192;128;8;4653216
4096;8192;128;1024;18446744073709551615
4096;4096;128;2;3955424
4096;1;128;1;20031840
8;8192;8;2;14558560
4096;8192;4;2;37463232
4096;8192;1;2;148040960
4096;8192;256;2;3917376
1;8192;1;2;78900832
4096;512;128;1;10850336
4096;16;128;8;10542432
1024;1024;128;2;8334944
4096;2048;128;2;4013568
4096;4;1;2;115913568
1024;8192;128;2;4188256
4096;8192;64;2;3729696
8192;8192;128;2;5093344
512;8192;4;2;26159392
2;8192;2;8;21904672
4096;128;128;2;10961152
4096;8192;512;1;4116608
1;8192;1;2;78885920
4096;8192;128;32;18446744073709551615
4096;2;128;2;12589728
4096;1;256;1;20719040
4096;512;128;2;7402848
8192;1024;128;2;6584864
1024;4;128;2;13553504
16;8192;4;2;24883744
4096;16;128;1;16204288
4096;8192;8;2;19422496
4096;8192;16;2;9946464
4096;8192;128;256;18446744073709551615
8192;1;128;1;10996640
1;8192;1;2;78849216
8192;8192;128;1;5002464
2048;8192;128;1;3981120
4096;256;32;2;7817632
8192;8192;256;2;5627424
4096;4096;1024;2;18446744073709551615
128;8192;128;2;6175424
32;8192;1;2;93989344
1;8192;1;2;78872256
4096;8192;64;8;3988896
4096;8192;2;512;34861664
512;8192;1;2;100467712
4096;8192;16;32;4655488
512;2;128;2;46172640
4096;64;128;2;12095648
4096;1;128;1;19993088
4096;8;128;2;14267104
8192;8192;1;2;252784672
1;8192;1;2;78897440
4096;4;128;2;13070592
4096;8192;8;8;5585664
4096;8192;512;4;18446744073709551615
1;8192;1;2;78930784
1024;8192;512;2;4441824
4096;4096;512;1;4288448
4096;8192;8;256;18446744073709551615
4096;8192;8;1024;18446744073709551615
16;8192;4;1;44219360
64;32;1;2;105249920
4096;8;2;2;59685728
8;4;8;2;1313488992
1;8192;1;8;29335776
4096;16;128;2;14097760
1024;8192;32;2;5260832
4096;2048;64;2;3937824
4096;8192;1024;256;18446744073709551615
4096;512;128;16;18446744073709551615
2048;1;128;1;29830400
2;2;2;2;8386994016
4096;128;128;1;14273440
4096;128;1;2;114379328
4096;2;1;2;113846784
4096;1;128;1;20128416
4096;8;128;1;16674688
4096;8192;16;64;5325536
4096;8192;1024;2;18446744073709551615
8192;8192;32;2;8609664
4096;4;4;2;43226048
4096;4;64;2;14672576
64;8192;1;128;186778048
128;8192;128;128;18446744073709551615
4096;8192;32;8;3918976
4096;4096;128;1;3854784
1;8192;1;2;78849344
512;8192;32;2;5372128
4096;8192;8;16;4268096
512;8192;64;2;4395648
2048;8192;256;1;4101120
2048;8192;64;8;4566464
2048;8192;128;8;4730912
1024;8192;128;256;18446744073709551615
8;8192;8;256;18446744073709551615
4096;64;128;32;18446744073709551615
4096;4096;128;4;4373888
1;8192;1;512;89119296
128;4;16;2;90087104
2048;128;512;2;10189568
64;4096;16;32;17324928
1024;1024;64;2;9904544
1;1;1;1;27361456224
2;128;2;1;119103520
4096;1;512;1;20410752
4096;2048;16;1;15656096
8192;1;1024;1;11645632
2048;64;512;16;18446744073709551615
1024;4096;4;8;10090240
8192;1;2;1;181479264
512;4;32;2;23202112
2048;64;256;16;18446744073709551615
128;8192;32;1024;18446744073709551615
128;8192;32;1;7452736
256;256;8;256;18446744073709551615
128;4096;128;1;11846144
256;32;32;2;9963168
32;128;16;2;15170784
1;2048;1;16;29579200
2;2048;2;1;76037888
512;1;4;1;88999616
1024;1;8;1;50937248
1;64;1;2;491487712
4096;1;32;1;20054368
1024;1;16;1;50601504
2048;8192;16;1;15181920
1024;256;1;2;99616096
1;1;1;1;26516378496
256;256;4;256;48284544
2048;128;512;4;18446744073709551615
1;128;1;32;566076128
8192;1024;64;1;7507872
512;1;8;1;88860544
512;128;32;8;14865088
4096;8192;512;128;18446744073709551615
512;2048;4;32;36350592
4096;1;1024;1;20667776
2048;1;512;1;30257824
32;4096;4;8;17979648
8192;128;256;2;7083232
512;32;32;32;11436896
1024;512;1;1;180117568
256;1;32;1;173043424
2;128;2;2;131901344
4096;8192;1;1;278984352
256;64;256;16;18446744073709551615
128;64;64;16;9117824
4096;32;64;32;18446744073709551615
2048;8192;256;2;4389856
1024;4096;32;4;4499584
4096;1;128;1;19990048
4096;1;512;1;20410336
1024;4096;128;2;4449504
4096;1024;16;2;9711232
1;128;1;16;396070848
2;1;2;1;14988081600
256;4096;8;8;9500768
1;8192;1;256;79815328
128;64;8;16;23437088
4096;4096;1;64;44065024
1024;16;1;1;180836000
2048;512;8;2;15810304
2;4096;2;16;26705920
2;4096;2;1;75898784
256;256;2;64;93574528
4096;8192;64;4;3822688
1024;8192;128;8;4463136
1024;8192;128;4;4314080
2048;128;512;1;14469664
64;128;16;8;14947520
8192;32;128;2;8109760
1024;256;8;1;25757376
2;8192;2;2;42238880
2048;8192;128;4;4388256
4096;8192;64;1;5147936
512;128;2;1;91150752
8192;64;512;8;18446744073709551615
4096;32;1024;32;18446744073709551615
8192;1;1;1;358027328
1024;256;256;2;11837536
4096;2048;32;4;4320352
8192;1;128;1;10957504
4096;8192;256;4;4710496
8192;1;1;1;357814592
1024;4096;16;8;5832416
8192;1;4;1;92537088
512;512;32;2;7896352
8192;8192;64;4;5112256
2;8;2;2;2100048736
1;256;1;4;136155744
1;64;1;8;623858976
2048;8;32;1;12214752
256;64;4;2;38243136
128;64;2;1;98777824
1;2048;1;2;78999328
1;2;1;2;15703296704
1;1;1;1;26464444000
4096;1;64;1;20109600
2048;4096;128;2;4108416
4096;1;256;1;20657888
128;2048;128;512;18446744073709551615
256;512;8;1;24692928
4096;4;64;4;10860768
512;64;128;2;14879520
2048;8192;64;2;3987936
8192;4096;32;1;14410560
1024;256;64;4;12468288
2048;256;16;256;18446744073709551615
1;1;1;1;26464793664
4096;2048;16;2;8860832
4096;4096;256;2;4315200
8192;2048;128;2;5032064
256;128;4;1;51868672
2048;1024;8;512;18446744073709551615
1024;128;1;8;33607776
8192;512;128;32;18446744073709551615
512;32;128;2;11307296
32;128;8;1;29624224
512;1024;32;1;7842368
4096;1024;512;128;18446744073709551615
4096;8192;256;1;3842976
4096;64;128;16;18446744073709551615
128;2048;4;1;44506880
8192;2048;256;64;18446744073709551615
8192;8192;512;16;18446744073709551615
1;4096;1;8;33771712
4096;1024;256;2;5826336
1;1;1;1;26465213696
4096;4096;32;4;3906880
4096;8192;16;8;3910944
1;8;1;2;3932622560
512;256;32;4;14586112
1024;1;2;1;115844064
256;4096;32;8;8105696
1;8192;1;4;44664800
1024;1;128;1;50872320
16;16;8;1;144092672
256;1;256;1;167999424
128;64;4;16;40949088
256;32;32;1;12325120
4096;8;1;2;114566688
4096;1024;16;1;15026912
4096;2048;1024;16;18446744073709551615
1;2048;1;512;66162752
256;1;8;1;169709888
1;8192;1;2;78850240
8192;8192;128;4;5593856
1;4;1;4;8586706400
128;512;128;16;18446744073709551615
1;16;1;2;1965986688
2048;256;16;4;8963264
1024;8192;128;1;4164544
4096;2048;512;2;4485376
2048;512;32;2;7894976
1;512;1;16;99825344
8192;64;128;4;7043840
256;512;4;256;48685152
8192;8192;64;2;5035968
4096;1;128;1;19991296
4096;8192;32;64;18446744073709551615
4096;1;128;1;20078112
4096;8192;128;16;18446744073709551615
1;128;1;2;245568832
128;2;128;2;169993536
1;8192;1;64;89242784
4096;8192;4;32;5228384
1;8192;1;2;78864320
8;512;8;2;22129056
1;8192;1;1;139274112
256;8192;128;32;18446744073709551615
2;8192;2;1024;18446744073709551615
4096;2;128;2;12267616
1024;8192;64;2;4194848
2;1024;2;2;50256000
4096;8192;2;2;74721376
4096;32;1024;2;18446744073709551615
4096;2048;8;2;16917472
1;16;1;4;2170738112
4096;2048;256;2;4303392
1;8192;1;1;139315232
4096;8192;1024;128;18446744073709551615
256;8192;16;2;8051744
4096;8192;256;64;18446744073709551615
32;8192;2;64;85678912
1;8192;1;8;29277728
1;2048;1;1;139656608
2048;128;8;2;17881280
4096;128;1;8;34931712
8192;4096;128;2;4996832
1024;256;256;1;14387200
256;1024;32;1;7605184
64;2;4;2;327204288
16;2048;2;1;86246080
8192;1;1;1;357693504
1;1;1;1;27029454272
1024;1;16;1;50544736
32;128;4;128;30327392
512;512;8;2;15472128
512;512;16;2;13062816
256;8192;32;2;5465568
128;8192;8;1;23010816
256;1;256;1;167165312
1024;512;16;128;18446744073709551615
2048;1;32;1;29826496
4096;1;8;1;43743200
1;128;1;16;393733248
1;256;1;1;216423008
512;4096;8;8;8030368
4096;16;1;2;114247104
128;2048;128;16;18446744073709551615
1024;1;1;1;180105856
1;256;1;4;136232384
2048;256;32;4;13389120
1024;256;64;1;10087584
8192;1024;128;1;5358688
256;2048;4;256;46505056
2048;128;256;8;18446744073709551615
32;1;32;1;1317989184
8192;1;128;1;10966336
16;256;8;1;28092032
256;1024;32;1;7599072
4096;2;512;1;13996480
4096;1;128;1;20010080
4096;2048;512;1;4364384
1;512;1;1;166179008
8192;1;64;1;11096992
256;4096;16;8;15179328
4096;4096;64;2;3870976
4096;1;128;1;20055552
1;1024;1;64;71763296
512;1;32;1;92219200
4096;16;256;2;13803552
256;8192;32;32;6625056
2048;128;32;1;10917216
4096;1024;256;256;18446744073709551615
1;256;1;4;135822368
8192;32;32;4;7982336
4096;1024;16;4;6924640
256;2048;1;16;22894624
8192;2048;1;1;387031872
1;4096;1;8;33869408
512;4;64;1;23052608
4096;4096;512;4;18446744073709551615
128;64;1;2;97931968
256;512;32;2;8025344
1;256;1;4;136080416
1024;128;64;1;11165664
1024;256;8;128;26478848
8192;1024;1;128;53691744
8192;4096;256;2;5231104
512;2048;2;1;88654208
2048;128;512;4;18446744073709551615
64;128;16;8;14820608
8192;4096;16;2;14713504
8192;1;128;1;10941792
8192;2048;128;4;5508320
1;1;1;1;27019260640
256;1024;32;4;14008448
4096;8;512;8;18446744073709551615
4096;2048;128;1;4073760
256;8192;32;4;4834240
8192;4096;512;2;5867232
8192;1;4;1;92592960
2048;1;64;1;29767744
1024;4096;1024;8;18446744073709551615
4096;128;256;2;9770784
512;8;2;8;42145120
1024;512;1;2;99712416
2048;4096;128;1;4140928
1;1;1;1;27364179936
256;8;32;8;23531328
128;8192;32;2;5728544
1024;64;4;1;50309728
4;128;1;16;116369952
4096;4096;128;8;4813632
4096;1;256;1;20702624
8192;1024;128;128;18446744073709551615
4096;256;512;4;18446744073709551615
1;2048;1;16;29624544
2;2048;2;8;28494368
512;1;8;1;89251584
4096;1;64;1;20149088
512;64;1;2;98548384
4096;1;1024;1;20721472
2048;1;16;1;32804000
2048;512;128;2;9299200
64;256;64;1;14300672
1024;2048;1;1;181710816
2048;8192;32;2;5187616
64;2048;16;1;13907648
2048;1;512;1;30206240
64;2048;16;8;18158272
8192;128;16;8;8398272
1024;4096;256;1;4409312
2048;1024;32;1;8011808
1;128;1;1;221971776
4096;2048;64;1;5261152
4096;1;256;1;20568128
2048;1024;32;2;7297664
8192;1;128;1;10922656
8192;256;64;4;6586816
1024;16;16;8;19434848
1;128;1;2;245452864
1024;512;32;256;18446744073709551615
8192;512;256;2;7398400
1024;1;256;1;49532672
1;512;1;8;79277312
1;128;1;2;245472512
4096;64;128;8;6834464
128;64;64;32;18446744073709551615
8192;1;32;1;20543840
1;1024;1;1;139886976
256;2048;128;16;18446744073709551615
2;4096;2;8;23601120
512;256;64;8;12087008
4096;4;32;4;12696096
128;128;128;2;12243072
4096;4096;32;1024;18446744073709551615
2048;2048;64;2;4497536
8192;512;32;2;9031424
8192;256;64;16;6562080
8;2048;8;1;23439168
64;2048;2;1;86149088
2048;8192;16;2;8439968
8192;4096;256;1;4926688
2048;8;512;2;12754784
2048;128;1;8;33618528
128;1;128;1;332099008
1024;128;128;1;15553088
256;16;32;1;11883936
4096;2;512;1;13095584
2048;4096;128;4;4356928
4096;1;64;1;20115232
8;8192;8;512;18446744073709551615
4096;1;128;1;20042560
128;32;1;2;99464448
4096;32;128;8;8413088
4096;1024;128;128;18446744073709551615
4096;512;128;128;18446744073709551615
4096;1;512;1;20394464
16;8192;16;2;8462784
4096;128;16;16;16028416
1024;512;128;2;10945024
4096;1024;128;512;18446744073709551615
4096;2;4;2;38108736
4096;8192;8;64;5037632
64;8192;8;1;22830752
4096;8192;2;256;24571264
4096;1;1024;1;20758592
4096;8192;4;1;70744768
1;8192;1;2;78866080
64;8192;4;2;24667424
4096;32;128;4;10806848
16;8192;1;2;93885760
256;8192;4;16;9586304
256;8192;128;64;18446744073709551615
4096;8192;2;16;13073984
4096;2;2;2;59968320
256;8192;1;256;155514816
256;2;128;2;87866464
16;8192;4;4;15304128
128;8192;128;1024;18446744073709551615
512;1024;128;2;9782368
4096;32;64;2;14863648
32;256;32;2;7295584
4096;4096;1;2;131845504
4096;8192;512;1024;18446744073709551615
4096;2;1024;2;18446744073709551615
4096;8192;512;512;18446744073709551615
4;4096;2;2;48942464
4096;8192;2;1;140878464
1;8192;1;2;78884064
4096;8192;1024;64;18446744073709551615
4096;8;512;2;13390912
4;32;2;2;310689408
4096;4;128;4;10339424
4096;8192;1;256;56335744
4096;32;32;4;13846560
64;512;1;2;94324256
