GLOBAL_SIZE_0;GLOBAL_SIZE_1;LOCAL_SIZE_0;LOCAL_SIZE_1;v_TP_953;v_TP_954;cost
128;2048;4;1;89;2047;1188465443
1;512;1;8;4094;23;37803744625
8;512;8;1;89;2;1051146366
32;32;1;1;178;2;470834958
32;32;1;1;178;23;456082428
64;32;1;1;178;2;462786800
8;32;1;2;178;2;356182180
4;32;1;1;178;2;1308737151
256;32;1;2;178;2;531981684
8;4096;1;256;178;2;1337979639
2;4;1;1;23;1;7677743042
8;32;8;2;2;1;321867591
512;512;64;32;46;2047;18446744073709551615
4;64;2;32;1;2047;566068426
8;4;2;1;23;23;1580408191
8;16;1;8;89;46;862221868
8;4;8;2;89;1;2071537619
8;4;8;1;2;1;1869263116
8;32;8;2;46;1;306513926
8;32;8;2;23;1;300659086
4096;32;128;1;23;1;159221923
256;32;128;2;2;1;160181631
8;32;8;2;4094;1;8673865555
8;32;8;4;23;1;300898671
8;32;8;16;4094;1;8674822778
8;32;1;2;46;1;306799258
8;32;1;2;178;46;865105425
8;32;1;2;4094;1;8670945042
8;128;1;2;4094;1;8670739903
16;32;2;1;4094;1;4276099928
16;64;2;8;4094;1;4304442455
8;32;1;4;4094;1;8670599764
16;512;2;8;1;1;169549545
32;64;2;8;4094;1;2137837777
16;8;2;8;1;1;415670959
16;64;1;8;4094;1;4300287041
16;1024;1;8;4094;23;2421774588
2048;64;1;8;4094;1;517044125
16;64;1;8;2;1;917410076
16;64;1;8;4094;1;4300688954
4;1;2;1;1;23;9491697166
256;2048;8;32;4094;4094;36152885798
2048;512;64;128;23;1;18446744073709551615
1;4;1;1;23;4094;8956765581
16;16;1;8;4094;1;4300554217
16;64;4;8;4094;1;4305074038
16;128;1;8;4094;1;4300112417
16;64;1;16;4094;1;4307653209
16;128;2;4;4094;1;4243018447
16;128;1;8;4094;4094;36153024465
16;512;1;32;1;1;747978458
16;64;1;1;4094;1;4255554760
16;128;1;64;1;1;1196371507
4096;128;1;8;4094;1;516537713
16;128;1;128;4094;1;4312229722
16;512;1;8;4094;1;4300586004
16;128;1;8;4094;2047;18388830641
16;256;1;16;4094;1;4307812821
16;128;1;16;4094;1;4307639375
1024;128;1;8;4094;1;516739887
16;128;2;8;1;1;187609544
16;128;1;8;178;1;676911307
16;128;1;2;1;1;204578296
16;128;1;8;2047;1;2109504212
128;128;2;16;4094;1;1052277853
16;32;1;8;4094;1;4300083025
16;8;1;8;4094;1;4300540079
128;4;1;1;4094;1;1032265444
32;8;1;4;4094;1;2110436444
8;16;1;8;4094;1;8675196889
16;32;1;16;4094;4094;36153113583
16;32;4;4;4094;1;4240475145
16;32;1;8;2047;1;2114260019
16;4096;1;256;4094;1;4325850792
16;32;1;2;4094;1;4255507542
16;2;1;2;4094;1;4255361593
16;32;8;8;4094;4094;36152767791
16;1;16;1;2047;46;2524718306
4096;8;32;2;178;4094;4676245986
16;1;4;1;178;1;3909889439
2;2048;1;32;4094;2047;18393604599
16;32;1;4;4094;1;4255639614
64;64;1;16;4094;1;1051549000
8;32;1;8;4094;4094;36152928625
16;32;1;2;23;1;280073670
16;2048;1;8;178;1;522546680
2;32;1;8;4094;1;35420297292
16;32;2;8;4094;2047;18390797125
64;32;1;8;4094;4094;36152567173
2048;1024;64;256;23;4094;18446744073709551615
16;32;1;1;4094;1;4255269760
1024;32;16;32;4094;1;18446744073709551615
256;32;8;8;1;1;124727336
32;32;2;8;1;1;117638544
8;8;2;8;4094;1;8681656043
16;16;1;8;4094;4094;36153309131
1;1;1;1;178;1;64011445000
16;32;8;8;4094;1;4292163476
1;32;1;8;4094;46;36791267084
2;32;2;8;4094;1;35421147850
8;32;1;8;89;1;390471922
8;32;1;8;4094;1;8675042069
16;32;2;8;4094;1;4304545112
32;64;1;16;4094;1;2135601945
2048;4096;8;32;4094;89;928400536
128;4096;16;32;4094;4094;18446744073709551615
512;4096;16;1;178;1;168250215
4;4;1;2;178;46;2762526635
8;8;4;4;89;23;1449529027
16;512;1;32;4094;1;4299271583
64;32;1;8;4094;1;1048806447
16;1024;1;8;4094;1;4300709121
16;2;1;2;4094;1;4255420207
16;512;1;256;4094;46;2401691809
16;512;8;32;4094;1;4291163833
16;512;8;32;4094;1;4291246625
16;512;1;256;4094;23;2456908573
16;512;4;16;2047;178;1529229735
4096;128;1;32;4094;2047;18400336433
16;8;1;1;4094;1;4255463000
16;512;1;32;4094;2;3451736621
16;1024;8;32;2;1;156527418
16;512;8;32;46;1;679117473
16;512;1;32;4094;23;2436382252
16;512;1;64;4094;1;4315482333
16;128;1;32;4094;4094;36153081382
16;256;1;32;2047;1;2133170666
1;1;1;1;178;1;64011563084
4;512;1;32;4094;1;17595816209
8;512;1;32;4094;1;8762354823
1;1;1;1;4094;1;71687612583
16;2048;1;32;4094;1;4299916679
16;1024;1;32;1;4094;977841157
16;512;2;64;4094;1;4297134838
16;128;1;32;178;1;1942652328
256;512;1;32;2047;1;1039089742
16;512;2;64;4094;2;3454236277
128;512;2;1;4094;1;513114591
64;512;2;32;4094;1;2131627803
16;512;16;64;4094;178;18446744073709551615
16;2048;2;32;178;1;1886192319
16;1;2;1;4094;1;4283989601
16;1024;2;64;4094;1;4296797870
16;512;2;64;1;1;527320309
2;1024;2;64;4094;1;35420876059
16;1024;4;64;4094;1;4276758871
16;1024;16;64;4094;1;18446744073709551615
512;1024;2;64;4094;1;2129446129
16;1024;2;2;4094;1;4276058042
16;1024;4;32;4094;1;4309327551
16;1024;2;256;1;1;18446744073709551615
64;1024;2;256;4094;1;18446744073709551615
2;1024;2;64;89;1;1235340500
16;1024;1;8;4094;1;4300339050
16;8;2;4;4094;1;4242764677
16;1024;2;64;1;1;394336390
16;1024;2;64;2047;1;2095874178
16;1024;2;64;4094;46;2391047884
8;2;2;1;4094;1;8664006417
16;1024;2;1;4094;1;4276141481
16;1024;16;64;1;1;18446744073709551615
16;1024;2;64;23;1;1450226556
4;8;4;8;89;2047;2567104739
16;1;2;1;4094;1;4283962149
16;64;2;64;46;1;1925605625
128;256;2;1;178;1;266609845
8;1024;2;64;4094;1;8761752137
16;2048;2;64;4094;1;4296693726
32;2048;2;64;4094;2047;18395501058
16;1;2;1;1;1;2887145593
8;2048;2;64;4094;4094;36153230292
4;512;2;64;4094;1;17595151899
32;2048;2;64;4094;1;2125953203
4;2048;2;32;4094;1;17595134542
