GLOBAL_SIZE_0;GLOBAL_SIZE_1;LOCAL_SIZE_0;LOCAL_SIZE_1;cost
2048;32;1;8;24265778
2048;1024;64;1;981482
2;1;2;1;3830085185
1;256;1;8;29945778
64;1;4;1;179804741
2048;1;32;1;6435111
2;4;2;2;958760148
1024;256;1;1;22239704
2048;128;64;2;1473926
4096;4096;128;1;706815
2;1024;1;1;23908445
2048;1024;64;64;18446744073709551615
64;32;32;4;6331703
256;2;64;1;23568000
4096;512;256;16;18446744073709551615
4096;4096;1;1;32364593
8;1;8;1;1143525037
4096;4;128;1;1181037
4096;4096;16;1;2059111
4096;4096;128;64;18446744073709551615
4096;4096;256;1;694371
4096;4096;128;256;18446744073709551615
4096;2048;128;1;671260
4096;2048;128;256;18446744073709551615
4096;1024;128;1;889334
2048;2048;256;1;891407
1024;2048;128;256;18446744073709551615
1024;4096;128;256;18446744073709551615
4096;1;128;1;3443556
1;2048;1;1;25414815
4096;512;128;1;1185185
1;1;1;1;7202533778
512;2048;128;1;1279259
4096;1;128;1;3449777
128;2048;1;1;22237334
16;4;4;2;171710223
4096;2048;64;1;752741
4096;1024;256;256;18446744073709551615
2048;512;128;1;1306370
1;512;1;1;26773333
4096;2048;32;16;18446744073709551615
4096;128;128;2;1326963
64;2048;1;1;22255703
1024;64;8;1;3428296
1;2048;1;1;25032444
4096;128;1;4;7545037
8;4;1;2;286348593
256;1024;4;128;18446744073709551615
4096;2048;256;4;18446744073709551615
1;256;1;128;81904000
4096;256;128;1;1386815
4096;2048;1;1;22499407
2048;64;16;64;18446744073709551615
2048;2048;128;1;809037
256;64;16;2;1559704
512;16;32;2;1592000
2048;64;4;32;6255408
128;16;8;2;5901630
4096;256;4;256;18446744073709551615
4096;1;1;1;23697778
32;256;1;64;19912445
1;1024;1;1;26418371
4096;2048;2;256;18446744073709551615
4096;2048;2;1;11373334
4096;2048;128;1;673778
4096;2048;256;1;653185
2048;2048;64;1;835407
1;2048;1;1;24943556
4096;2048;256;256;18446744073709551615
4096;1024;1;1;22232445
4096;1;256;1;3442815
4096;1024;1;256;119295111
4096;2048;1;1;22500444
1;4096;1;1;24475556
4096;512;256;1;1197926
4096;1024;256;1;819852
1;2048;1;256;51190815
1;128;1;2;58159112
1024;2048;256;1;1047408
2048;1;1;1;25499112
4096;2048;1;256;77859852
2048;4096;256;256;18446744073709551615
512;2048;256;1;1276445
4096;512;256;256;18446744073709551615
1;2048;1;1;25264296
1;1024;1;1;26400889
2048;2048;1;1;22218963
4096;4096;256;128;18446744073709551615
4096;1;1;1;23730963
4096;2048;256;128;18446744073709551615
1;4096;1;256;90437334
1024;4096;256;1;971407
2048;1;64;1;13004593
1;1;1;1;7214445334
1024;256;1;128;47476000
4096;1;64;1;3445185
4096;4096;256;256;18446744073709551615
4096;4096;1;1;32365333
1024;2048;64;256;18446744073709551615
1;2048;1;256;44618963
2048;2048;256;256;18446744073709551615
4096;256;256;1;1392888
4096;2048;64;256;18446744073709551615
1024;1024;256;1;1256445
4096;256;256;256;18446744073709551615
1024;2048;128;1;1058074
4096;128;64;2;1451111
4096;1;128;1;3443260
2048;1024;256;1;1115407
256;512;1;1;22257926
1;1024;1;1;26392889
2048;4096;256;1;646074
1024;4096;1;256;41018518
1;1;1;1;7202348148
2048;1;256;1;6506667
2048;4096;1;1;22354666
512;4096;128;1;1018519
2048;4096;128;1;636000
4096;4096;64;1;686370
2048;1024;128;1;1115259
1;4096;1;1;24601629
2048;1;128;1;6539260
256;4096;128;1;1293482
2048;2048;128;256;18446744073709551615
2048;1;1;1;25312148
1024;1;1;1;28695407
512;4096;64;1;1077926
2048;4096;128;256;18446744073709551615
2048;2048;32;1;797037
2048;4096;128;128;18446744073709551615
2048;4096;64;1;706371
2048;4096;32;1;935408
1024;4096;128;1;773778
2048;4096;32;128;18446744073709551615
1024;4096;64;1;806222
2048;256;128;1;1430815
2048;4096;256;128;18446744073709551615
256;4096;64;1;1207259
1024;4096;128;128;18446744073709551615
1;4096;1;1;24389333
512;4096;128;256;18446744073709551615
2048;4096;64;256;18446744073709551615
1024;1;64;1;12521185
2048;1024;128;128;18446744073709551615
1024;1024;128;1;1297185
256;4096;128;256;18446744073709551615
1024;1;256;1;12336444
512;1;128;1;24032889
256;1024;128;1;1478074
1024;1;128;1;12408000
2048;1;64;1;6693778
1024;4096;32;1;769629
1;4096;1;256;76794074
1024;1;128;1;12416740
1;1024;1;256;62576741
4096;4096;1;256;33696592
2048;1024;256;256;18446744073709551615
512;2048;1;1;22218371
512;4096;256;1;1057186
2048;1;256;1;6464889
512;2048;256;256;18446744073709551615
2048;1024;128;256;18446744073709551615
1;4096;1;128;91618962
2048;1024;1;1;22218519
256;1;128;1;48465778
1024;2048;64;1;1357926
512;1;128;1;37111704
32;8;32;1;45048000
4096;4096;128;128;18446744073709551615
4;1024;4;2;6285333
256;32;16;16;1806519
1;2;1;2;3709149333
8;512;8;128;18446744073709551615
8;64;8;4;18360296
64;4096;64;1;1638815
2048;16;128;8;18446744073709551615
32;4096;2;1;11148593
2048;4096;128;32;18446744073709551615
2048;4096;1;1;22357630
2048;4096;4;1;5740000
1024;64;8;64;18446744073709551615
1024;1;64;1;12275259
1024;4096;256;128;18446744073709551615
1;4096;1;1;24539704
512;4096;32;1;748148
2048;1;128;1;6506815
2048;4096;64;128;18446744073709551615
2048;4096;128;4;18446744073709551615
2048;4096;128;16;18446744073709551615
1024;512;32;1;1490222
1;1;1;1;7204519407
2048;1024;32;1;761482
128;1;32;1;93627703
1;1;1;1;7201061334
1;2048;1;1;24998074
2048;1;128;1;6516741
2048;1;64;1;6630666
1;4096;1;1;24447555
2048;2048;128;128;18446744073709551615
1024;4096;256;256;18446744073709551615
2048;4096;64;64;18446744073709551615
2048;4096;16;1;1621926
4096;4096;64;256;18446744073709551615
1;4096;1;1;24513482
2048;4096;32;256;18446744073709551615
256;4096;256;1;1152444
512;1;64;1;24180888
512;32;32;2;1086666
512;64;16;2;1906074
256;32;16;2;1657333
2048;2048;64;256;18446744073709551615
2048;1;32;1;6421926
512;512;128;1;1436297
256;2048;128;1;1437334
256;1024;32;1;1559259
1024;512;128;256;18446744073709551615
4096;2048;16;32;18446744073709551615
2048;2048;1;64;19268297
2;128;2;64;51027408
2;1024;2;2;10899704
512;1024;128;1;1418519
1;512;1;1;26797630
4096;4096;32;256;18446744073709551615
2048;512;256;1;1202814
4096;512;128;256;18446744073709551615
512;4096;1;1;22218815
256;4096;1;128;21261185
2048;4096;2;1;11270519
2048;4096;128;1;636148
2048;2;128;2;3394370
2048;4096;128;2;986074
1;1;1;1;7215203703
1;1;1;1;7136385481
1024;4096;16;1;1403703
2048;512;1;1;22221334
4096;4096;32;1;1104000
4096;1024;16;1;1470518
1024;1;256;1;12288740
128;4096;128;1;1482519
1024;1024;128;256;18446744073709551615
256;1024;1;1;22235556
1024;4096;64;256;18446744073709551615
512;4096;256;256;18446744073709551615
512;1;128;1;24423851
2048;1;1;1;25094370
2048;4096;1;256;43311703
128;64;64;1;1669037
256;64;32;1;1449926
1;2048;1;256;51370074
4096;1;256;1;3444741
1024;8;16;2;1701185
128;16;1;4;8335111
1;2;1;2;3710019555
256;128;2;16;9194667
128;1;128;1;94246518
1024;512;128;1;1400296
2048;2;1;2;17784296
8;4096;8;1;4321630
1024;256;128;1;1448889
512;1;256;1;24547704
64;64;16;32;18446744073709551615
128;1024;64;1;1581037
1024;1024;64;256;18446744073709551615
2048;4096;1;128;18853333
1024;2048;128;64;18446744073709551615
1;4096;1;256;91917037
2048;4096;16;256;18446744073709551615
4096;512;128;128;18446744073709551615
2048;1024;64;256;18446744073709551615
512;2048;32;1;1211259
4096;1;256;1;3445777
64;64;1;8;13778370
512;1;1;1;27081630
512;32;16;2;1174222
2;512;1;4;11178815
1;4096;1;256;92368297
1;1024;1;1;26437630
4096;1024;32;256;18446744073709551615
1024;4096;128;64;18446744073709551615
512;4096;128;128;18446744073709551615
1024;2048;1;1;22217630
256;4096;32;1;1167259
1024;4096;32;64;18446744073709551615
1024;1024;64;1;1275259
1024;1024;32;1;1130667
2048;512;128;128;18446744073709551615
512;1;256;1;23913778
2048;512;32;1;1345926
512;4096;64;128;18446744073709551615
256;4096;1;1;22219704
2048;256;64;1;1363851
128;4096;1;1;22226370
2048;1;16;1;6283704
2048;2048;16;1;1449777
1;1;1;1;7136893926
128;2048;1;256;32762814
2048;512;128;256;18446744073709551615
256;4096;32;256;18446744073709551615
2;2;1;1;1901615852
2048;4;256;1;1899408
1;1;1;1;7136458222
1;8;1;1;898346667
2048;2048;1;128;30311111
2048;512;64;1;1205037
2048;16;2;16;14315704
2;64;2;4;61502222
64;4096;1;8;7488000
1;4096;1;128;85683111
1024;1;64;1;12438223
2048;1;32;1;6440740
1;1;1;1;7116958370
1;4096;1;128;89347407
2048;1024;16;256;18446744073709551615
4096;1024;64;64;18446744073709551615
4096;2048;32;1;953334
256;4096;1;256;31406963
512;1024;64;1;1432000
1;256;1;1;36107852
4;1;4;1;2039789481
1024;1;32;1;12190222
1024;2;1;1;25041185
64;4;1;2;44225333
4096;1024;64;1;895852
512;2048;128;256;18446744073709551615
4096;1024;128;256;18446744073709551615
1;512;1;1;24758074
2048;4;128;1;1895852
512;2048;64;1;1265926
128;4096;128;128;18446744073709551615
1;1;1;1;7201725482
4096;4096;64;128;18446744073709551615
512;1;16;1;23738815
256;512;128;1;1509481
512;512;64;1;1440296
2048;1024;256;128;18446744073709551615
4096;1;32;1;3378519
1024;2048;1;256;60082666
2048;512;64;256;18446744073709551615
256;1;64;1;47688148
2048;1;64;1;6695704
4096;1;128;1;3430519
1024;4096;1;1;22219111
2048;1;256;1;6443408
128;1;1;1;90715259
512;1024;128;256;18446744073709551615
1;512;1;1;24771555
4;2048;2;8;11420000
4096;2048;1;4;7596445
1024;4;4;2;3994370
16;1;1;1;681382518
512;2048;64;256;18446744073709551615
256;1024;256;1;1268740
512;2048;32;256;18446744073709551615
2;4096;2;32;45873778
2048;4096;128;64;18446744073709551615
4096;1;128;1;3462519
1024;1;128;1;12394963
1024;4096;32;256;18446744073709551615
512;4096;64;256;18446744073709551615
4096;4096;32;128;18446744073709551615
256;1024;64;1;1814074
1024;1024;128;128;18446744073709551615
256;2048;128;256;18446744073709551615
1024;2048;32;256;18446744073709551615
1;4096;1;256;84305037
256;1;64;1;47862519
1024;2048;128;128;18446744073709551615
32;256;1;4;12203260
1;1024;1;1;26333778
4;1024;1;2;14416593
256;32;16;32;18446744073709551615
2048;1;128;1;6582667
2048;8;128;2;1019259
2048;1024;16;1;1411852
512;1024;256;1;1408000
128;2048;64;1;1525185
2048;256;256;1;1402222
2048;1;8;1;6929185
1024;2048;32;128;18446744073709551615
512;4096;16;1;1396889
2048;1;128;1;6480741
512;512;128;128;18446744073709551615
2048;512;256;256;18446744073709551615
2048;2048;16;256;18446744073709551615
2048;1024;1;256;93063556
1;1024;1;256;55999852
512;256;128;256;18446744073709551615
1;4096;1;2;20571703
1;1;1;1;7139693037
4096;2048;128;32;18446744073709551615
1024;1;1;1;29002370
64;1;64;1;183889630
512;1;1;1;26848000
2048;32;128;8;18446744073709551615
2048;4096;128;8;18446744073709551615
4096;2048;128;128;18446744073709551615
1024;1;16;1;12061777
1;4096;1;128;89031852
4096;2048;128;64;18446744073709551615
256;512;128;256;18446744073709551615
2048;2048;256;128;18446744073709551615
1024;512;64;256;18446744073709551615
4096;4096;64;64;18446744073709551615
2;1;2;1;3829105481
2;128;2;8;32921629
1024;8;16;2;1702074
64;1;2;1;179663555
2048;1;1;1;25124592
2048;64;128;4;18446744073709551615
128;4096;128;256;18446744073709551615
4096;4096;16;256;18446744073709551615
128;4096;64;1;1479259
1;2048;1;128;38438370
1;512;1;1;26939259
4096;512;1;1;22225482
1;1;1;1;7201808889
256;128;2;32;10294666
64;64;1;2;14506519
512;1;256;1;24095852
256;512;256;1;1326667
64;4096;1;1;22238371
2048;16;128;16;18446744073709551615
64;4096;1;256;26551704
2048;2048;32;256;18446744073709551615
4096;1024;128;128;18446744073709551615
1024;1024;1;1;22218518
2048;1024;64;128;18446744073709551615
512;4096;128;64;18446744073709551615
1;1;1;1;7201307111
1024;4096;16;128;18446744073709551615
512;1;1;1;27321037
1024;2048;32;1;730815
4096;1;64;1;3437926
512;1;16;1;23831556
2;1;1;1;3824348296
2;2;2;1;1900003852
2048;4;128;1;1877926
256;1;1;1;45294370
128;2048;128;1;1543259
256;4096;128;128;18446744073709551615
64;4096;4;1;5578666
512;2048;1;256;49391260
2048;512;256;128;18446744073709551615
256;1;256;1;48331555
64;1;4;1;180136000
2048;32;256;32;18446744073709551615
1024;4;64;2;3323704
1024;1;16;1;12048148
32;64;2;4;6049037
512;1024;256;256;18446744073709551615
2048;1024;32;256;18446744073709551615
256;1;128;1;61323407
1;2048;1;256;47530370
2048;4096;16;128;18446744073709551615
1;128;1;1;68658667
2048;4;1;2;23094963
64;2048;1;8;9770370
4096;16;256;4;18446744073709551615
1;2048;1;256;52281630
2048;4096;16;16;914222
128;4096;1;256;28974667
1;2048;1;128;40393185
2048;4096;32;64;18446744073709551615
1024;4;4;4;3610222
32;1;1;1;359465333
32;256;32;4;1747556
4096;1024;1;16;5358370
64;64;4;2;3545630
256;32;1;2;14310963
128;4096;128;16;18446744073709551615
2048;2048;64;128;18446744073709551615
512;2048;128;128;18446744073709551615
1024;4096;1;128;19862519
512;1;64;1;23866370
1;4096;1;2;20704296
1;1;1;1;7199452740
4096;256;1;32;31846222
1;2048;1;64;31507111
2048;512;128;16;18446744073709551615
64;4096;4;1;5584297
512;4096;16;4;1275407
1024;2048;256;256;18446744073709551615
1024;4096;32;128;18446744073709551615
128;2048;32;1;1497630
1;512;1;128;41493630
2;64;2;64;100435555
1;1024;1;1;27281333
1024;64;16;4;1696593
1;16;1;4;462570222
2048;4096;8;1;6008592
8;64;8;2;29794371
16;4096;4;1;5769481
1;1024;1;1;26450371
256;1;256;1;48427111
4096;1;32;1;3384888
1;4096;1;256;74672445
1;2;1;1;3597560148
1;128;1;16;65779259
1;64;1;8;120113037
1;1;1;1;7139599259
4096;4096;8;256;18446744073709551615
1;1;1;1;7136491555
1;1024;1;256;59769926
512;1;32;1;23737037
1024;1;1;1;28755852
1;1024;1;128;26300741
2048;1024;128;64;18446744073709551615
1;32;1;4;234411704
2;512;1;1;25047259
128;2;2;1;45301185
128;4;32;1;23538518
256;256;128;1;1491555
1;4096;1;64;99053333
1024;1024;256;256;18446744073709551615
2048;2048;1;256;63205185
128;512;128;1;1604592
1;1;1;1;7202209185
2048;1;32;1;6464000
1024;4;64;2;3287556
1024;1;16;1;12075704
2048;1;256;1;6482074
512;256;128;1;1443704
2048;128;256;2;18446744073709551615
2048;2048;128;64;18446744073709551615
2048;4096;256;64;18446744073709551615
4096;128;256;4;18446744073709551615
1;4;1;2;1830053926
1;2048;1;8;48617630
512;2048;1;1;22218222
256;2048;64;256;18446744073709551615
1;64;1;4;115825185
1;8;1;2;915168296
1024;256;4;32;5078815
1;1;1;1;7201490963
4;256;4;4;8818963
4096;1024;16;16;1296297
4096;1;1;1;23560000
2048;2048;32;128;18446744073709551615
1024;1;32;1;12292296
64;1;4;1;180274963
1024;32;16;16;1596889
1;1;1;1;7205432000
1;1;1;1;7136450963
512;512;128;64;18446744073709551615
2048;512;8;1;2787852
2048;1024;4;1;5569778
256;2048;64;1;1382223
512;256;1;64;40127111
2048;2048;64;1;832296
128;128;2;64;10020444
2;1024;2;1;14468296
1024;2048;16;256;18446744073709551615
1;512;1;256;98081777
512;4096;1;256;39620741
2048;1;32;1;6564148
1;1024;1;1;26421037
256;4096;64;128;18446744073709551615
2048;256;128;128;18446744073709551615
256;4096;256;256;18446744073709551615
1024;64;128;4;18446744073709551615
128;16;16;2;5880148
1;2;1;2;3692170963
256;1;2;1;45422815
1;4096;1;1;24413630
16;4096;2;1;11166222
512;512;1;1;22239407
256;4096;64;256;18446744073709551615
2048;1024;1;128;38662518
1;1;1;1;7201108297
1;2;1;2;3696509926
512;1;32;1;24088297
256;32;16;2;1783852
2;512;2;4;9364445
1;4096;1;2;20412889
8;4096;8;32;7787408
1;256;1;256;163082371
1;2;1;1;3567353037
2048;1;128;1;6555111
64;16;2;2;11322815
32;1;32;1;364031555
2048;4096;64;16;18446744073709551615
2048;128;128;2;1346815
512;512;256;1;1417037
1024;4;32;2;3265333
1;1;1;1;7139594223
1;128;1;4;58214222
2048;1;1;1;25091852
128;4096;32;1;1339260
16;4096;4;64;8061037
512;512;128;256;18446744073709551615
64;2048;1;8;10598074
4096;2048;64;32;18446744073709551615
1;4;1;4;1852324444
4096;128;8;1;2806518
2048;64;32;4;1425037
4096;1;1;1;23984445
1024;512;64;1;1413482
128;1;128;1;95179703
32;1;2;1;354921333
512;16;4;2;5168741
1024;4;16;1;3214371
512;4096;1;2;13908296
1;8;1;1;900630666
2048;128;128;1;1456593
4096;256;1;4;7525185
2048;2048;64;32;18446744073709551615
128;2;2;1;45169185
2;4;2;2;965839408
128;4096;2;1;11123260
2048;2;128;1;3421333
2048;1;1;1;25302667
2048;256;128;256;18446744073709551615
1024;64;1;8;17197926
128;16;4;1;6588445
1;2;1;1;3598122815
256;64;2;16;9129037
128;4096;128;4;18446744073709551615
