GLOBAL_SIZE_0;GLOBAL_SIZE_1;LOCAL_SIZE_0;LOCAL_SIZE_1;TILE_0;TILE_1;cost
1;256;1;256;1024;128;435065056
2;128;1;16;32;128;208680832
1024;16;128;1;16;1024;951377600
2;4;1;4;512;2048;5044199264
2;256;1;64;32;128;109477888
4096;32;128;2;8;1;3157444512
512;4;1;1;8;4096;836949120
2048;512;128;1;2;2;18446744073709551615
4;64;1;64;32;32;428797184
2;2;1;1;1;128;11230927488
2;256;1;64;2;128;107552128
256;64;64;1;256;16;148158048
256;256;256;1;2;128;18446744073709551615
2048;256;1;64;2;128;7029952
2;256;1;64;128;128;110249632
2;256;1;128;2;128;105857472
64;256;4;8;512;256;24798208
2;1;1;1;128;128;22741645280
4096;128;32;1;4;64;781134112
1;2048;1;1;256;2;18446744073709551615
8;256;1;64;2;1024;29119712
2048;512;1;64;2;128;7006720
2048;256;1;64;1;1024;7402784
128;4096;1;64;2;128;7151808
2048;512;1;64;32;1;261663136
2048;512;1;256;1;128;13750560
2048;32;16;2;2;128;18446744073709551615
2048;4;1;1;2;128;202518400
1024;512;1;64;2;128;7023136
1024;1024;2;32;2;128;9308288
2048;512;1;32;2;64;8724800
2048;512;1;64;2048;128;56371360
2048;128;1;64;2;128;7149088
512;512;1;64;2;128;7113632
2048;512;4;2;2;128;105796672
2048;8;1;4;2;128;54379328
128;512;1;1;256;128;227837088
8;2048;1;8;1024;256;85156512
256;256;1;1;1;1;225148448
16;16;4;2;1024;512;218064512
512;8;2;1;2;1;130680032
512;512;64;1;2;128;18446744073709551615
64;512;1;2;2;128;109759488
2048;512;2;64;2;128;9178048
4096;512;1;64;2;2;18446744073709551615
2048;512;1;128;2;512;7002016
2048;512;1;128;2;128;6984736
1024;512;2;64;1;128;10339936
1;512;1;64;1;64;112175840
2048;512;1;256;2;128;13783104
2048;512;1;128;2;8;113300032
2048;1024;1;128;2;128;6963712
1024;1024;1;128;2;128;6960736
2048;1024;1;128;1;512;6986272
4096;2048;1;128;2;128;18446744073709551615
1024;1024;1;128;2;16;56301248
1024;1024;1;128;2;64;13841952
1024;1024;1;1;2;1024;219704864
2048;1024;2;128;1;128;10210208
512;1024;1;128;1;128;7014784
1024;1024;1;128;4;256;6975200
4096;1024;2;128;2;128;9003488
128;1024;1;256;2;256;7125760
1024;1;1;1;2;128;211251488
1024;1024;1;128;4;128;6955360
1024;256;1;128;2;128;7047936
4096;4096;1;128;2;64;18446744073709551615
1024;2048;1;128;2;128;6944992
512;2048;1;128;4;512;7056704
1024;2048;1;256;32;64;27678144
1024;2048;1;1;1;128;221265184
1024;2048;1;128;4;32;27452736
2048;2048;1;128;2;128;6945504
1024;512;1;128;8;128;7229952
1024;1;1;1;2;128;211253664
256;2048;1;256;2;128;13807264
1024;1024;1;128;2;256;6963872
1024;2048;1;1;2;256;218817376
4096;2048;1;128;4;128;6927936
1024;2048;1;128;4;128;6947104
1024;2048;4;32;2;128;30131520
1024;2048;2;128;2;128;9335776
4096;1024;1;64;4;128;7076192
2048;2048;1;128;4;256;6951776
4096;2048;1;256;4;32;54587840
2048;2048;1;128;8;256;6992704
4096;1024;2;128;4;128;9044576
4096;2048;1;128;16;64;13849312
2048;2048;1;128;4;64;13756992
1;4096;1;32;4;128;63464544
4096;2048;1;128;16;128;6993152
4096;2048;2;128;4;64;17917056
1;2048;1;128;4;128;26663840
1;2048;1;128;4;128;26745216
4096;2048;1;64;4;128;7068704
4096;256;1;128;4;128;7238400
4096;2048;1;128;1;128;6912832
4096;4096;2;128;1;512;10630368
2048;2048;1;64;1;256;7172480
1;2048;1;128;1;128;29281952
4096;2048;1;128;1;256;6940800
4096;2048;1;64;1;64;6944480
4096;2048;1;64;1;128;6990624
2048;4096;1;128;1;256;7101088
128;4;1;4;1024;4;3014134144
2;1;1;1;2048;1;21840081472
4;4096;4;4;128;2;18446744073709551615
32;64;4;4;512;4;41821248
4096;512;1;128;1;256;6976992
4096;512;1;128;1;64;13757568
4096;1;1;1;1;128;214445632
1024;2048;1;128;1;16;56890336
4096;1;2;1;2;128;133306400
1;2048;1;128;2;128;27453632
1;2048;1;128;1;256;38543360
4096;256;1;128;4;1024;7388800
2048;1024;1;128;1;128;6954624
4096;512;1;128;1;128;6949792
4096;2048;1;256;1;128;13672864
4096;2048;1;128;1;512;7043200
4096;1024;1;128;2;128;18446744073709551615
4096;1024;1;128;1;128;6940608
2048;2048;1;128;1;256;6951488
1;4096;1;128;1;32;58478112
4096;4;1;2;1;128;101196960
4096;2048;1;128;2048;128;17032704
1;2048;1;128;1;128;29166912
4096;2048;2;1;1;32;226852064
4096;2048;1;128;2;64;18446744073709551615
1;2048;1;256;4;128;53393568
4096;1024;1;256;1;128;13673824
1024;8;32;8;512;1;1314216864
4096;4096;16;16;16;4096;12929525024
16;4;2;2;512;512;752760768
1;32;1;4;32;512;1442008832
1024;2048;1;128;1;128;6956960
4096;2048;1;256;1;512;6966944
4096;1024;1;128;1;256;6964448
4096;2048;32;8;1;128;127187808
4096;2048;1;128;1;8;109771488
4096;2048;8;2;1;128;107435808
4096;2048;4;64;2;128;29823456
4096;2048;1;128;1;32;27364992
4096;1;4;1;1;128;223667520
4096;2048;2;128;1;128;10198912
1;1;1;1;16;1;43833960064
4096;2048;1;64;1;32;13839552
1;2048;1;128;1;128;29255040
4096;4096;1;128;1;128;6902592
4096;4096;1;128;8;128;6918432
1;4096;1;128;1;128;12875872
4096;4096;4;1;4;128;114069856
4096;4096;2;1;1;128;242848352
2048;4096;1;128;1;128;6922432
4096;4096;2;128;1;128;9872832
4096;4096;2;2;1;512;119324384
1024;4096;1;128;2;128;6925248
1024;4096;1;128;1;128;6936288
1;2048;1;256;1;64;114163040
4096;4096;1;128;2;128;18446744073709551615
2048;4096;1;64;1;64;6946720
4096;1;1;1;1;128;214352960
4096;512;1;64;1;128;7012288
4096;4096;1;128;4;128;6914848
4096;4096;1;256;1;128;13650304
1;4096;1;256;1;128;30647008
2048;1;1;1;1;64;223863104
4096;4096;2;16;1;128;17446016
1024;8;128;2;32;1024;476166080
4096;4096;2;32;1;128;11404960
4096;4096;1;32;1;128;9831744
4;1;2;1;1;1;22064365920
1;4096;1;128;2;64;28020320
4096;4096;1;4;32;128;63781152
16;4096;1;128;1;128;8291424
4096;4096;64;1;1;128;265548672
4;4096;1;128;1;128;7201888
4096;1;1;1;1;256;214496384
4096;4096;1;1;2;128;18446744073709551615
4096;4096;1;128;1;512;7229504
2048;4096;1;128;2;128;6914528
32;4;32;2;1024;2048;1596318880
4;512;1;1;2048;32;336305568
256;1024;128;1;128;2;98628192
1024;4096;1;256;1024;16;164308768
4096;4096;1;128;2;4;18446744073709551615
4096;4096;1;128;1;32;27339424
1;512;1;256;1;2;18446744073709551615
512;4096;1;128;4;512;7088928
16;4;4;1;512;2048;1697419040
4096;16;1;4;1;128;53002880
4096;128;32;8;2048;128;198866432
1024;1;1;1;1;128;223676096
4096;512;1;128;4;32;27762112
1;1;1;1;1;128;46986631776
4096;4096;1;128;1;256;7116224
1;1;1;1;1;2;44712918080
256;4;64;1;256;32;226055360
64;2048;32;1;4096;32;315504800
512;4;128;1;1;16;2922287392
1024;16;64;2;32;2048;239243808
4096;256;1;128;1;128;6961984
4096;8;1;8;1;128;27562240
1;1;1;1;256;128;44858782976
4096;4096;1;128;64;128;7049184
4096;4096;1;16;1;128;17571264
4096;4096;1;128;1;128;6910688
4096;4096;1;128;512;128;7864224
1;4096;1;128;1;2048;225172576
4096;4096;32;8;1;128;130950304
512;4096;8;2;1;128;109669280
2048;8;8;8;1;128;49761568
4096;64;1;1;1;128;207737952
4096;4096;64;2;1;1024;334785344
4096;4096;1;128;4096;128;28356352640
4096;4096;16;16;1;128;66647456
4096;4096;1;128;16;128;6958016
4096;4096;1;8;1;128;32350592
1;4096;1;128;1;128;12888832
8;4096;4;1;64;128;235296640
4096;128;1;32;1;128;8926368
4096;4096;1;1;1;128;254516896
2048;2048;1;128;1;128;6933888
128;32;1;8;2;1;253647136
4096;4096;1;128;1;64;13698912
4096;2048;1;1;2;128;18446744073709551615
128;16;8;8;16;2048;53312768
4096;4096;2;64;1;128;10411328
4096;2048;1;128;4;64;13764800
128;32;2;8;1;4;102889632
1;2048;1;8;1024;4;96852064
1;128;1;128;2048;64;811682528
128;4;2;4;16;4096;104832896
1;32;1;8;1;256;1448580608
4096;4096;1;256;1;512;7141728
512;4096;1;64;1;256;7269056
4096;4096;128;2;1;128;529330624
1024;16;4;8;8;512;18744128
4096;1;1;1;2;32;18446744073709551615
4096;2048;2;128;2;128;8979072
1;256;1;128;1;32;868095200
4096;4096;1;128;1;1;490835136
4096;4096;64;2;1;128;264898592
2048;64;8;2;8;128;51106240
1;4096;1;128;1;64;29737280
64;128;2;16;16;256;17551296
1;1;1;1;2048;32;44752900864
1;32;1;1;64;2048;20364128064
8;1;1;1;1024;2;10457419584
512;256;1;8;512;8;49068256
4096;512;4;64;1;256;17809344
16;8;4;8;1;1024;1457685696
8;4096;8;2;1;128;701676224
4096;4096;1;128;256;128;7207040
4096;4096;1;128;32;128;6988672
512;64;64;4;128;64;147576128
4096;4096;1;256;4;128;13856320
1024;4096;1;1;1;128;232908096
4096;4096;1;128;2;32;18446744073709551615
256;32;4;8;64;64;22324576
2048;32;8;4;8;256;27813120
512;16;8;8;16;1024;28655744
1024;16;16;2;16;1024;71556288
4096;4096;1;256;2;64;18446744073709551615
4096;4096;1;128;8;16;55505408
16;4096;4;1;1;128;351604320
4096;256;2;128;1;1;968400224
4;4096;1;256;2048;2;18446744073709551615
512;256;1;1;8;8;196613120
1;256;1;256;1024;4;13994321728
256;64;128;2;256;16;99502496
1;4096;1;128;1;128;12899456
1;4096;1;64;2;512;115504256
4096;4096;1;64;1;128;7357344
1024;16;32;1;16;1024;239512384
1024;8;2;2;8;2048;66085472
4096;4096;1;1;1;128;254251168
1;4096;1;128;2;128;14195136
512;4096;2;128;1;128;10089120
4096;4096;1;128;2048;128;12726496
4096;4096;1;16;2;128;18446744073709551615
4096;4096;1;128;1;16;54710496
32;256;8;8;512;256;35831616
4;1;2;1;128;128;13158446656
4096;128;32;1;4;1024;871439648
4096;2048;1;1;256;32;213278592
1024;16;1;8;16;128;32846240
1024;16;4;8;16;256;18546560
1;4096;1;128;1;1024;118584480
2048;4096;1;32;1;256;9667232
1024;16;1;16;16;128;23202912
256;4096;4;1;1;128;222795328
4096;4096;1;8;1;1;220100672
1024;16;2;16;16;256;16712832
4096;4096;4;1;1;128;232827104
4096;2048;1;64;8;32;14218240
1024;64;16;2;64;32;51063776
8;2048;1;8;2;256;47052416
256;128;1;1;1;1;228534432
1;16;1;2;8;512;2463604608
1024;32;8;2;32;128;51693152
4096;4096;1;64;2;128;18446744073709551615
2048;4096;8;2;1;128;110664800
4096;4096;1;128;1;4096;231540128
1024;16;4;16;16;256;17496000
1024;16;4;16;16;512;20615456
512;32;4;8;32;128;18529408
2048;32;4;8;16;256;16461792
4096;1024;2;1;1;256;218897024
512;1;2;1;128;1;717917440
4;2048;4;4;256;32;40082112
1;1024;1;2;16;4096;67394608448
1024;4;64;2;256;512;119604064
2;4096;1;128;1;128;7634752
4096;2048;16;4;1;1;266820032
1024;16;2;16;16;1024;17048352
2048;4096;1;128;1;1024;7260288
1024;16;4;16;16;64;19755648
1;2048;1;4;32;512;1441672928
4;512;1;1;2048;64;328366240
256;1024;64;4;128;2;18446744073709551615
4096;1024;2;64;2;32;18053856
4096;4096;1;64;2;32;18446744073709551615
1024;16;4;16;16;128;18396288
4096;4096;256;1;1;128;994929792
2048;4096;1;128;1;8;111601536
4096;4096;16;4;1;128;70836288
4096;4;4;1;4;1024;103978368
1;4096;1;128;1;256;38536832
4096;4096;4;1;2;16;224004672
1024;32;4;8;32;256;18863232
16;4096;16;8;1024;16;64971392
1;2048;1;128;16;32;104072928
64;256;32;1;4096;2;237499520
256;4096;1;128;1;128;6971520
64;4096;1;128;1;128;7088736
1024;4096;2;128;1;128;10040960
4096;4096;1;4;1;128;62127712
2048;32;4;8;16;512;16553120
4096;1024;1;128;16;512;7212960
1;32;1;8;4;256;1538465056
4096;4096;2;1;2;128;153392960
2048;32;4;8;32;256;18762880
1;4;1;1;1;16;11918441920
128;32;2;8;1;16;47640192
1;256;1;8;1024;4096;5159800064
2048;32;4;8;4;256;15482048
1;4096;1;256;1;128;30655904
4096;1;1;1;4;128;198414560
2048;32;4;8;1;256;28038368
1;128;1;32;64;64;439969664
128;4;16;4;16;1;926907104
64;128;2;16;16;8;31865344
2048;32;4;8;16;64;16390368
1024;1;1;1;4;128;198249344
4096;4096;1;128;128;128;7186624
4096;2;1;2;16;128;154354560
1;4096;1;128;1;1;1290128992
2048;4096;1;256;1;128;13676352
1;1;1;1;1;32;46813767488
1;32;1;1;64;2048;20412610528
8;1;1;1;1024;4;10424165568
4;4096;1;256;16;128;14279712
4096;4096;1;128;1024;128;8568128
4096;2048;1;128;1;1;489779808
1;512;1;128;64;128;104726016
4096;4096;2;128;1;1024;10818944
4096;512;8;2;1;128;104127040
32;4096;1;128;1;128;7151872
512;512;256;1;8;8;3069481376
1;256;1;256;1024;128;434899232
1024;64;128;1;256;16;113867680
128;256;2;8;512;64;31726720
4;1;2;1;2;1;12207962976
4096;128;1;1;4;64;189358784
4096;1;1;1;256;32;2541500896
4096;2048;256;1;1;256;1184372288
256;256;1;1;1;1;224915680
256;2048;1;64;1024;512;27632512
512;8;2;1;32;1;143200416
64;2048;32;4;256;2;18446744073709551615
4096;2048;2;128;1;64;20213408
1;4096;1;32;1;16;30079776
4096;4096;2;1;1;16;244628928
4096;4096;2;128;2;512;9362400
4096;128;1;128;1;128;6999968
4096;1;2;1;1;64;223391904
1024;4096;1;1;1;64;232905120
4096;4096;1;256;2;256;18446744073709551615
1024;4096;1;128;8;128;6934528
1;1;1;1;2;128;44008722592
1;4096;1;128;1;64;29791296
2048;4096;4;1;2;128;219250176
2048;512;2;1;1;32;213992960
4096;4096;1;128;1;2048;7400096
4096;1024;1;32;1;128;8714784
4096;2048;2;128;4;128;9017184
4096;4096;1;32;2;512;18446744073709551615
4096;4096;2;128;16;128;8961536
4096;2048;1;128;1;64;13737376
4096;1;2;1;1;32;223656992
4096;1;1;1;8;128;233610304
4096;1024;2;128;1;128;10202112
4096;4096;2;1;1;64;242789056
2048;4096;1;64;2;128;7189504
4096;4096;1;64;8;128;7479712
2048;1;1;1;1;128;223450048
4096;4096;1;256;2;128;18446744073709551615
1024;1;2;1;1;512;264311328
2048;4096;1;64;1;128;7283424
4096;4096;2;128;1;4;336797216
1;4096;1;256;1;256;13658528
4096;4096;2;128;4;128;8911488
4096;4096;2;128;1;32;40229248
2048;4096;1;128;1;64;13738528
4096;4096;1;64;1;512;7760096
1;4096;1;128;1;512;65055232
512;2048;1;128;1;128;6965120
2048;1024;1;128;1;32;27491744
4096;1;1;1;1;128;214531488
1024;4096;1;128;4;128;6917408
2048;4096;2;128;1;256;10355872
4096;4096;2;2;1;128;119747104
4096;1;1;1;1;64;214598688
1;2048;1;1;1;256;2871347264
1024;1024;1;128;1;128;6974400
4096;4096;1;128;1;1024;7313600
2048;2048;1;128;1;64;13774112
1;2048;1;128;4;64;53051616
1;512;1;128;1;128;111589120
1024;4096;1;128;1;32;27444064
1;2048;1;256;1;128;57682144
4096;2048;4;1;4;128;108138784
1024;4096;1;64;1;128;7202880
4096;1;1;1;4;128;199045312
4096;512;2;128;1;128;10229568
1024;1;1;1;1;128;223737344
1024;4096;1;128;1;1024;7190112
512;4096;1;128;1;128;6946272
4096;4096;4;32;1;128;18917856
1;4096;1;256;1;32;121336288
1;4096;1;32;1;128;63685888
1024;1024;4;1;4;128;104353824
4096;512;1;32;1;256;8568032
1;4096;1;32;1;64;37963488
4096;1;1;1;2;128;18446744073709551615
1;512;1;128;4;128;106332128
4096;4096;4;64;1;128;18357280
1;1024;1;128;1;128;56362848
4096;1;1;1;4;64;198651968
4096;1;1;1;1;32;214649472
1;1;1;1;2;32;44094080352
1;4096;1;128;1;128;12919008
4096;1;1;1;2;64;18446744073709551615
2048;4096;1;128;1;32;27395680
1;4096;1;128;8;16;107619360
1;4096;1;128;4;128;13289664
1024;512;1;128;1;256;7049792
4096;4096;2;128;2;128;8934624
1;256;1;64;1;128;219207520
1024;1;2;1;1;512;264532576
128;4096;1;128;1;128;7022944
4096;4096;1;64;4;32;14457984
4096;1024;1;32;1;256;8733920
1;512;1;64;2;256;117048672
2048;4096;4;1;4;128;111674336
4096;1;2;1;1;128;223810912
4096;1;1;1;1;64;214472672
1;4096;1;64;1;128;38439648
1024;4096;1;256;4;256;6944352
4096;4096;2;64;4;64;8922624
4096;4096;1;64;1;256;7578720
4096;1;1;1;1;64;214474048
2048;4096;1;128;4;128;6918368
4096;4096;1;1;2;64;18446744073709551615
1;4096;1;64;1;32;29413504
1024;4096;1;128;1;256;7072416
2048;1;1;1;1;128;223414112
4096;1024;2;128;2;256;9210208
4096;4096;4;2;1;128;114601568
4096;4096;1;128;2;512;18446744073709551615
4096;4096;1;128;8;256;7202784
1;4096;1;128;4;32;53895168
4096;4096;2;128;1;2048;11005984
1;1;1;1;2;128;43800146752
4096;512;1;32;1;128;9058240
4096;4096;2;128;1;256;10357888
1;1024;1;256;1;128;114343104
2048;4096;1;1;1;256;242404480
512;4096;1;256;1;128;13696576
1;1024;1;128;2;256;56977472
1;2048;1;256;1;64;114183104
2048;4096;4;64;1;128;18315520
4096;1;1;1;4;8;200734656
2048;1;4;1;1;64;264625664
4096;2048;1;32;1;128;9078016
1024;4096;1;256;1;128;13683904
4096;4096;1;128;2;256;18446744073709551615
4096;4096;1;2;16;128;127071008
2048;4096;1;128;2048;128;9950496
4096;1;4;1;1;128;224914464
4096;4096;8;2;1;128;112084512
4096;4096;1;32;1;8;38129056
4096;4096;2;128;1;64;20180384
4096;4096;16;16;1;16;63224448
1024;4;16;1;256;1;170461728
4096;256;1;128;64;128;7155072
4096;4096;128;1;4;128;3119553024
128;4096;1;128;256;128;7997120
1;2048;1;1;1;1024;11473157440
4;512;1;64;2048;64;53769024
256;1;128;1;128;64;808016512
16;4096;2;1;1;16;222551872
4096;1;1;1;1;128;214328672
256;4096;1;128;1;1;507382912
4096;4096;1;32;256;128;10789088
1;32;1;2;16;32;1449130752
64;1;32;1;1;2;21895497792
512;4;128;1;1;4;2906541984
16;32;16;16;1;16;1638185600
1;2048;1;4;1;32;100526976
4096;4096;1;64;1;32;13828832
1024;4096;1;128;1;64;13758112
4096;1024;4;1;1;32;216272672
4096;4096;1;128;4;256;7200992
4096;4096;2;64;2;256;9386272
1024;4096;4;1;1;128;225034400
1;4096;1;128;1;128;12881504
1;4096;1;128;4096;128;12898560
1;1024;1;32;64;1;1283220832
128;1;2;1;8;4096;401808640
64;128;2;16;1;256;23535456
1;2;1;1;32;1;19478144608
4096;4096;16;4;128;128;53426944
4096;4096;1;128;1;2;18446744073709551615
1;32;1;1;8;2048;20347381568
8;32;1;1;1024;4;323699616
4;4096;1;256;16;8;224599040
512;256;8;8;32;8;28864512
1;256;1;1;1024;128;1274698400
1;64;1;8;256;16;781768256
64;256;4;1;2048;256;467598912
1;1;1;1;2;1;44833721216
512;128;8;1;4;64;200407008
4;1;1;1;256;32;11434465632
8;2;1;2;2;2048;2618019264
256;256;1;8;1;1;232159552
4096;1;1;1;2;512;18446744073709551615
2048;4096;1;256;4;128;13662272
4096;1;2;1;1;256;223373376
1;1;1;1;2;1024;44117786816
4096;4096;2;64;1;512;10918784
1024;4096;2;1;1;128;228211392
256;2048;1;64;1024;1;450901728
512;8;8;1;1;4096;1965407680
4;2048;1;4;256;32;64624480
4096;4096;16;16;64;16;50461536
4096;4096;1;256;1;32;53958016
2048;4096;4;1;1;128;227667904
4096;4096;1;256;1;64;27100352
4096;1;1;1;1;64;214466752
1;4096;1;128;4;64;27455936
4096;2048;4;1;1;128;221244608
4096;1;1;1;1;512;214259296
4096;4096;2;64;4;128;9289472
4096;2048;1;128;1;16;54741984
2048;4096;1;128;1;512;7195392
1;512;1;64;1;16;436172736
1;4096;1;32;1;128;63656832
1024;4096;1;32;1;32;9122208
4096;4096;1;256;1;16;107764160
1;4096;1;256;2;128;29068384
4096;2048;1;32;1;512;9178176
512;4096;1;128;2;128;6943424
4096;1;1;1;1;256;214295520
256;4096;1;64;4;128;7142464
4096;4096;2;128;32;128;8978624
4096;4096;2;128;1;16;80322144
4096;2048;1;256;1;256;6954592
1;2048;1;128;1;512;65044128
4096;4096;1;64;1;64;6949856
1;1;1;1;1;128;46759860800
1024;4096;1;128;2;64;13761216
4096;1024;1;1;1;128;218894400
1024;2048;1;64;1;128;7027968
1024;4096;1;256;4;128;13680448
4096;4096;2;128;2;64;17807616
4096;4096;1;64;1;8;55874016
4096;1024;1;128;1;64;13745216
1024;1024;1;64;1;128;7041632
2048;4096;1;1;1;128;242903296
4096;4096;1;1;1;64;254915968
4096;4096;4;1;2;64;224406560
4096;1;4;1;1;256;224662944
1;2048;1;64;1;128;38510048
1;1024;1;64;1;128;64262176
1;4096;1;256;1;64;60761664
4096;512;2;32;1;128;10456256
4096;2048;4;1;1;512;221315904
4096;4096;1;128;8;32;27408864
1024;4096;2;64;2;128;9248128
4096;1024;2;1;1;64;218692736
512;4096;2;1;1;128;225360960
4096;1;4;1;1;128;224637280
1;4096;1;128;2;512;63114336
512;1;1;1;1;256;264269632
1;4096;1;128;1;32;58330112
2048;2048;1;128;4;128;6931776
1;1;1;1;1;128;47092367776
4096;1;2;1;2;128;133500384
4096;4096;4;1;8;128;117365984
1;2048;1;128;1;64;57595008
4096;1;1;1;2;128;18446744073709551615
4096;512;1;128;2;128;18446744073709551615
1;1;1;1;1;32;46814001216
256;4096;1;128;1;64;13847968
2048;4096;2;64;1;128;10421600
4096;1;2;1;1;128;223486400
4096;512;1;128;4;256;7030528
1;1;1;1;1;32;46813380768
4096;1;1;1;8;32;234527712
2048;1;4;1;8;256;123418048
4096;1;1;1;1;512;214246240
4096;4096;4;1;1;64;232805280
4096;1024;4;1;1;256;215728864
1024;4096;1;64;1;64;6948608
4096;4096;1;64;2;512;18446744073709551615
4096;4096;2;1;2;64;153287328
1;4096;1;128;1;256;38603264
4096;1;1;1;1;512;214595136
2048;4096;1;128;16;128;6968928
4096;2048;1;128;2;32;18446744073709551615
512;4096;1;256;2;512;7023680
4096;4096;1;256;1;256;6934848
1024;4096;1;256;2;256;6952960
4096;1;1;1;2;16;18446744073709551615
1;2048;1;128;2;2048;220701824
2048;4096;2;1;2;128;147591136
4096;1;1;1;2;64;18446744073709551615
2048;4096;1;64;4;128;7270880
1;4096;1;128;8;64;27268672
4096;4096;1;128;32;1;455364992
4096;4096;4;32;1;256;19163104
4096;1;1;1;1;256;214377440
32;4096;1;128;8;128;7103648
1024;4096;1;128;2048;128;9908064
4;4096;1;128;1;64;14452768
1024;4;64;1;256;4;119831840
