GLOBAL_SIZE_0;GLOBAL_SIZE_1;LOCAL_SIZE_0;LOCAL_SIZE_1;v_TP_52;v_TP_53;cost
128;32;128;8;4092;33;500288672
8;256;1;256;33;4;65755456
1;8;1;2;132;4;5159639040
32;64;32;16;124;2;46490176
32;64;32;8;124;4;42037600
32;1;32;1;124;2;1306867488
32;64;32;16;124;22;59150848
32;1024;4;16;124;2;47109024
4096;1024;128;32;31;4;18446744073709551615
64;8;1;2;33;11;170619840
256;128;256;64;31;33;18446744073709551615
4;512;4;128;33;62;172738784
16;64;1;8;124;3;90530080
32;64;32;8;62;4;40251232
256;1024;32;32;4092;2;173093344
32;128;32;8;93;1023;286523904
32;64;1;8;6;4;56903264
32;64;32;4;62;6;46804960
32;64;32;16;62;4;44178144
16;64;1;4;62;4;86196192
32;32;32;16;62;4;67203008
32;64;32;8;66;4;21856896
16;64;1;8;62;4;86895872
32;16;32;1;66;2;79778592
32;64;32;8;341;4;112822176
32;128;32;4;66;12;27131168
8;64;2;8;66;4;93997344
32;32;1;16;132;4;54933888
128;2048;2;512;1;6;19616224
16;8;4;2;1364;33;1099589120
256;1;16;1;2046;3;200777568
128;2048;2;1024;1;6;18446744073709551615
2;128;1;16;186;44;1207868928
128;2048;2;512;132;6;70690848
2;128;1;2;132;186;726140480
1;8;1;8;44;31;6596061184
2;2048;2;512;1;6;42598176
64;512;1;2;6;2;102757056
128;2048;32;2;1;33;47472768
128;64;2;64;2046;4092;25019021440
128;16;4;16;2046;1;161606912
2;4096;1;2;341;93;1863752640
4;512;1;2;66;2;176385632
2048;2048;2;512;1;6;17988320
128;2048;2;2;1;6;54071232
128;2048;4;512;1;6;18446744073709551615
128;2048;2;512;62;6;33748448
2048;2048;2;512;66;6;35408448
2048;2048;2;64;1;6;11852320
256;2048;2;512;1;6;18259040
2048;2048;2;512;1;62;100341280
2048;2048;1;8;1;6;29828928
2048;2048;2;8;186;6;19385248
2048;256;2;1;1;6;111871392
2048;2048;2;64;1;3;8619264
2048;2048;512;64;1;3;18446744073709551615
2048;32;2;1;1;31;124684768
2048;2048;256;64;1;3;18446744073709551615
2048;256;2;64;1;3;15162240
2048;2048;128;64;31;3;18446744073709551615
16;2048;2;64;1;3;29971808
2048;2048;2;64;22;3;40580448
512;2048;2;64;1;3;9929504
512;2048;4;64;1;3;5528512
1;512;1;64;1;3;110501056
2048;256;2;64;1023;3;34967424
2048;512;2;64;1;3;12324896
512;2048;4;64;1364;3;64416672
512;4096;8;64;1;3;4245664
512;2048;4;64;2046;3;97895968
512;2048;4;64;1364;11;83925408
128;4096;8;64;1;1;3948192
512;4096;4;64;1;6;9329728
2048;1;8;1;4092;3;33352288
512;4096;8;64;1;2;2167456
512;4096;8;256;1;2;18446744073709551615
512;4096;4;64;1;2;2203552
256;4096;2;128;1;1;12763296
512;2048;8;64;1;2;2206336
512;1;4;1;1364;4;79432576
1024;4096;8;16;1;2;1841152
512;4096;8;64;1;4;4204864
64;4096;2;64;1;3;14691392
512;1024;2;8;1;2;7635872
1024;4096;8;16;1023;2;11610368
1024;4096;16;16;1;3;4050240
1;4096;1;64;1;2;10616736
1024;1;16;1;1;2;23246208
1024;1;4;1;1;3;63821568
1024;4096;2;16;1;2;4653216
1024;1024;8;32;4092;2;83803424
1024;4096;8;8;1;2;2195648
1;4096;1;16;1;1;24031584
4096;4096;8;16;1;2;2267360
4096;4096;8;16;1;4;4336192
32;4096;8;16;1;2;3027584
1024;4096;256;16;2;2;18446744073709551615
2048;4096;2;16;1;2;4958592
1024;4096;1;16;1;2;9050784
1024;1;8;1;1;2;21846048
4096;4096;8;8;4092;2;46218080
512;4096;8;16;1;2;1862848
512;4096;8;16;2046;2;41002848
1024;1024;8;16;1;4;3967872
1024;4096;4;16;1;1;5097792
1024;256;8;16;1;2;2277408
1024;4096;8;2;1;2;7384160
1024;4096;8;16;4092;2;43422208
1024;4096;8;512;2;2;18446744073709551615
16;16;1;8;341;186;363729344
32;128;32;2;1;62;49549472
4096;2;32;2;186;44;325747936
512;4;16;2;2046;1023;6136266336
1024;4096;8;4;682;2;14520608
256;4096;8;16;1;2;1878784
2048;4096;8;256;4092;2;18446744073709551615
128;1;16;1;33;33;441786528
1024;4096;8;16;22;2;4243712
1024;4096;8;128;1;4092;33669248
1024;4096;8;16;6;2;3871424
1024;4096;8;8;4092;2;44977536
1024;4096;8;16;341;2;6812768
1024;4096;4;64;2046;2;41847488
2048;4096;8;16;1364;2;14447744
64;1024;32;512;93;33;18446744073709551615
1;4096;1;16;1;93;25044000
1024;4096;8;4;1;2;3957920
1024;4096;8;32;1;2;1935360
1024;1;8;1;1;2;21857760
1024;4096;8;16;1;3;3975552
1024;1;8;1;4092;1;39963264
1024;4096;8;16;1364;2;14690560
2048;1024;256;16;12;186;18446744073709551615
16;1;2;1;4092;31;3043651584
512;1024;64;16;1;124;44688096
8;64;2;64;682;1;862870272
16;256;4;64;66;12;57608256
128;256;32;32;682;2;54259520
128;1024;32;64;372;3;18446744073709551615
32;128;32;1;124;62;83716736
1024;256;8;16;2;2;3237280
1024;4096;4;16;1;2;2334048
256;4096;8;16;1364;2;53481024
1024;2048;8;16;1;2;1857760
1;4096;1;32;1023;2;9820988448
4096;1;2;1;1;2;56245024
1024;2048;4;16;1;1;5067904
1024;1;4;1;1;2;44024000
8;4096;8;16;1;2;3233728
128;4096;8;128;1;2;3223232
1024;4096;1;256;1;2;18694080
1024;4096;1024;16;1;2;18446744073709551615
1;1;1;1;1;11;39202150464
8;8;8;1;93;124;1001924000
1024;8;64;4;11;682;965832960
64;1;64;1;66;682;7797569120
256;4096;8;16;1;1;3699520
1024;1;8;1;1;2;21848864
1024;4096;512;1;1;2;2156320
1024;2;8;1;1;2;21957568
1024;2048;1024;16;1;2;18446744073709551615
1024;1;4;1;1;2;44032672
2048;4096;8;16;4092;2;42283520
32;32;4;1;186;33;70913600
32;32;1;8;372;11;144887168
1024;1024;8;4;1364;3;23408128
2048;1;8;1;1;2;22235264
1024;4096;8;512;1;2;18446744073709551615
1;4096;1;16;1;2;14239776
4;4096;1;16;33;2046;219199968
64;4096;8;16;1;2;2133984
1;1024;1;32;11;1364;165247360
16;8;8;1;341;132;538589312
2;4;1;2;4092;1364;32606698496
1;64;1;2;22;11;745452544
512;4096;8;16;1;3;3953792
512;2048;8;8;1;2;2265088
2048;2048;8;4;2046;2;21111712
2;2;1;2;66;62;11180607296
1024;4096;8;16;4092;3;65496832
1024;4096;16;16;2046;2;20692704
8;16;8;16;124;31;700767584
1024;4096;512;16;1;66;18446744073709551615
1024;4096;256;1;1;2;1860928
512;1024;16;128;341;3;18446744073709551615
1024;4096;2;16;4092;2;127089792
1024;1024;8;16;1023;6;18874240
1024;4096;8;128;4092;2;415089888
16;32;4;32;132;22;122392832
1024;16;64;2;1;62;68621216
256;2048;32;128;2;4092;18446744073709551615
8;1;1;1;33;1;4932842720
1;2;1;1;11;2;19338539648
1024;4096;256;1024;1;12;18446744073709551615
256;4096;1;16;1;2;8461440
1024;4096;8;1024;1;2;18446744073709551615
32;256;1;1;33;31;220875648
1024;1;8;1;1;2;21836864
1024;4096;2;4;1;2;15150880
1024;1;8;1;1;3;62789824
32;64;1;16;341;11;141233312
1024;4096;4;4;4092;2;87517504
1024;4096;32;16;4092;11;140111712
512;1024;8;16;1;2;2030240
1024;4096;8;16;1;2046;26572448
2;4096;2;16;1;2;9339264
1024;4096;4;16;1;2046;33793664
1024;4096;8;16;124;2;6464928
4096;1024;128;32;132;4;18446744073709551615
64;512;1;2;33;11;114616512
256;4;64;1;31;33;125238464
128;2048;1;512;1;6;47399808
32;64;1;1;62;31;229979872
1024;4096;8;8;1;1;5110144
1024;1;8;1;4092;4;40972032
1024;4096;32;16;1;2;2162848
32;64;1;32;186;11;85859680
2048;4096;8;16;1;2;1892224
128;256;16;256;132;6;18446744073709551615
1024;128;8;16;33;12;61550112
1024;4096;8;16;1;22;22347008
1;4096;1;16;12;2;146759328
32;64;2;64;132;22;63578048
2;128;1;16;186;62;1196847360
2;1;1;1;132;186;20960792800
1;8;1;8;4;31;6283057600
1024;4096;8;16;1;4;4094144
1024;1;8;1;1364;2;41614080
1024;4096;2;32;1;2;3503616
32;512;1;256;93;31;64027840
1024;4096;64;16;1;2;2962112
1024;4;8;2;1;2;11363872
32;256;1;128;124;22;67009600
1024;4096;32;16;1;6;7046816
1024;1024;8;16;1;2;1905792
1024;4096;8;32;1;1;3803680
64;128;32;32;341;2;56679872
32;128;1;32;93;6;50501248
32;64;1;32;132;6;66575712
32;64;2;32;132;11;62887008
1024;8;8;1;1;2;13957120
1024;4096;8;16;1;1;3786592
1024;4096;256;16;372;372;18446744073709551615
1024;4096;8;16;66;2;5267904
64;1024;1;8;6;1;28907264
128;64;2;64;341;33;49035168
128;1;4;1;2046;1;312521120
2;4096;1;2;341;33;1865610080
1024;4096;8;32;1;3;4079392
1024;4096;8;16;1;1;3791808
1024;4096;8;16;1;11;8809056
1024;4096;8;16;124;3;9310944
512;4096;4;16;1;2;2365568
1024;4096;8;16;1;12;8497024
32;128;32;64;124;12;18446744073709551615
32;64;1;32;132;4;65366304
4;64;1;2;1;1;187662752
1;128;1;64;1;62;460005760
32;16;4;8;341;1;124578912
256;2048;4;16;4092;2;170591520
1024;4096;8;16;1;341;116236896
1024;512;8;64;1;2;2586560
2;4096;2;16;1;11;15014208
4096;4;32;4;186;44;177886144
512;4;16;2;2046;62;455473536
256;1024;256;128;12;186;18446744073709551615
16;1;2;1;372;31;3172632576
32;32;2;16;186;3;79422944
1024;4096;8;8;1023;2;13058048
1024;1;8;1;1023;2;41598752
32;256;16;128;93;11;18446744073709551615
1024;4096;256;512;1;2;18446744073709551615
1024;1024;1024;16;1;2;18446744073709551615
32;64;2;32;186;4;80201216
1024;1;8;1;4092;2;40965184
32;128;1;32;124;4;65637504
64;128;32;32;186;2;37412288
32;64;1;32;132;3;67657472
32;64;1;16;132;3;54250976
512;1024;64;16;1;11;11123232
1024;1;32;1;682;1;38844032
1;1;1;1;1;11;38290909536
1;4096;1;16;93;124;1193782048
2048;4096;8;16;4092;1;40283616
512;4096;16;16;1;3;3982560
1024;4096;8;16;44;4;8934144
1024;8;512;8;341;682;18446744073709551615
64;1;64;1;44;1;614016064
1024;256;256;32;1;132;18446744073709551615
16;1;1;1;341;132;2853339200
256;1;8;1;1;2;87377920
1024;1;4;1;1;2;42653760
128;4096;128;16;1;2;18446744073709551615
1024;4096;8;16;2046;2;21114368
1024;4096;4;8;4092;2;86525824
16;4;16;2;1;1364;4469919360
1;64;1;2;22;11;745524000
1024;1;64;1;22;62;925498240
4;1;4;1;2;1;9320416256
32;4096;8;16;1;3;4201280
4096;4096;8;16;1;1;3096288
1024;4096;4;64;1364;2;28459392
1024;1024;8;32;1;2;2011296
1024;4096;16;16;4092;2;42528672
1024;4096;8;16;4;2;2761440
1024;4096;1;16;1;2;9029856
1024;16;8;4;1;2;5171008
128;1;1;1;1023;1;328757504
4;32;2;32;1;4;368988608
64;512;1;2;33;93;115656032
1;1;1;1;31;12;42720616992
2048;2048;8;16;4092;2;42894240
1024;4096;16;8;1;2;1810592
1024;4096;32;32;1;1;5284832
128;4096;16;8;1;2;1852544
1024;4096;16;8;2046;2;20703712
1024;4096;16;8;1364;2;14129888
1024;1;64;1;1;2;21894656
1024;4096;8;8;1;6;5420320
512;4096;16;8;1;2;1801824
512;1;2;1;1;2;83736096
1024;4096;32;8;1;2;1874208
512;4096;32;8;1;2;1911648
512;4096;8;8;1;2;2179712
512;4096;16;8;4092;2;85483200
1024;1;16;1;1;6;64928672
512;4096;16;16;1;11;10573344
256;1;16;1;1;2;87497632
512;1;16;1;1;1;88752416
512;4096;4;16;4092;2;87982656
512;4096;32;8;4092;2;88504768
512;2048;16;8;1;11;12369280
512;2048;16;8;1;2;1841216
256;4096;16;8;1;2;1841568
2048;4096;16;8;1;2;1847008
512;2048;4;8;1364;2;28547296
512;4096;16;8;1023;2;20705664
256;1;16;1;1;2;87561248
512;4096;32;4;1;2;1790752
512;4096;8;8;1;4;4779424
512;4096;32;2;372;6;13565344
512;2048;32;4;4092;2;87519040
256;1;32;1;1;2;88292064
512;4096;32;4;2046;1;41205056
1024;4096;32;16;1;1;3847968
512;4096;32;4;4092;2;87202624
512;2048;32;8;1364;2;27150496
512;4096;32;1;1;3;7396864
512;4096;32;16;1;2;2051296
128;4096;32;4;682;2;52074240
512;2048;4;4;1;2;7188928
512;4096;16;4;1;2;2126624
512;4096;32;1;1;2;3548608
2048;4096;32;4;1;2;1826368
256;4096;32;4;1;2;1826336
512;1;32;1;1;1;89940096
512;4096;64;1;1;2;2123232
512;4096;32;4;1364;2;27012256
512;2048;32;4;1;2;1827616
512;2048;32;2;1;2;2106208
512;4096;32;4;1;3;3849760
512;1;64;1;1364;2;78286784
512;4096;64;4;1364;2;27115584
256;4096;32;4;4092;2;174916800
512;2048;32;4;1;3;3840320
512;4096;16;2;1;3;7101472
256;4096;32;1;2046;2;75826720
512;4096;32;2;1;4;4919328
256;4096;32;1;1;2;3460000
2048;2048;32;8;1;2;1888864
512;4096;16;4;1023;2;20743648
64;512;32;4;1;3;4789408
512;2048;64;16;1;2;2644416
512;1024;32;4;1;3;3861312
512;4096;32;4;1;4;4405216
512;2048;32;1;4092;2;86672992
512;1;32;1;4092;2;77659936
512;4096;32;4;1;11;12876448
256;4096;32;32;1;2;2617856
512;4096;16;2;1364;1;27544096
1024;4096;32;4;1;1;3663552
2048;4096;32;4;1;12;14074880
512;4096;32;4;1;1;3601152
512;1;32;1;1;2;43194496
1024;4096;32;4;1;2;1788160
1024;4096;64;4;1;2;1863552
1024;1;32;1;372;2;39177408
1024;4096;128;4;682;2;8464000
1024;4096;64;4;2046;2;20319520
1024;1;16;1;1;1;49887200
1;4096;1;4;4092;2;42261706816
1024;4096;32;4;1364;2;13957664
1024;4096;32;1;1;2;3710528
1024;4096;128;4;1;2;2154592
1024;1;32;1;1;2;22505760
1024;1;32;1;1;2;21912704
512;1024;32;4;1;2;1838464
1024;1;32;1;1;6;67119072
1024;4096;32;4;2046;6;37356736
1024;4096;16;4;1;2;2103584
512;1;64;1;1;2;44311104
1024;4096;32;4;2046;1;20593696
1024;4096;32;16;2046;3;33920704
1024;4096;64;2;1;2;1794752
1024;2048;32;4;1;2;1791968
1024;1;32;1;1;1;49166816
1024;4096;32;4;1;11;12936480
2048;4096;32;4;1;4;4457312
1024;4096;32;4;2046;3;33837472
2048;1024;32;4;1;2;1805024
1024;4096;32;4;4092;1;40413440
4096;4096;32;4;1;2;2023552
2048;4096;32;8;1364;2;7330400
1024;4096;16;1;1;2;7255104
4096;4096;32;1;1;2;4736320
4096;1;32;1;1;2;11389760
1024;2048;32;4;372;2;5019424
2048;4096;8;4;372;6;16309408
4096;4096;32;4;2046;1;6224896
2048;4096;32;2;2046;2;10474720
1024;4096;32;4;2046;2;20400064
1024;4096;32;4;4092;2;43984544
1024;4096;16;2;1;2;3806528
1024;256;64;4;1;2;2078400
1024;4096;32;4;4092;4;45955328
512;2048;64;2;4092;1;80383552
1024;4096;64;8;1;2;2156960
1024;4096;32;4;1;3;3929984
2048;1;32;1;1;3;32813920
1024;4096;32;4;1;4;4368672
1024;2048;16;4;1;2;2143136
1024;4096;256;2;1;4;4020608
1024;4096;32;2;1;4;4886912
4096;2048;32;4;4092;2;21949760
1024;1;32;1;4092;6;71474304
1024;4096;64;4;1;1;3718592
1024;4096;16;4;4092;2;43237440
2048;4096;16;4;4092;1;21570144
1024;4096;32;4;1023;2;10560032
1024;4096;32;2;1;3;5110592
2048;2048;32;2;1;2;2099968
2048;4096;16;4;1364;3;12512672
1024;1;32;1;1364;2;39185728
512;4096;128;4;1;1;3787520
1024;4096;16;2;4092;2;42675840
1;4096;1;4;4092;2;42248961248
1024;1;32;1;1;2;21888864
1024;4096;32;8;4092;3;72944704
1024;2048;8;4;4092;2;43287328
4096;4096;32;8;2046;2;10430240
1;4096;1;4;1364;2;12708632288
4096;4096;4;4;2046;3;33623360
1024;1;128;1;1;1;50507872
1024;4096;32;1;682;2;7389280
128;4096;128;4;1;2;1966240
512;4096;4;8;1;4;6824064
1024;4096;32;4;372;2;5019296
128;4096;16;4;4092;2;335668032
1024;2048;32;4;1;6;7974464
256;4096;32;4;1;4;4329696
2048;4096;16;4;4092;2;22592064
2048;4096;8;4;1;2;4299360
2048;4096;64;4;1;2;1921984
256;4096;64;4;1364;2;54084256
1024;4096;32;4;4092;3;72942016
1024;1;4;1;4092;2;84551136
1024;1;16;1;1;2;23225728
1024;1024;32;4;1;2;1828288
1024;4096;32;8;1;4;4339552
1024;512;32;4;1;2;1863712
1024;2048;32;2;1;1;4552000
512;4096;32;1;1;22;14787520
1024;4096;64;4;372;2;5109216
1024;4096;32;2;1;2;2071136
1024;1024;16;4;4092;2;43144864
1024;4096;32;2;1023;2;10504192
256;4096;256;1;1;4;4370816
2048;2048;32;4;1;2;1807296
2048;4096;32;4;1;3;4054976
256;1024;32;4;1;2;1863488
1024;1024;32;4;2046;3;32591520
1024;4096;128;8;1;2;2935872
1024;4096;4;8;1023;2;21633696
512;4096;32;1;2046;2;39343616
512;1024;32;8;1;2;1897536
1024;4096;32;8;1364;6;24962688
256;4096;32;4;2046;2;76375168
1024;2048;64;4;2046;2;20351136
1024;4096;32;8;1023;3;16658016
4096;2048;32;4;1;1;2953600
1024;4096;32;8;2046;2;20363808
1024;1024;32;4;4092;2;44171168
512;4096;32;4;1023;2;20392672
1024;1024;32;4;1364;2;14014080
1024;2048;64;8;1;4;4039648
512;1;32;1;1;11;119409888
512;1;32;1;1;22;365601088
1024;4096;128;8;1364;2;13930176
1024;4096;16;4;1;1;4961728
1024;4096;8;4;1364;1;15169888
1024;2048;32;4;1;11;14196608
2048;4096;32;8;1;1;3795648
1024;4096;32;4;2046;12;75699584
1024;4096;32;4;682;2;8141888
2048;4096;32;4;1364;1;7509760
1024;4096;32;8;1;1;3715904
1024;4096;32;4;1;6;7926432
1024;4096;128;2;1;2;1869408
1024;512;32;4;682;12;25631808
1024;1024;32;1;1;1;7972480
2048;4096;32;4;372;2;4986272
1024;4096;32;4;1;33;52788608
1024;4096;32;64;1;2;18446744073709551615
4096;4096;8;4;1;12;8704032
1024;4096;64;8;2046;2;20344096
512;4096;32;4;2046;2;40628640
2048;2048;32;16;1;2;2183264
1024;4096;32;1;1;6;9077376
2048;1;64;1;1;2;11345536
1024;4096;16;4;1;12;10451168
1024;4096;8;4;1023;2;11656544
2048;4096;64;1;1;2;2216128
512;1;64;1;1;2;44272992
1024;1024;32;4;1;6;8023552
1024;2048;32;4;1;1;3649312
64;4096;32;2;4092;1;630450400
128;4096;64;4;4092;3;367591008
1024;1024;64;16;1;2;2734144
1024;2048;32;8;1;2;1904000
1024;4096;64;4;1;6;7369216
256;4096;64;4;1;2;1887872
128;2048;16;128;1;1;18446744073709551615
2;1;1;1;1;62;25585853440
2;256;1;2;132;33;724879168
1;512;1;32;4;62;121400672
512;4096;32;4;4092;1;78559296
4096;1;64;1;1;2;11387424
1024;4096;4;1;1;2;28009312
1024;4096;32;4;4092;11;140075968
2048;4096;32;8;1;2;1917920
1024;1;32;1;2046;2;39280032
2048;4096;64;1;1;1;4839520
1024;2048;32;4;1;3;3869568
4096;1024;32;4;1;2;1874976
1024;4096;16;4;1;4;4731456
1024;4096;32;2;2046;2;20261120
2048;4096;32;2;1;2;2204032
1024;2048;32;16;4092;11;140213504
1024;2048;32;4;4092;4;45993152
512;4096;32;4;1;12;13483936
1024;4096;512;4;2046;2;18446744073709551615
1024;1024;4;4;682;3;23346400
4096;4096;32;4;2046;2;10432928
1;1024;1;2;1;2;64077280
1024;4096;32;4;44;2;3606816
2048;4096;2;4;1;2;16660000
1;4096;1;4;93;2;901660256
1024;4096;32;128;1;2;18446744073709551615
64;1;1;1;12;1;638381824
128;1024;32;64;341;33;18446744073709551615
128;16;4;16;132;124;123980512
2;4096;1;2;33;93;184130688
4;4096;4;8;1;6;9006112
1024;4096;32;4;6;2;3584480
1024;4096;32;1024;1;2;18446744073709551615
1024;4;64;4;33;2;11226656
4;512;1;2;1;2;52784832
32;128;32;1;1;62;51629024
4096;1024;32;32;186;44;121061600
512;1;16;1;2046;1;77254080
2048;4096;64;4;2046;4;21162016
1024;4096;32;4;372;6;9222112
1024;64;32;4;1;2;2454976
1024;4096;2;64;1;2;4033088
2048;1024;256;16;12;12;18446744073709551615
16;1;2;1;4092;372;3996966240
512;1024;64;16;4092;11;140402528
1024;1;32;1;1;11;119461984
1024;4096;32;1024;93;2;18446744073709551615
1;4096;1;4;1;2;27495776
1;4096;1;4;1;3;54989792
4;4096;2;4;22;2;57524096
1024;4096;32;1;1;1;8183904
256;1;32;1;1;2;88126464
256;1;2;1;1;11;212825216
1024;16;256;4;1;2;3870752
8;1;8;1;93;124;7009579104
1024;256;8;1;11;682;52408992
1024;1;64;1;44;1;39050688
1;1024;1;1;11;1;236330976
16;8;8;1;1;66;403984864
16;128;16;1;1;1;24818144
1024;16;32;4;1;1;4566528
1024;4096;32;4;1;1;3653472
1024;2048;64;4;1;1;3696832
1;2048;1;2;132;62;1457572416
1024;16;64;1;1;62;70049184
32;256;32;128;2;1;18446744073709551615
1024;4096;128;4;1;22;20349664
128;4096;64;4;1;2;1879840
1024;1024;128;4;2046;2;20401408
1024;4096;32;4;1;341;47735968
1024;4096;32;8;1;12;13494752
1024;4096;1;512;1;2;26570144
1024;4096;1;4;1;2;29965376
8;256;8;256;33;4;18446744073709551615
4;32;2;32;1;4;372654656
1;512;1;2;33;11;373454144
64;4;64;1;2046;1;318026976
1024;4096;32;4;22;2;3614464
128;1;4;1;1;6;372742752
2;1;1;1;3;1;18796336576
128;256;4;1;132;33;62947328
1;1024;1;1;4;62;216744736
1024;4096;32;256;1;2;18446744073709551615
1024;8;32;4;682;2;7682144
2;4096;2;4;1;2;13934112
1024;4096;32;32;1;2;2963488
64;1024;1;8;6;1;28904992
128;1;8;1;341;33;419066912
1;16;1;16;132;124;3254896640
2;4096;1;2;1;1;102820160
2048;4096;32;4;1;11;13078624
2048;4096;32;4;4092;2;21955968
1024;4096;32;8;1023;11;33779456
1024;1;32;1;1;2;21901248
512;1024;64;4;1;2;1883296
512;1;128;1;1;2;44348640
1024;4096;32;4;132;2;4040320
512;4096;16;4;1;1;4834912
512;4096;32;8;1364;2;27138464
256;1;64;1;1;6;199107552
1024;4096;8;8;1;3;5288416
1024;4096;32;4;1023;6;18643488
128;4096;32;4;1023;2;77981696
2048;4096;8;32;1;2;1984064
2048;1;32;1;1;2;11315008
1024;1;64;1;2046;3;67350848
1024;4096;16;4;1023;1;11354816
1024;2048;64;2;372;2;5102208
1024;4096;32;4;1;22;25339552
1024;512;64;4;1;2;1918240
1024;2048;32;4;4092;2;44131008
1024;2048;32;2;1;2;2087616
2048;1;16;1;1;2;11165984
512;4096;8;2;2046;1;41973184
1024;4096;64;4;1;3;4077600
1;1;1;1;1364;2;38477717376
2048;1;4;1;1;2;32669760
4;512;1;256;1;1364;39308000
32;1;32;1;1;62;2818345856
4;1024;4;128;186;44;705029600
512;32;16;16;2046;1;40456448
4096;4096;32;4;1;4;4488576
1024;2048;32;16;1;2;2061856
2048;4096;32;4;1023;2;6038752
4;4096;4;4;1;2;7169600
1024;8;32;4;1;2;2835552
1024;4096;32;4;1;93;60870752
1;4096;1;4;1;2;27491040
2048;1024;256;16;12;93;18446744073709551615
1;1;1;1;4092;31;42558537312
32;1024;1;16;1;1;17441888
1024;1;512;1;682;6;73934560
1024;4096;32;16;2046;2;20341312
1024;512;16;16;1;2;1943968
1024;1;32;1;4092;2;39128768
1024;256;32;4;1;2;2054048
1024;1024;32;1;1;2;3537408
1024;2048;16;4;1364;2;14227616
1024;4096;32;2;1;1;4709120
512;4096;128;4;1364;2;27717056
1024;4096;32;8;4092;2;44032704
1024;1;32;1;1;3;64932096
512;4096;32;4;1023;3;25332064
2048;1;16;1;682;2;20943712
1024;4096;128;1;1;3;3997920
1024;4096;16;2;1;1;8474144
4096;4096;64;4;1;1;3274048
1024;4096;8;4;4092;2;43046880
1024;1024;32;8;1;4;4252928
1024;1;16;1;1;2;23271328
2048;4096;32;16;1;2;2209856
1024;1024;32;4;1;11;15882304
1024;4096;32;8;1;3;4077888
1024;4096;64;4;1364;3;22427648
512;1;64;1;2046;1;79768736
1024;4096;32;1;1;4;7554880
256;8;2;4;1;11;30835552
16;8;4;1;93;124;568313888
1024;256;8;4;11;682;79854976
1024;64;64;1;44;1;5012896
256;4096;32;4;1;6;7929440
32;4096;32;4;1;2;1914432
1024;4096;32;1;1;2;3710176
1024;4096;256;4;1;2;2925440
4096;4096;64;4;1;2;2136320
4096;2048;32;4;1;4;4478720
512;2048;16;4;1;3;4984992
512;4096;64;4;1;1;3655072
4;1024;4;32;3;1364;66984512
16;8;8;4;1;66;484582720
16;64;16;32;1;1;52763136
1;64;1;2;372;11;4153067392
256;1;32;1;1;3;190133120
2048;1;32;1;1;4;41602528
256;4096;128;4;2046;2;81399072
1;4096;1;1024;1;2;70945056
512;2048;32;8;1;3;3946624
1024;4096;32;32;1364;6;49587104
1;1024;1;64;1;62;58243584
4;1;1;1;2;1;11603764160
8;256;1;16;33;2;54163328
4;1;4;1;1;4;9986584096
2048;4096;16;4;1364;2;7764288
1024;4096;32;1;1;124;40808128
128;4096;32;4;186;2;14849664
1024;4096;32;2;1;2046;76004128
512;4096;32;2;1;2;2098848
1024;2048;32;2;1364;1;14425152
64;512;1;2;1364;11;242897792
256;4;64;2;31;33;125613440
128;2048;2;1;1;6;105348960
2;128;1;1;186;62;1008394752
1024;4096;32;4;1023;1;10849600
2048;1;32;1;1;2;11343584
4;4096;4;4;1;2;7171424
1024;1024;512;4;1;372;18446744073709551615
1024;4096;1024;4;1;2;18446744073709551615
1024;4096;32;1;1;11;10468768
1024;128;1024;4;1;2;18446744073709551615
1024;4096;512;4;1;2;18446744073709551615
1024;2048;1;4;1;2;28612544
1024;4096;128;4;22;2;3623424
1024;16;64;1;1;2;3068736
1;4096;1;4;1;2;27477312
4096;256;32;4;1;2;2017024
1024;64;1;4;1;2;27851392
1024;4096;128;4;1;4092;301782432
2048;4096;1024;4;1;2;18446744073709551615
1024;4096;32;4;12;2;3587392
8;4096;2;4;6;2;32686528
1024;2048;32;128;1;2;18446744073709551615
8;4096;2;4;1;2;13936832
1024;4096;32;4;1;66;81965440
1024;4096;32;4;3;33;135084864
1024;4096;32;4;1;12;13589472
1024;4096;32;4;682;372;756869152
64;4096;8;64;1;2;2725600
128;4096;32;4;1;2;1832608
1024;4096;32;4;1;124;69406464
1024;4;4;4;1;2;12089408
1024;128;128;4;1;1364;141300032
1024;4096;1024;4;1;2;18446744073709551615
1024;4096;32;2;1;1;4705248
512;4096;32;512;1;2;18446744073709551615
1024;4096;32;64;2046;22;18446744073709551615
1024;64;32;4;682;2;8117536
1024;4096;32;256;1;682;18446744073709551615
1024;4096;32;4;1;2046;58421888
1024;4096;32;4;682;1364;2453322432
1024;4096;32;16;31;2;3860672
1;4096;1;4;31;2;302306976
1024;4096;8;4;1;11;8215168
1024;2;32;1;1;2;10990304
1024;4096;32;4;132;62;84907392
1024;32;32;2;1;2;2390368
1024;4096;1;1;1;2;110007776
1024;128;32;8;1;66;79767456
1024;128;32;4;1;2;2263008
1024;4096;32;4;341;2;4662304
16;4096;1;4;1;1;60008576
128;16;32;4;1;2;11088064
8;1024;2;4;1;2;14068320
1024;4;32;4;124;2;12124096
1024;4096;1;4;1;682;63127904
1024;4096;2;4;62;2;28556000
4;8;4;4;1;2;763623712
1024;4096;32;4;93;2;4233888
1024;4096;32;4;1;1023;28052384
2;4096;1;4;1;2;27435328
1024;16;32;4;1;2;2160064
64;4096;2;4;93;2;32475136
16;4096;8;4;1;2;3762848
1024;256;256;32;1;2;18446744073709551615
1024;4096;32;512;1023;2;18446744073709551615
128;8;4;1;4;33;99293536
512;512;8;32;4;62;192556800
64;512;1;8;6;1;28921568
1;1;1;1;341;33;41047517600
1024;1024;512;4;1;2;18446744073709551615
1024;4096;1024;256;6;2;18446744073709551615
1024;4096;32;1024;341;2;18446744073709551615
4;2;4;1;1;2;2568794880
64;4096;32;4;1;2;1857536
1024;4096;32;4;124;2;4067712
32;2048;32;4;132;2;40170240
4096;4096;1024;4;1;2;18446744073709551615
1024;4096;1;4;1;2;29968416
1024;32;32;4;1;2;2424224
1024;4096;2;4;1;66;33173056
1024;64;32;2;1;2;2115168
1;4096;1;4;3;2;40569568
1024;512;2;4;3;2;17381440
1024;4096;32;512;1;2;18446744073709551615
1024;8;4;4;372;2;16523520
1024;8;32;4;1;2;2840928
1024;32;2;4;1;2;14367360
1024;4096;32;4;1;44;57098976
1024;128;32;2;1;2;2181472
1024;4096;16;4;1;2;2109728
1024;512;32;4;62;2;4000480
16;2048;1;4;1;2;27456352
1024;2;8;1;1;2;21918976
4096;4096;1;4;1;2;38457696
1024;4096;32;4;33;2;3805312
1024;4096;32;4;1;372;37503584
1024;1;32;1;1;2;22502944
1024;4096;32;256;1;341;18446744073709551615
1024;4;32;4;93;2;10682784
1024;16;32;2;1;2;3024576
1024;4096;2;4;1;1364;45319136
128;16;1;16;132;124;103851072
2;4096;2;1;1;1;100602176
4;1;1;1;1;1364;15034188128
32;1;32;1;1;62;2818032512
4096;1024;32;32;186;3;7310912
512;32;8;16;2046;1;41388640
2048;1024;256;16;12;132;18446744073709551615
16;1;2;1;4092;31;3000442432
1024;4096;32;512;1;11;18446744073709551615
512;1024;1;16;1;11;15131552
1024;1;32;1;1;1;50909824
256;8;2;4;1;11;30813088
1;8;1;1;93;124;5761357856
1024;4096;16;4;1;1;4958080
1024;4096;32;4;1;4092;85386336
1024;4096;32;64;1364;2;18446744073709551615
1024;256;8;1;11;1;26813184
1024;64;64;32;44;1;18446744073709551615
4;512;2;32;3;1364;47644448
16;8;8;1;1;2046;2947092608
16;128;8;1;2;1;44591424
1;512;1;1;22;1;236481792
1;1;1;1;1;62;51146217792
4;1;4;1;2;11;11358475616
1024;128;32;4;1;33;123676288
8;64;1;16;1;2;56683744
4;32;1;32;1;4;401063872
64;512;64;256;33;11;18446744073709551615
256;64;64;64;682;1364;18446744073709551615
128;8;2;2;1;6;87258848
8;4096;1;1;186;62;273458304
128;256;4;1;2;33;58877088
1;2048;1;32;4;62;66085632
1024;4096;32;64;2;2;18446744073709551615
64;4096;32;1;1;2;3410496
1024;4096;32;4;66;2;4120352
64;1024;1;8;6;31;41974656
1024;1;2;1;341;33;365247200
128;64;4;4;2046;341;2085131072
2;256;2;1;1;1;164143776
1024;4096;128;32;1;2;18446744073709551615
2048;512;1;256;1364;1364;4865086016
32;128;1;2;22;1;111229408
4096;1024;32;4;186;3;5449056
1;1;1;1;2046;1;38609792832
8;1024;2;8;12;186;102144992
16;1;2;1;1;11;2504283104
512;1024;64;2;1;11;16075200
4;1;4;1;682;93;11769932448
16;8;1;2;1;11;331226944
2;8;2;1;93;124;3038082240
1024;1;8;1;11;1;42344128
1024;64;64;1;44;6;17000544
16;4096;1;4;1;2;27157376
4;2048;2;1;2;1364;148680384
16;1;8;1;1;66;3253343744
16;128;1;1;1;1;231935520
1;512;1;1;1;1;242809344
1024;4096;32;128;1;1;18446744073709551615
4096;4;32;4;132;2;5946112
256;1;32;1;1364;2;151747424
512;4096;32;16;1;4;4310208
