{
  "passages": [
    {
      "text": "@showIfGameHasBeenPlayed TheForger\n@passive\n[[Salut !|Masako 1-1]]",
      "links": [
        {
          "name": "Salut !|Masako 1-1",
          "link": "Salut !|Masako 1-1",
          "broken": true
        }
      ],
      "name": "Masako-1",
      "pid": "1",
      "position": {
        "x": "403",
        "y": "447"
      }
    },
    {
      "text": "J’ai vu sur ton profil que tu commences à jouer à GaoForger. \nTu aimes bien ce jeu ?\n\n[[Oui|Masako 1-2]]\n[[Je commence juste…|Masako 1-2]]",
      "links": [
        {
          "name": "Oui|Masako 1-2",
          "link": "Oui|Masako 1-2",
          "broken": true
        },
        {
          "name": "Je commence juste…|Masako 1-2",
          "link": "Je commence juste…|Masako 1-2",
          "broken": true
        }
      ],
      "name": "Masako 1-1",
      "pid": "2",
      "position": {
        "x": "407",
        "y": "592"
      }
    },
    {
      "text": "J’y joue souvent avec ma fille. Elle est très forte pour trouver les différences et moi j'aime beaucoup la poésie des illustrations. C'est appaisant je trouve.\n\n[[C'est vrai que c'est joli|Masako 1-3]]\n[[Ta fille a quel âge ?|Masako 1-5]]",
      "links": [
        {
          "name": "C'est vrai que c'est joli|Masako 1-3",
          "link": "C'est vrai que c'est joli|Masako 1-3",
          "broken": true
        },
        {
          "name": "Ta fille a quel âge ?|Masako 1-5",
          "link": "Ta fille a quel âge ?|Masako 1-5",
          "broken": true
        }
      ],
      "name": "Masako 1-2",
      "pid": "3",
      "position": {
        "x": "405",
        "y": "741"
      }
    },
    {
      "text": "J'adore ces images. Elles m'apaisent quand je suis stressée. Surtout celle avec les nuages. \nC'est ma préférée, elle donne la sensation d'être à l'extérieur. \nJe l'ai beaucoup regardée quand j'ai du resté longtemps chez moi.\n\n[[Tu as été malade ? Confinée ?|Masako 1-4]]",
      "links": [
        {
          "name": "Tu as été malade ? Confinée ?|Masako 1-4",
          "link": "Tu as été malade ? Confinée ?|Masako 1-4",
          "broken": true
        }
      ],
      "name": "Masako 1-3",
      "pid": "4",
      "position": {
        "x": "192",
        "y": "900"
      }
    },
    {
      "text": "Trois ans !\n\n[[C'est un peu tôt pour la mettre devant un écran, non ?|Masako 1-6]]\n[[Et elle arrive à jouer à ce jeu ?|Masako 1-7]]",
      "links": [
        {
          "name": "C'est un peu tôt pour la mettre devant un écran, non ?|Masako 1-6",
          "link": "C'est un peu tôt pour la mettre devant un écran, non ?|Masako 1-6",
          "broken": true
        },
        {
          "name": "Et elle arrive à jouer à ce jeu ?|Masako 1-7",
          "link": "Et elle arrive à jouer à ce jeu ?|Masako 1-7",
          "broken": true
        }
      ],
      "name": "Masako 1-5",
      "pid": "5",
      "position": {
        "x": "507",
        "y": "899"
      }
    },
    {
      "text": "Je sais qu'il ne faut pas donner trop d'écran à un enfant ! \nMais est-ce que tu as déjà été dans des salles d'attentes avec des gens qui te regardent comme s'ils voulaient ta mort parce que ton enfant fait du bruit ?\n\n[[Haha, oui, ce n'est pas toujours facile... '^^|Masako 1-9]]\n[[Il y a toujours des solutions...|Masako 1-10]]",
      "links": [
        {
          "name": "Haha, oui, ce n'est pas toujours facile... '^^|Masako 1-9",
          "link": "Haha, oui, ce n'est pas toujours facile... '^^|Masako 1-9",
          "broken": true
        },
        {
          "name": "Il y a toujours des solutions...|Masako 1-10",
          "link": "Il y a toujours des solutions...|Masako 1-10",
          "broken": true
        }
      ],
      "name": "Masako 1-6",
      "pid": "6",
      "position": {
        "x": "432",
        "y": "1049"
      }
    },
    {
      "text": "Oui ! Très bien ! J'ai eu beaucoup de temps pour lui expliquer car je passe toutes mes journées avec elle. C'est aussi pour ça que j'aime bien parler à des adultes sur Gao game. \nJ'aime beaucoup ma fille, mais dès fois je suis comme un peu folle après une journée passée avec elle. ^ç-ç^\n\n[[Tu vis seule avec elle ?|Masako 1-8]]\n\t\t",
      "links": [
        {
          "name": "Tu vis seule avec elle ?|Masako 1-8",
          "link": "Tu vis seule avec elle ?|Masako 1-8",
          "broken": true
        }
      ],
      "name": "Masako 1-7",
      "pid": "7",
      "position": {
        "x": "702",
        "y": "1054"
      }
    },
    {
      "text": "Je ne suis pas toute seule. ^^ Alma a un papa. Peut-être, tu lui as déjà parlé ? C'est Amin. C'est vrai qu'il travaille beaucoup.\n\n[[Ah oui, Amin m’a déjà parlé d’elle.|Masako 1-20]]\n[[Non, connais pas|Masako 1-50]]",
      "links": [
        {
          "name": "Ah oui, Amin m’a déjà parlé d’elle.|Masako 1-20",
          "link": "Ah oui, Amin m’a déjà parlé d’elle.|Masako 1-20",
          "broken": true
        },
        {
          "name": "Non, connais pas|Masako 1-50",
          "link": "Non, connais pas|Masako 1-50",
          "broken": true
        }
      ],
      "name": "Masako 1-8",
      "pid": "8",
      "position": {
        "x": "1039",
        "y": "2192"
      }
    },
    {
      "text": "Il est top player à Gao the Filekeeper et comme moi, il aime beaucoup accueillir les nouveaux joueurs.\nJe trouve ça excitant de parler à une personne qui ne connaît pas qui je suis. Pas toi ?\n\n[[Si, un peu. :)|Masako 1-51]]\n[[Non, je trouve ça plutôt intimidant, voir fastidieux.|Masako 1-51]]",
      "links": [
        {
          "name": "Si, un peu. :)|Masako 1-51",
          "link": "Si, un peu. :)|Masako 1-51",
          "broken": true
        },
        {
          "name": "Non, je trouve ça plutôt intimidant, voir fastidieux.|Masako 1-51",
          "link": "Non, je trouve ça plutôt intimidant, voir fastidieux.|Masako 1-51",
          "broken": true
        }
      ],
      "name": "Masako 1-50",
      "pid": "9",
      "position": {
        "x": "1580",
        "y": "2398"
      }
    },
    {
      "text": "Aujourd’hui, sur la plupart des réseaux on sait tout de suite qui on a en face, pas sur Gao ! \nÇa apporte de la légèreté. Il n'y a pas d’attente, pas de projection sur qui on est. Dans la vie, on rencontre toujours l'ami d'un ami, ou le frère de quelqu'un... Et ces gens ont toujours entendu parler de toi avant que tu leur parles. \nIls ont toujours une idée sur ce que tu es en train de vivre.\n\n[[Tu trouves ça pesant ?|Masako 1-52]]\n[[Moi, ça me va très bien !|Masako 1-53]]",
      "links": [
        {
          "name": "Tu trouves ça pesant ?|Masako 1-52",
          "link": "Tu trouves ça pesant ?|Masako 1-52",
          "broken": true
        },
        {
          "name": "Moi, ça me va très bien !|Masako 1-53",
          "link": "Moi, ça me va très bien !|Masako 1-53",
          "broken": true
        }
      ],
      "name": "Masako 1-51",
      "pid": "10",
      "position": {
        "x": "1579",
        "y": "2543"
      }
    },
    {
      "text": "Parfois oui. Mais c'est peut-être ma situation qui est spéciale.\n\n[[Comment ça ?|Masako 1-54]]\n",
      "links": [
        {
          "name": "Comment ça ?|Masako 1-54",
          "link": "Comment ça ?|Masako 1-54",
          "broken": true
        }
      ],
      "name": "Masako 1-52",
      "pid": "11",
      "position": {
        "x": "1580",
        "y": "2697"
      }
    },
    {
      "text": "J'ai quitté le Japon pour faire mes études ici. \nJ'ai comme sauté dans l'inconnu et c'était une période très grisante de ma vie. J'ai fait des rencontres que je n'aurais jamais pu faire si je n'avais pas voyagé ! =^.^=\n\n[[Tu viens de quel coin du Japon ?|Masako 1-55]]\n",
      "links": [
        {
          "name": "Tu viens de quel coin du Japon ?|Masako 1-55",
          "link": "Tu viens de quel coin du Japon ?|Masako 1-55",
          "broken": true
        }
      ],
      "name": "Masako 1-54",
      "pid": "12",
      "position": {
        "x": "1576",
        "y": "2843"
      }
    },
    {
      "text": "Niigita. C'est pas très connu.\n\n[[Jamais entendu parlé|Masako 1-56]]\n[[Je connais !|Masako 1-57]]",
      "links": [
        {
          "name": "Jamais entendu parlé|Masako 1-56",
          "link": "Jamais entendu parlé|Masako 1-56",
          "broken": true
        },
        {
          "name": "Je connais !|Masako 1-57",
          "link": "Je connais !|Masako 1-57",
          "broken": true
        }
      ],
      "name": "Masako 1-55",
      "pid": "13",
      "position": {
        "x": "1578",
        "y": "2997"
      }
    },
    {
      "text": "C'est normal. C'est une grosse ville, mais en dehors du Japon, presque personne ne connaît. Mais c'est très bien, comme ça je suis encore un peu une inconnue pour toi. ;-) \n\n[[Pourquoi est-ce que tu aimes être une inconnue ?|Masako 1-58]]",
      "links": [
        {
          "name": "Pourquoi est-ce que tu aimes être une inconnue ?|Masako 1-58",
          "link": "Pourquoi est-ce que tu aimes être une inconnue ?|Masako 1-58",
          "broken": true
        }
      ],
      "name": "Masako 1-56",
      "pid": "14",
      "position": {
        "x": "1504",
        "y": "3150"
      }
    },
    {
      "text": "\\o/ ! Normalement, en dehors du Japon, personne n'a entendu parler ! \\o/\nIl y avait combien de chances pour que je parle à quelqu'un qui connait Niigata aujourd'hui ? \nTu vois, c'est ça que j'aime dans les rencontres au hasard. Les surprises ! ^.^\n\n[[Moi aussi j'aime les surprises !|Masako 1-60]]\n[[Je préfère contrôler qui je rencontre|Masako 1-61]]",
      "links": [
        {
          "name": "Moi aussi j'aime les surprises !|Masako 1-60",
          "link": "Moi aussi j'aime les surprises !|Masako 1-60",
          "broken": true
        },
        {
          "name": "Je préfère contrôler qui je rencontre|Masako 1-61",
          "link": "Je préfère contrôler qui je rencontre|Masako 1-61",
          "broken": true
        }
      ],
      "name": "Masako 1-57",
      "pid": "15",
      "position": {
        "x": "1773",
        "y": "3017"
      }
    },
    {
      "text": "C'est ce que j'aime sur Gao. \nJe peux rencontrer de vrais inconnus, comme toi. ;-) Parfois il y a des amitiés qui restent et parfois c'est plus... ;)\n\n[[Moi je suis juste là pour jouer…|Masako 1-65]]\n[[Moi aussi j’aime rencontrer de nouvelles personnes ;)|Masako 1-71]]",
      "links": [
        {
          "name": "Moi je suis juste là pour jouer…|Masako 1-65",
          "link": "Moi je suis juste là pour jouer…|Masako 1-65",
          "broken": true
        },
        {
          "name": "Moi aussi j’aime rencontrer de nouvelles personnes ;)|Masako 1-71",
          "link": "Moi aussi j’aime rencontrer de nouvelles personnes ;)|Masako 1-71",
          "broken": true
        }
      ],
      "name": "Masako 1-60",
      "pid": "16",
      "position": {
        "x": "1939",
        "y": "2963"
      }
    },
    {
      "text": "Ho ! Oui, moi aussi ! Je veux dire que parfois l’aventure nous attend au coin de la rue : j’ai rencontré mon mari sur Gao.games. \nIl y avait une grosse tête de chat à notre mariage. =^.^= Bien sur, on a mis une peluche de Gao dans le berceau de notre fille. <3\nMa fille adore Gao. Maintenant, elle veut un chat. :D Je suis à deux doigts de craquer… et son père qui n’arrive pas à lui refuser quelque chose…  ><\n\n[[J’espère que t’es pas allergique|Masako 1-66]]\n[[Tu peux commencer à réfléchir dès maintenant au nom du chat... :p|Masako 1-69]]",
      "links": [
        {
          "name": "J’espère que t’es pas allergique|Masako 1-66",
          "link": "J’espère que t’es pas allergique|Masako 1-66",
          "broken": true
        },
        {
          "name": "Tu peux commencer à réfléchir dès maintenant au nom du chat... :p|Masako 1-69",
          "link": "Tu peux commencer à réfléchir dès maintenant au nom du chat... :p|Masako 1-69",
          "broken": true
        }
      ],
      "name": "Masako 1-65",
      "pid": "17",
      "position": {
        "x": "1912",
        "y": "3643"
      }
    },
    {
      "text": "Ça nous fait un point commun ! \nTu vois la force de l'imagination ? Je ne te connais pas, mais le petit peu que je vois de toi me donne envie de te connaître beaucoup plus. J'adore ça. ;)\n\n:-D\n",
      "name": "Masako 1-71",
      "pid": "18",
      "position": {
        "x": "2230",
        "y": "4364"
      }
    },
    {
      "text": "Moi non, mais Amin, mon mari, oui. \nC’est tout ce qui nous sauve du chat. Alma est tellement mignonne qu’elle aurait déjà fait craqué son père.\n\n[[Et toi, pas de risque qu'elle te fasse craquer ?|Masako 1-67]]",
      "links": [
        {
          "name": "Et toi, pas de risque qu'elle te fasse craquer ?|Masako 1-67",
          "link": "Et toi, pas de risque qu'elle te fasse craquer ?|Masako 1-67",
          "broken": true
        }
      ],
      "name": "Masako 1-66",
      "pid": "19",
      "position": {
        "x": "1833",
        "y": "3856"
      }
    },
    {
      "text": "Hihihi ! Comme c'est Alma qui déciderait ce serait certaiement GAO !\n\n[[Ha oui ! Evidemment ! :-D|Masako 1-70]]",
      "links": [
        {
          "name": "Ha oui ! Evidemment ! :-D|Masako 1-70",
          "link": "Ha oui ! Evidemment ! :-D|Masako 1-70",
          "broken": true
        }
      ],
      "name": "Masako 1-69",
      "pid": "20",
      "position": {
        "x": "2057",
        "y": "4097"
      }
    },
    {
      "text": "Ah. \nAlors, il t’a déjà du te raconter notre histoire et la maladie d'Alma...\n\n[[Oui, en effet|Masako 1-22]]\n[[Ça t’ennuie ?|Masako 1-21]]",
      "links": [
        {
          "name": "Oui, en effet|Masako 1-22",
          "link": "Oui, en effet|Masako 1-22",
          "broken": true
        },
        {
          "name": "Ça t’ennuie ?|Masako 1-21",
          "link": "Ça t’ennuie ?|Masako 1-21",
          "broken": true
        }
      ],
      "name": "Masako 1-20",
      "pid": "21",
      "position": {
        "x": "560",
        "y": "2393"
      }
    },
    {
      "text": "Les choses sont comme elles sont.\n\n[[Oups, désolé|Masako 1-24]]",
      "links": [
        {
          "name": "Masako 1-24",
          "link": "Masako 1-24",
          "pid": "24"
        }
      ],
      "name": "Masako 1-21",
      "pid": "22",
      "position": {
        "x": "400",
        "y": "2581"
      }
    },
    {
      "text": "Je pensais être une inconnue pour toi, et je me rends compte que non.\n\n[[Tu es déçue ?|Masako 1-23]]\n[[C'est un problème ?|Masako 1-23]]",
      "links": [
        {
          "name": "Tu es déçue ?|Masako 1-23",
          "link": "Tu es déçue ?|Masako 1-23",
          "broken": true
        },
        {
          "name": "C'est un problème ?|Masako 1-23",
          "link": "C'est un problème ?|Masako 1-23",
          "broken": true
        }
      ],
      "name": "Masako 1-22",
      "pid": "23",
      "position": {
        "x": "668",
        "y": "2573"
      }
    },
    {
      "text": "Ce n’est pas de ta faute. C’est juste que parfois, j’ai du mal à comprendre comment fonctionne Amin. Lui et moi, c’est le jour et la nuit. \n\n[[Les opposés s’attirent|Masako 1-26]]",
      "links": [
        {
          "name": "Les opposés s’attirent|Masako 1-26",
          "link": "Les opposés s’attirent|Masako 1-26",
          "broken": true
        }
      ],
      "name": "Masako 1-24",
      "pid": "24",
      "position": {
        "x": "400",
        "y": "2731"
      }
    },
    {
      "text": "Ca doit être ça, sinon il n’y a pas d’explication ! ^.^ Par exemple, lui est toujours dans ses souvenirs. Moi, c’est l’avenir qui m’intéresse !\n\n[[Le passé est réconfortant|Masako 1-27]]\n[[L’avenir est passionnant|Masako 1-28]]",
      "links": [
        {
          "name": "Le passé est réconfortant|Masako 1-27",
          "link": "Le passé est réconfortant|Masako 1-27",
          "broken": true
        },
        {
          "name": "L’avenir est passionnant|Masako 1-28",
          "link": "L’avenir est passionnant|Masako 1-28",
          "broken": true
        }
      ],
      "name": "Masako 1-26",
      "pid": "25",
      "position": {
        "x": "400",
        "y": "2885"
      }
    },
    {
      "text": "Le passé est le passé, je connais bien, merci. L’avenir c’est l’inconnu ! L’aventure ! J'ai l'impression de revivre depuis que je peux penser au-delà du prochain rendez-vous avec les docteurs ! ^.^\n\n[[Ca n'a pas du être une période facile|Masako 1-29]]\n\n",
      "links": [
        {
          "name": "Ca n'a pas du être une période facile|Masako 1-29",
          "link": "Ca n'a pas du être une période facile|Masako 1-29",
          "broken": true
        }
      ],
      "name": "Masako 1-27",
      "pid": "26",
      "position": {
        "x": "325",
        "y": "3047"
      }
    },
    {
      "text": "Je suis tellement d’accord avec toi ! \nMême si ça fait peur, parfois, l’avenir c’est ce qu’on n’a pas encore vécu. C’est là qu’est l’aventure ! Le passé, on connaît, merci ! Je suis loin d’avoir réalisé tous mes rêves. ^.^\nEt toi ?\n\n[[Oui, en tout cas, c'est en bonne voie|Masako 1-35]]\n[[non, il me reste tellement de chose à faire !|Masako 1-31]]\n[[Il faudrait déjà que je sache ce que sont mes rêves...|Masako 1-36]]",
      "links": [
        {
          "name": "Oui, en tout cas, c'est en bonne voie|Masako 1-35",
          "link": "Oui, en tout cas, c'est en bonne voie|Masako 1-35",
          "broken": true
        },
        {
          "name": "non, il me reste tellement de chose à faire !|Masako 1-31",
          "link": "non, il me reste tellement de chose à faire !|Masako 1-31",
          "broken": true
        },
        {
          "name": "Il faudrait déjà que je sache ce que sont mes rêves...|Masako 1-36",
          "link": "Il faudrait déjà que je sache ce que sont mes rêves...|Masako 1-36",
          "broken": true
        }
      ],
      "name": "Masako 1-28",
      "pid": "27",
      "position": {
        "x": "570",
        "y": "3036"
      }
    },
    {
      "text": "Alors tient le cap ! Je suis avec toi !\n\n\t\\o/",
      "name": "Masako 1-35",
      "pid": "28",
      "position": {
        "x": "680",
        "y": "4361"
      }
    },
    {
      "text": "Et tu sais pourquoi ?\n\n[[Oui, mais c'est pas toujours facile de faire bouger les choses|Masako 1-32]]\n[[Non...|Masako 1-36]]",
      "links": [
        {
          "name": "Oui, mais c'est pas toujours facile de faire bouger les choses|Masako 1-32",
          "link": "Oui, mais c'est pas toujours facile de faire bouger les choses|Masako 1-32",
          "broken": true
        },
        {
          "name": "Non...|Masako 1-36",
          "link": "Non...|Masako 1-36",
          "broken": true
        }
      ],
      "name": "Masako 1-31",
      "pid": "29",
      "position": {
        "x": "729",
        "y": "3203"
      }
    },
    {
      "text": "J’espère qu’on trouvera tous les deux les moyens d’arriver à vivre nos rêves... \nMieux ! \nJe suis certaine que nous allons y arriver ! ^.^\n\n[[Tu es toujours si optimiste ?|Masako 1-33]]",
      "links": [
        {
          "name": "Tu es toujours si optimiste ?|Masako 1-33",
          "link": "Tu es toujours si optimiste ?|Masako 1-33",
          "broken": true
        }
      ],
      "name": "Masako 1-32",
      "pid": "30",
      "position": {
        "x": "612",
        "y": "3391"
      }
    },
    {
      "text": "Comme tout le monde. ^^\nMais avant ça, j'ai du m'occuper beaucoup de ma fille. C'est pas pareil, mais dès fois ça donne l'impression d'être enfermé aussi. ^ç.ç^\n\n[[Tu vis seule avec elle ?|Masako 1-8]]",
      "links": [
        {
          "name": "Tu vis seule avec elle ?|Masako 1-8",
          "link": "Tu vis seule avec elle ?|Masako 1-8",
          "broken": true
        }
      ],
      "name": "Masako 1-4",
      "pid": "31",
      "position": {
        "x": "195",
        "y": "1049"
      }
    },
    {
      "text": "Oui, voilà, c'est pas très facile. Et parfois, j'aimerai bien être plus parfaite et je dois accepter que ce n'est pas possible. :p\n\n[[Je m'excuse de t'avoir mis la pression. Tu vis seule avec elle ?|Masako 1-8]]",
      "links": [
        {
          "name": "Je m'excuse de t'avoir mis la pression. Tu vis seule avec elle ?|Masako 1-8",
          "link": "Je m'excuse de t'avoir mis la pression. Tu vis seule avec elle ?|Masako 1-8",
          "broken": true
        }
      ],
      "name": "Masako 1-9",
      "pid": "32",
      "position": {
        "x": "665",
        "y": "1215"
      }
    },
    {
      "text": "Je ne suis pas parfaite, mais je ne me permettrais pas de faire la leçon si je ne connais pas la personne et son histoire. \n\n[[Peu importe le contexte. Quand on veut, on peut.|Masako 1-25]]\n[[Ton histoire ?|Masako 1-11]]",
      "links": [
        {
          "name": "Peu importe le contexte. Quand on veut, on peut.|Masako 1-25",
          "link": "Peu importe le contexte. Quand on veut, on peut.|Masako 1-25",
          "broken": true
        },
        {
          "name": "Ton histoire ?|Masako 1-11",
          "link": "Ton histoire ?|Masako 1-11",
          "broken": true
        }
      ],
      "name": "Masako 1-10",
      "pid": "33",
      "position": {
        "x": "407",
        "y": "1192"
      }
    },
    {
      "text": "Tu as raison. \nC'est très important d'empêcher les enfants de regarder trop les écrans, mais tu continues à faire comme si je l'ignorais. Je préfère arrêter la conversation maintenant.",
      "name": "Masako 1-25",
      "pid": "34",
      "position": {
        "x": "141",
        "y": "4347"
      }
    },
    {
      "text": "Et bien par exemple, quand j'étais dans la salle d'attente avec les gens qui me regardaient mal parce que ma fille faisaient du bruit.\n\n[[J'admets que c'est une situation inconfortable|Masako 1-12]]\n[[Il fallait les ignorer !|Masako 1-13]]",
      "links": [
        {
          "name": "J'admets que c'est une situation inconfortable|Masako 1-12",
          "link": "J'admets que c'est une situation inconfortable|Masako 1-12",
          "broken": true
        },
        {
          "name": "Il fallait les ignorer !|Masako 1-13",
          "link": "Il fallait les ignorer !|Masako 1-13",
          "broken": true
        }
      ],
      "name": "Masako 1-11",
      "pid": "35",
      "position": {
        "x": "499",
        "y": "1352"
      }
    },
    {
      "text": "Oui, c'est une situation où tous mes choix sont mauvais : j'ignore les gens ou je fais regarder un écran à ma fille pour la calmer.\n\n[[Il n'y avait pas d'autres jouets dans la salle d'attente ?|Masako 1-14]]\n[[Oui, effectivement, c'est compliqué de s'occuper seul d'un enfant|Masako 1-8]]",
      "links": [
        {
          "name": "Il n'y avait pas d'autres jouets dans la salle d'attente ?|Masako 1-14",
          "link": "Il n'y avait pas d'autres jouets dans la salle d'attente ?|Masako 1-14",
          "broken": true
        },
        {
          "name": "Oui, effectivement, c'est compliqué de s'occuper seul d'un enfant|Masako 1-8",
          "link": "Oui, effectivement, c'est compliqué de s'occuper seul d'un enfant|Masako 1-8",
          "broken": true
        }
      ],
      "name": "Masako 1-12",
      "pid": "36",
      "position": {
        "x": "428",
        "y": "1502"
      }
    },
    {
      "text": "Tu penses vraiment que choisir d'ignorer ce que pensent les gens est une bonne solution ?\n\n[[Tu n'as pas essayé de leur expliquer ?|Masako 1-15]]",
      "links": [
        {
          "name": "Tu n'as pas essayé de leur expliquer ?|Masako 1-15",
          "link": "Tu n'as pas essayé de leur expliquer ?|Masako 1-15",
          "broken": true
        }
      ],
      "name": "Masako 1-13",
      "pid": "37",
      "position": {
        "x": "578",
        "y": "1502"
      }
    },
    {
      "text": "Je suis déjà occupée avec ma fille, je suis seule, je suis tendue. \nLes gens froncent les sourcils ou soupirent fort. Il n'y a pas de jouet dans la salle d'attente. Donc je sors mon portable et je joue avec Alma. Elle se calme. Les gens se détendent. \nEt voilà. =^.^=\n\n[[Effectivement, le contexte était hostile. Tu es toujours toute seule à t'occuper d'elle ?|Masako 1-8]]",
      "links": [
        {
          "name": "Effectivement, le contexte était hostile. Tu es toujours toute seule à t'occuper d'elle ?|Masako 1-8",
          "link": "Effectivement, le contexte était hostile. Tu es toujours toute seule à t'occuper d'elle ?|Masako 1-8",
          "broken": true
        }
      ],
      "name": "Masako 1-15",
      "pid": "38",
      "position": {
        "x": "575",
        "y": "1700"
      }
    },
    {
      "text": "Non. Et même s'il y en avait eu, je n'aurai pas voulu qu'elle les touche. Pour qu'elle risque d'attraper une autre maladie ? La situation est vraiment hostile. ^.^ Mes efforts personnels sont balayés par le contexte.\nJe ne vais pas résoudre toute seule le problème des écrans alors que les gens ne sont pas prêts à ce qu'un enfant fasse du bruit dans une salle d'attente sans jouet.\n\n[[Il y a des contextes hostiles ^^|Masako 1-16]]\n[[Quand on veut, on peut.|Masako 1-25]]",
      "links": [
        {
          "name": "Il y a des contextes hostiles ^^|Masako 1-16",
          "link": "Il y a des contextes hostiles ^^|Masako 1-16",
          "broken": true
        },
        {
          "name": "Quand on veut, on peut.|Masako 1-25",
          "link": "Quand on veut, on peut.|Masako 1-25",
          "broken": true
        }
      ],
      "name": "Masako 1-14",
      "pid": "39",
      "position": {
        "x": "416",
        "y": "1696"
      }
    },
    {
      "text": "Exacement ^.^\n\n[[Mais, dis-moi, tu es souvent seule à t'occuper de ta fille ?|Masako 1-8]]\n",
      "links": [
        {
          "name": "Mais, dis-moi, tu es souvent seule à t'occuper de ta fille ?|Masako 1-8",
          "link": "Mais, dis-moi, tu es souvent seule à t'occuper de ta fille ?|Masako 1-8",
          "broken": true
        }
      ],
      "name": "Masako 1-16",
      "pid": "40",
      "position": {
        "x": "420",
        "y": "1881"
      }
    },
    {
      "text": "Les choses sont comme elles sont.\n\n[[Je ne voulais pas te fâcher.|Masako 1-24]]\n[[Pourquoi est-ce que tu aimes être une inconnue ?|Masako 1-58]]",
      "links": [
        {
          "name": "Je ne voulais pas te fâcher.|Masako 1-24",
          "link": "Je ne voulais pas te fâcher.|Masako 1-24",
          "broken": true
        },
        {
          "name": "Pourquoi est-ce que tu aimes être une inconnue ?|Masako 1-58",
          "link": "Pourquoi est-ce que tu aimes être une inconnue ?|Masako 1-58",
          "broken": true
        }
      ],
      "name": "Masako 1-23",
      "pid": "41",
      "position": {
        "x": "676",
        "y": "2747"
      }
    },
    {
      "text": "Ha, ça, c'est un vrai problème. Mais découvrir ce que l'on veut vraiment faire, est quelque chose de passionant !\n\n[[Et ben tant mieux, ça me fera au moins une aventure à vivre !|Masako 1-38]]\n[[Si tu le dis...|Masako 1-37]]",
      "links": [
        {
          "name": "Et ben tant mieux, ça me fera au moins une aventure à vivre !|Masako 1-38",
          "link": "Et ben tant mieux, ça me fera au moins une aventure à vivre !|Masako 1-38",
          "broken": true
        },
        {
          "name": "Si tu le dis...|Masako 1-37",
          "link": "Si tu le dis...|Masako 1-37",
          "broken": true
        }
      ],
      "name": "Masako 1-36",
      "pid": "42",
      "position": {
        "x": "1095",
        "y": "3398"
      }
    },
    {
      "text": "Oui ! Je suis quelqu'un de très optimiste. \nJe sais que les choses sont parfois très difficiles. Alors, réussir à voir des choses positives un petit peu tous les jours, ça aide à rendre les choses moins difficles. Je me focalise sur les solutions plutôt que sur le problème. Comme les astronautes de la sation spatiale internationale ! =^.^=\n\n[[J'aime bien cette comparaison. :)|Masako 1-38]]\n[[Tu es toujours si optimiste ?|Masako 1-33]]",
      "links": [
        {
          "name": "J'aime bien cette comparaison. :)|Masako 1-38",
          "link": "J'aime bien cette comparaison. :)|Masako 1-38",
          "broken": true
        },
        {
          "name": "Tu es toujours si optimiste ?|Masako 1-33",
          "link": "Tu es toujours si optimiste ?|Masako 1-33",
          "broken": true
        }
      ],
      "name": "Masako 1-37",
      "pid": "43",
      "position": {
        "x": "1060",
        "y": "3667"
      }
    },
    {
      "text": "Parce que c'est le future qui m'intéresse ! J'aime construire des nouvelles choses. Je déteste le moment où les gens se mettent à parler plus de leurs souvenirs que de leurs projets communs.\nEt j'adore le moment où les gens sont curieux de moi !\n\n[[L’avenir est passionnant|Masako 1-28]]\n[[Tu es passionnante ;)|Masako 1-59]]",
      "links": [
        {
          "name": "L’avenir est passionnant|Masako 1-28",
          "link": "L’avenir est passionnant|Masako 1-28",
          "broken": true
        },
        {
          "name": "Tu es passionnante ;)|Masako 1-59",
          "link": "Tu es passionnante ;)|Masako 1-59",
          "broken": true
        }
      ],
      "name": "Masako 1-58",
      "pid": "44",
      "position": {
        "x": "1498",
        "y": "3302"
      }
    },
    {
      "text": "Tu vois la force de la page blache ? Tu ne me connais pas, et pourtant, tu trouves que je mérite tes compliments. Pour moi, maintenant, la plus belle chose de ma journée, ça été de te parler. ;)\nxoxo",
      "name": "Masako 1-59",
      "pid": "45",
      "position": {
        "x": "1511",
        "y": "4358"
      }
    },
    {
      "text": "Je n’ai jamais imaginé l’avenir sans Alma.\nMême quand les médecins pensaient que c'était une maladie dégénérative. Heureusement, ce n'était pas ça.\nAmin, lui, s’est accroché au passé et s’est enfoui dans ses souvenirs parce qu’imaginer le futur le terrorisait. \nMaintenant ça va mieux. On arrive même à avoir des discussions sur nos futures vacances. On n’est toujours pas d’accord sur la destination, mais on avance, on avance ! =^.^=\n\n[[Et tu voudrais partir où ?|Masako 1-30]]",
      "links": [
        {
          "name": "Et tu voudrais partir où ?|Masako 1-30",
          "link": "Et tu voudrais partir où ?|Masako 1-30",
          "broken": true
        }
      ],
      "name": "Masako 1-29",
      "pid": "46",
      "position": {
        "x": "329",
        "y": "3197"
      }
    },
    {
      "text": "N'importe où, mais pas trop loin. \nJ'ai déjà fait beaucoup de grand voyages dans ma vie. Il est temps pour moi d'arrêter de prendre l'avion ! C'est l'occasion d'apprendre à voyager lentement et avoir le temps de découvrir les choses autour de chez moi. Je ne me rendais pas compte de toutes ces belles choses qu'il y a à voir autour de chez moi ! \\*_*/\n\n[[Tu trouves toujours une façon positive de voir les choses !|Masako 1-33]]",
      "links": [
        {
          "name": "Tu trouves toujours une façon positive de voir les choses !|Masako 1-33",
          "link": "Tu trouves toujours une façon positive de voir les choses !|Masako 1-33",
          "broken": true
        }
      ],
      "name": "Masako 1-30",
      "pid": "47",
      "position": {
        "x": "329",
        "y": "3374"
      }
    },
    {
      "text": "J’ai fait le choix d’être optimiste il y a très longtemps. \nJe crois que je peux changer ce qu’il y a autour de moi en mieux. Et je fais ce qu'il faut pour le faire ! C’est ça où je tombe comme un château de cartes. \nAmin dit : « le jour où tu es fatiguée, le monde s’effondre ». Je crois qu’il voit mes épaules un peu plus larges qu’elles ne sont. ^ç.ç^\n\n[[J'ai l'impression qu'il n'a pas tout à fait tord.|Masako 1-34]]",
      "links": [
        {
          "name": "J'ai l'impression qu'il n'a pas tout à fait tord.|Masako 1-34",
          "link": "J'ai l'impression qu'il n'a pas tout à fait tord.|Masako 1-34",
          "broken": true
        }
      ],
      "name": "Masako 1-33",
      "pid": "48",
      "position": {
        "x": "413",
        "y": "3689"
      }
    },
    {
      "text": "Hihi ! Tu exagères ! (Merci <3)",
      "name": "Masako 1-34",
      "pid": "49",
      "position": {
        "x": "361",
        "y": "4351"
      }
    },
    {
      "text": "Hihi, tu sais, moi ce ne sont pas les enfants qui me font craquer !\n\n[[Mais les inconnus ?|Masako 1-68]]",
      "links": [
        {
          "name": "Mais les inconnus ?|Masako 1-68",
          "link": "Mais les inconnus ?|Masako 1-68",
          "broken": true
        }
      ],
      "name": "Masako 1-67",
      "pid": "50",
      "position": {
        "x": "1833",
        "y": "4006"
      }
    },
    {
      "text": "Exatement ! ;)",
      "name": "Masako 1-68",
      "pid": "51",
      "position": {
        "x": "1828",
        "y": "4359"
      }
    },
    {
      "text": "Tu vois, ça fait déjà une bonne chose dans ta journée !\n\n[[T'es pas juste optimiste : t'es furieusement optimiste, en fait !|Masako 1-39]]",
      "links": [
        {
          "name": "T'es pas juste optimiste : t'es furieusement optimiste, en fait !|Masako 1-39",
          "link": "T'es pas juste optimiste : t'es furieusement optimiste, en fait !|Masako 1-39",
          "broken": true
        }
      ],
      "name": "Masako 1-38",
      "pid": "52",
      "position": {
        "x": "1168",
        "y": "3858"
      }
    },
    {
      "text": "Hihi, c'est ce que dit mon mari. Moi je crois que c'est ça, ou alors je m'effondre comme un chateau de carte. \n\n[[Un joli chateau !|Masako 1-40]]",
      "links": [
        {
          "name": "Un joli chateau !|Masako 1-40",
          "link": "Un joli chateau !|Masako 1-40",
          "broken": true
        }
      ],
      "name": "Masako 1-39",
      "pid": "53",
      "position": {
        "x": "1164",
        "y": "4079"
      }
    },
    {
      "text": "Le plus beau chateau du monde ! :D\n\n<3",
      "name": "Masako 1-40",
      "pid": "54",
      "position": {
        "x": "1200",
        "y": "4358"
      }
    },
    {
      "text": "Tu n'aimes pas rencontrer de nouvelles personnes ? \nTu n'a jamais envie d'être comme une page blanche, d'être comme parfaitement inconnu ? De pouvoir comme t'inventer une nouvelle vie ?\n\n[[Ce n'est pas un jeu qui m'amuse|Masako 1-61]]\n[[Je n'avais jamais envisagé ça comme ça...|Masako 1-60]]",
      "links": [
        {
          "name": "Ce n'est pas un jeu qui m'amuse|Masako 1-61",
          "link": "Ce n'est pas un jeu qui m'amuse|Masako 1-61",
          "broken": true
        },
        {
          "name": "Je n'avais jamais envisagé ça comme ça...|Masako 1-60",
          "link": "Je n'avais jamais envisagé ça comme ça...|Masako 1-60",
          "broken": true
        }
      ],
      "name": "Masako 1-53",
      "pid": "55",
      "position": {
        "x": "1781",
        "y": "2697"
      }
    },
    {
      "text": "Et bien moi, je suis joueuse. ;) \nJ'aime ce que je ressens quand je rencontre de nouvelles personnes. Parfois, c'est comme si j'étais accro ou quelque chose comme ça. \nJ'aime être une page blanche. J'aime le moment où tu ne sais pas que j'ai un enfant et un mari. \nParfois, j'ai l'impression qu'on est tout seul dans une pièce avec la lumière éteinte et qu'on chuchote des confidences dans le noir. \n\n[[Et bien quitte à être enfermé dans le noir avec des gens, je préfère que ce soit des personnes que je connaisse !|Masako 1-73]]\n[[C'est beaucoup trop intime pour moi !|Masako 1-62]]",
      "links": [
        {
          "name": "Et bien quitte à être enfermé dans le noir avec des gens, je préfère que ce soit des personnes que je connaisse !|Masako 1-73",
          "link": "Et bien quitte à être enfermé dans le noir avec des gens, je préfère que ce soit des personnes que je connaisse !|Masako 1-73",
          "broken": true
        },
        {
          "name": "C'est beaucoup trop intime pour moi !|Masako 1-62",
          "link": "C'est beaucoup trop intime pour moi !|Masako 1-62",
          "broken": true
        }
      ],
      "name": "Masako 1-61",
      "pid": "56",
      "position": {
        "x": "2200",
        "y": "3119"
      }
    },
    {
      "text": "T'inquiète pas, je te forcerais pas à apprendre à me connaître ! ",
      "name": "Masako 1-73",
      "pid": "57",
      "position": {
        "x": "2687",
        "y": "4351"
      }
    },
    {
      "text": "Désolée, je ne veux pas te bousculer ! Je t'explique juste comment je peux ressentire les choses.\n\n[[T'as l'air super intense...|Masako 1-63]]",
      "links": [
        {
          "name": "T'as l'air super intense...|Masako 1-63",
          "link": "T'as l'air super intense...|Masako 1-63",
          "broken": true
        }
      ],
      "name": "Masako 1-62",
      "pid": "58",
      "position": {
        "x": "2165",
        "y": "3281"
      }
    },
    {
      "text": "C'est un défaut ?\n\n[[Non :) Ca fait de toi quelqu'un d'intéressant. |Masako 1-59]]\n[[Ca peut faire un peu peur|Masako 1-64]]",
      "links": [
        {
          "name": "Non :) Ca fait de toi quelqu'un d'intéressant. |Masako 1-59",
          "link": "Non :) Ca fait de toi quelqu'un d'intéressant. |Masako 1-59",
          "broken": true
        },
        {
          "name": "Ca peut faire un peu peur|Masako 1-64",
          "link": "Ca peut faire un peu peur|Masako 1-64",
          "broken": true
        }
      ],
      "name": "Masako 1-63",
      "pid": "59",
      "position": {
        "x": "2152",
        "y": "3427"
      }
    },
    {
      "text": "Hihi, c'est exactement ce que m'a dit Amin la première fois qu'on s'est parlé. ^.^ \nSix mois plus tard, on s'est mariés. :D\n\n[[Moi je suis juste là pour jouer…|Masako 1-65]]\n[[Ha oui, avec toi, tout est toujours super intense !|Masako 1-72]]",
      "links": [
        {
          "name": "Moi je suis juste là pour jouer…|Masako 1-65",
          "link": "Moi je suis juste là pour jouer…|Masako 1-65",
          "broken": true
        },
        {
          "name": "Ha oui, avec toi, tout est toujours super intense !|Masako 1-72",
          "link": "Ha oui, avec toi, tout est toujours super intense !|Masako 1-72",
          "broken": true
        }
      ],
      "name": "Masako 1-64",
      "pid": "60",
      "position": {
        "x": "2149",
        "y": "3581"
      }
    },
    {
      "text": "Toujours ! ^.^",
      "name": "Masako 1-72",
      "pid": "61",
      "position": {
        "x": "2561",
        "y": "4351"
      }
    },
    {
      "text": "^.^",
      "name": "Masako 1-70",
      "pid": "62",
      "position": {
        "x": "2049",
        "y": "4362"
      }
    }
  ],
  "name": "Masako",
  "startnode": "1",
  "creator": "Twine",
  "creator-version": "2.3.14",
  "ifid": "B4AC9FC0-1876-4003-918B-95D60CBAA726"
}

