[
  {
    "playerName": "Amin",
    "message": "… Quééé ?"
  },
  {
    "playerName": "Ángel",
    "message": "Nos equivocamos de chat ?"
  },
  {
    "playerName": "Luca",
    "message": "¿Es un chiste?"
  },
  {
    "playerName": "Harriet",
    "message": "Pero si me la'pasé toda la tarde tratando de entender su jueguito bobo !"
  },
  {
    "playerName": "Armande",
    "message": "Alguien me explica? "
  },
  {
    "playerName": "Kelci",
    "message": "><"
  },
  {
    "playerName": "Sven",
    "message": "No chévere"
  },
  {
    "playerName": "Kevin",
    "message": "No entiendo un pito"
  },
  {
    "playerName": "Nina",
    "message": "Pero en donde está Blaze ?"
  },
  {
    "playerName": "Sven",
    "message": "Hay un código escondido?"
  },
  {
    "playerName": "Maruca",
    "message": "Naaahhh "
  },
  {
    "playerName": "Trevor",
    "message": "Es una broma??!!!"
  },
  {
    "playerName": "Kelci",
    "message": "GG"
  },
  {
    "playerName": "Claire",
    "message": "Pero los moderadores qué se hicieron?"
  },
  {
    "playerName": "JoNell",
    "message": "A ver qué sacan como excusa mala esta vez"
  },
  {
    "playerName": "Luca",
    "message": "Osea les valemos tres"
  },
  {
    "playerName": "Mehdi",
    "message": "ahi estan pintados, con ese kuento de la venta ahora se creyeron puessss"
  },
  {
    "playerName": "Armande",
    "message": "Quería ver a Gao, en verdad...   ’’’’’’’’’’("
  },
  {
    "playerName": "Alex",
    "message": "Pero estoy segura que debe haber una explicación :)",
    "isAlex": true
  },
  {
    "playerName": "Luca",
    "message": "Ay miren quién llegó, Alex, la lambona del estudioo…"
  },
  {
    "playerName": "Ajay",
    "message": "No pero sin joder Alex, no es la primera vez que pasa una vaina así."
  },
  {
    "playerName": "Armande",
    "message": "Qué mamera !"
  },
  {
    "playerName": "Karima",
    "message": "Siempre nos dicen que nos calmemos, pero es como si nos hubieran visto cara de pendejos"
  },
  {
    "playerName": "Nina",
    "message": "Pero qué se hizo Blaze ?"
  },
  {
    "playerName": "JoNell",
    "message": "Nos está mamando gallo"
  },
  {
    "playerName": "Harriet",
    "message": "Gao ya no es como antes..."
  },
  {
    "playerName": "Célia",
    "message": "Al Blaze le vale ahora q se volvió rico vendiendo sus jueguitos"
  },
  {
    "playerName": "Alex",
    "message": "No pero estoy segura que Blaze no nos dejaría botados así  ! :)",
    "isAlex": true
  },
  {
    "playerName": "Amin",
    "message": "Pero pk SIEMPRE lo difiendes ?"
  },
  {
    "playerName": "Sven",
    "message": "Total "
  },
  {
    "playerName": "Rokaya",
    "message": "Pero k tienen uds?"
  },
  {
    "playerName": "Nina",
    "message": "Q s hizo blaze"
  },
  {
    "playerName": "JoNell",
    "message": "Siempre los mismos defendiendo la transparencia y a final..."
  },
  {
    "playerName": "Harriet",
    "message": "Tienes acciones del Studio ? Te van a dar un resto de platika cuando lo vendan?"
  },
  {
    "playerName": "Juan",
    "message": "pucha"
  },
  {
    "playerName": "Kelci",
    "message": "><"
  },
  {
    "playerName": "Alex",
    "message": "Pero qué les pasa !",
    "isAlex": true
  },
  {
    "playerName": "Harriet",
    "message": "La verdad es que aburres a todo el mundo Alex"
  },
  {
    "playerName": "Luca",
    "message": "Si suena feo pero es la pura verdad"
  },
  {
    "playerName": "Kelci",
    "message": "+1"
  },
  {
    "playerName": "Mehdi",
    "message": "+1"
  },
  {
    "playerName": "Joueur",
    "message": [
      {
        "displayed": "[No decir nada]",
        "show": false
      },
      {
        "displayed": "ey ya, déjenla tranquila !",
        "show": true
      }
    ],
    "isMe": true
  },
  {
    "playerName": "Luca",
    "message": "Nadie te preguntó"
  },
  {
    "playerName": "JoNell",
    "message": "No sabes nada"
  },
  {
    "playerName": "Harriet",
    "message": "Ay los chiquis miran y aprenden, no opinan"
  },
  {
    "playerName": "Célia",
    "message": "y se callan"
  },
  {
    "playerName": "Mehdi",
    "message": "No sirves pa na"
  },
  {
    "playerName": "JoNell",
    "message": "pero callate"
  },
  {
    "playerName": "Alex",
    "message": "Pero se enloquecieron? Hay un problema y luego una solución",
    "isAlex": true
  },
  {
    "playerName": "Harriet",
    "message": "« Hay un problema y luego una solución » → y luego vienes a decir que no trabajas para el Estudio?"
  },
  {
    "playerName": "Luca",
    "message": "Por fin dice quién es"
  },
  {
    "playerName": "Ajay",
    "message": "no pues gran sorpresa!"
  },
  {
    "playerName": "Joueur",
    "message": [
      {
        "displayed": "[No decir nada]",
        "show": false
      },
      {
        "displayed": "Pero uds saben que ella no trabaja para el estudio !",
        "show": true
      }
    ],
    "isMe": true
  },
  {
    "playerName": "JoNell",
    "message": "Perdon? Alguien dijo algo? Oigo un ruidito"
  },
  {
    "playerName": "Harriet",
    "message": "Creo que un chiqui está llorando"
  },
  {
    "playerName": "Luca",
    "message": "a kien le vale?"
  },
  {
    "playerName": "Juan",
    "message": "+1"
  },
  {
    "playerName": "Kelci",
    "message": "+1"
  },
  {
    "playerName": "JoNell",
    "message": " aplaaauuuso"
  },
  {
    "playerName": "Mehdi",
    "message": "+1"
  },
  {
    "playerName": "Nina",
    "message": "donde está Blaze"
  },
  {
    "playerName": "Harriet",
    "message": "Alex siempre rodeada de sus perritos falderos"
  },
  {
    "playerName": "Luca",
    "message": "Pues es para cambiar porque de costumbre es ella la k tiene su correita !"
  },
  {
    "playerName": "Mehdi",
    "message": "Pucha"
  },
  {
    "playerName": "Kelci",
    "message": "LOL"
  },
  {
    "playerName": "Alex",
    "message": "No pero se pasan, los voy a denunciar a los moderadores",
    "isAlex": true
  },
  {
    "playerName": "JoNell",
    "message": "De cuando aka tienes derechos?"
  },
  {
    "playerName": "Harriet",
    "message": "Q descaro"
  },
  {
    "playerName": "Luca",
    "message": "No pues dale, suprime mi cuenta y todo, así te sentirás poderosa y te sentará bien"
  },
  {
    "playerName": "Juan",
    "message": "Ella tiene derechos en el chat?"
  },
  {
    "playerName": "Harriet",
    "message": "…"
  },
  {
    "playerName": "Luca",
    "message": "puuues aka sigo asi q no creo"
  },
  {
    "playerName": "Harriet",
    "message": "asi es siempre, los mismos con las mismas, se las dan de mandoncitos y al final..."
  },
  {
    "playerName": "Sven",
    "message": "lastima que no tengan el nivel"
  },
  {
    "playerName": "Luca",
    "message": "Ay pobre Alex perseguida por los jugadores malvados. A quien le vas a dar quejas? Donde esta Blaze para defenderte?"
  },
  {
    "playerName": "JoNell",
    "message": "Pues este es depronto el fin de Alex"
  },
  {
    "playerName": "Harriet",
    "message": "el fiiiin"
  },
  {
    "playerName": "Luca",
    "message": "Cada uno en su lugar"
  },
  {
    "playerName": "Sven",
    "message": "se lo merece"
  },
  {
    "playerName": "Nina",
    "message": "PERO DONDE ESTA BLAZE !!!!!?!"
  },
  {
    "playerName": "Alex",
    "message": "Alex se desconectó",
    "isAlex": true,
    "isItalic": true
  }
]
