{
  "enabled": 1,
  "hidden": false,
  "description": "TRACK jobsets",
  "nixexprinput": "src",
  "nixexprpath": "default.nix",
  "checkinterval": 300,
  "schedulingshares": 100,
  "enableemail": false,
  "emailoverride": "",
  "keepnr": 3,
  "inputs": {
    "meta": {
      "type": "git",
      "value": "ssh://git@gitlab.com/la-boussole/track-members/meta-track.git master",
      "emailresponsible": false
    },
    "src": {
      "type": "git",
      "value": "ssh://git@gitlab.com/la-boussole/track-members/track.git master",
      "emailresponsible": false
    },
    "nixpkgs": {
      "type": "git",
      "value": "git://github.com/NixOS/nixpkgs.git release-19.09",
      "emailresponsible": false
    }
  }
}
