

{
  "passages": [
    {
      "text": "@wait 60\n@init\nJe croyais que cette journée avait atteint le fond. Et bien toujours pas.\n@if(choiceHasBeenMade \"Ben out\")\nSol m’a annoncé que le job qu'elle m'avait promis n’est pas pour moi\n\n[[Pourquoi ?|Alex 11-1]]\n\n@else\nJ’ai eu une engueulade terrible avec Ben tout à l’heure.\nJe… je crois que c’est fini. A nouveau.\n\n[[Qu’est-ce qui s’est passé ?|Alex 11-20]]\n@endif",
      "links": [
        {
          "name": "Pourquoi ?|Alex 11-1",
          "link": "Pourquoi ?|Alex 11-1",
          "broken": true
        },
        {
          "name": "Qu’est-ce qui s’est passé ?|Alex 11-20",
          "link": "Qu’est-ce qui s’est passé ?|Alex 11-20",
          "broken": true
        }
      ],
      "name": "Alex-11",
      "pid": "5.1",
      "position": {
        "x": "618",
        "y": "439"
      }
    },
    {
      "text": "Je lui ai raconté le coup des dessins injurieux, il est devenu fou\nIl m’a dit que j’ai fait les mauvais choix, que je n’aurais pas du m’impliquer\nIl me reproche d’avoir mis la sécurité de notre enfant en jeu.\nCa m’a rendu folle de rage\nC’est à peine s’il sait changer une couche et il veut m’expliquer comment protéger un enfant !\nBref, il est reparti en menaçant de demander la garde parce que je serais nocive pour Ulysse\n\n[[Ca fait un an qu’il te laisse tout gérer. Ce sont des mots en l’air.|Alex 11-3]]\n[[Calme-toi|Alex 11-4]]",
      "links": [
        {
          "name": "Ca fait un an qu’il te laisse tout gérer. Ce sont des mots en l’air.|Alex 11-3",
          "link": "Ca fait un an qu’il te laisse tout gérer. Ce sont des mots en l’air.|Alex 11-3",
          "broken": true
        },
        {
          "name": "Calme-toi|Alex 11-4",
          "link": "Calme-toi|Alex 11-4",
          "broken": true
        }
      ],
      "name": "Alex 11-1",
      "pid": "5.2",
      "position": {
        "x": "295",
        "y": "608"
      }
    },
    {
      "text": "Parce que pour travailler avec Sol il faudrait que je bosse avec la communauté des joueurs de Gao et que maintenant, ils me détestent… \nEt j’ai déjà donné ma démission à mon ancien boulot. Il faudrait que je retourne voir mon manager que je lui dise que finalement je voudrais rester, mais je ne suis pas en état. J’ai la boule au ventre.\n\n[[Ca va aller…|Alex 11-21]]\n",
      "links": [
        {
          "name": "Ca va aller…|Alex 11-21",
          "link": "Ca va aller…|Alex 11-21",
          "broken": true
        }
      ],
      "name": "Alex 11-20",
      "pid": "5.3",
      "position": {
        "x": "1090",
        "y": "579"
      }
    },
    {
      "text": "Haha\nJ’aimerai te croire\nMais c’est une vraie tête de mule.\nTout ce que je voulais, c’est qu’il me soutienne et qu’il m’aide.\nA nouveau, je suis toute seule.\n\n[[Je suis là, moi|Alex 11-5]]",
      "links": [
        {
          "name": "Je suis là, moi|Alex 11-5",
          "link": "Je suis là, moi|Alex 11-5",
          "broken": true
        }
      ],
      "name": "Alex 11-3",
      "pid": "5.4",
      "position": {
        "x": "220",
        "y": "758"
      },
      "tags": [
        "emoji-coeur-brisé"
      ]
    },
    {
      "text": "J’essaie figure-toi ! J’essaie depuis une heure !\nMais si je me calme\nSi j’arrête d’être en colère\nIl me reste quoi ?\nA part la peur\nOu une vague de tristesse qui va me fracasser la tête \nInsert :gif coeur brisé ou sadness :\n\n[[Qu’est-ce qui te ferait du bien ?|Alex 11-6]]",
      "links": [
        {
          "name": "Qu’est-ce qui te ferait du bien ?|Alex 11-6",
          "link": "Qu’est-ce qui te ferait du bien ?|Alex 11-6",
          "broken": true
        }
      ],
      "name": "Alex 11-4",
      "pid": "5.5",
      "position": {
        "x": "370",
        "y": "758"
      },
      "tags": [
        "emoji-coeur-brisé"
      ]
    },
    {
      "text": "Oui, pardon. Merci pour tout. <3\nJe suis un peu à bout.\n\n[[Qu’est-ce qui te ferait du bien ?|Alex 11-6]]",
      "links": [
        {
          "name": "Qu’est-ce qui te ferait du bien ?|Alex 11-6",
          "link": "Qu’est-ce qui te ferait du bien ?|Alex 11-6",
          "broken": true
        }
      ],
      "name": "Alex 11-5",
      "pid": "5.6",
      "position": {
        "x": "220",
        "y": "908"
      }
    },
    {
      "text": "Mettre un gros taquet aux minables qui me harcèlent.\nCa, ça me ferait vraiment du bien\nMais c'est pas simple parce que j’ai besoin de connaître leur véritable identité. Je ne peux pas porter plainte contre « SuperBob ». Si j’avais  leurs vrais noms, j’aurais au moins l'espoir que la police puisse faire quelque chose.\n\n[[Tout ça nous ramène encore à Ally…|Alex 11-7]]",
      "links": [
        {
          "name": "Tout ça nous ramène encore à Ally…|Alex 11-7",
          "link": "Tout ça nous ramène encore à Ally…|Alex 11-7",
          "broken": true
        }
      ],
      "name": "Alex 11-6",
      "pid": "5.7",
      "position": {
        "x": "293",
        "y": "1283"
      }
    },
    {
      "text": "Je sais…\n\n[[Je sais que tu vas être contre, mais elle propose un marché|Alex 11-8]]",
      "links": [
        {
          "name": "Je sais que tu vas être contre, mais elle propose un marché|Alex 11-8",
          "link": "Je sais que tu vas être contre, mais elle propose un marché|Alex 11-8",
          "broken": true
        }
      ],
      "name": "Alex 11-7",
      "pid": "5.8",
      "position": {
        "x": "305",
        "y": "1441"
      }
    },
    {
      "text": "Quel genre de marché ?\n\n[[Elle te donne les noms, mais tu renonces à toute action contre le Studio|Alex 11-9]]",
      "links": [
        {
          "name": "Elle te donne les noms, mais tu renonces à toute action contre le Studio|Alex 11-9",
          "link": "Elle te donne les noms, mais tu renonces à toute action contre le Studio|Alex 11-9",
          "broken": true
        }
      ],
      "name": "Alex 11-8",
      "pid": "5.9",
      "position": {
        "x": "293",
        "y": "1583"
      }
    },
    {
      "text": "Non, ca va pas aller et tu le sais très bien !\nCe mec n’a pas de vie et il estime que tous ses collègues devraient être dévoués corps et âmes à son entreprise.\nAlors moi qui ai annoncé que je partais… C’est foutu... :(\n\n[[Qu'est-ce que tu vas faire ?|Alex 11-22]]\n[[De toute façon, t'avais pas envie de rester, non ?|Alex 11-23]]",
      "links": [
        {
          "name": "Qu'est-ce que tu vas faire ?|Alex 11-22",
          "link": "Qu'est-ce que tu vas faire ?|Alex 11-22",
          "broken": true
        },
        {
          "name": "De toute façon, t'avais pas envie de rester, non ?|Alex 11-23",
          "link": "De toute façon, t'avais pas envie de rester, non ?|Alex 11-23",
          "broken": true
        }
      ],
      "name": "Alex 11-21",
      "pid": "5.10",
      "position": {
        "x": "1090",
        "y": "728"
      }
    },
    {
      "text": "Je ne sais pas. Retourner vivre chez mes parents ? Avec mon fils ? :gif larmes :\nJ’ai déjà essayé de trouver du travail ailleurs et je n’y arrive pas.\nCa, plus les messages d’insultes, c’est un peu trop pour une personne.\nDu coup, je ne sais plus si je dois porter plainte. C'est peut-être pas la chose la plus intelligente à faire. Ca va juste mettre de l’huile sur le feu et ça va me nuire à long terme. Je vais finir par me griller définitivement.\n\n@if(choiceHasBeenMade \"Ally 3b-40\")[[Ca va se calmer. Je fais tout ce qu’il faut pour.|Alex 11-24]]\n\n@else[[Cette plainte aboutira à quelque chose de positif ?|Alex 11-25]]\n\n@endif\n",
      "links": [
        {
          "name": "Ca va se calmer. Je fais tout ce qu’il faut pour.|Alex 11-24",
          "link": "Ca va se calmer. Je fais tout ce qu’il faut pour.|Alex 11-24",
          "broken": true
        },
        {
          "name": "Cette plainte aboutira à quelque chose de positif ?|Alex 11-25",
          "link": "Cette plainte aboutira à quelque chose de positif ?|Alex 11-25",
          "broken": true
        }
      ],
      "name": "Alex 11-22",
      "pid": "5.11",
      "position": {
        "x": "1053",
        "y": "1084"
      },
      "tags": [
        "emoji-larmes",
        "joueur-pro-ou-anti-studio"
      ]
    },
    {
      "text": "Bien sur que je veux partir ! J'ai respiré librement pendant quelques heures et j'ai l'impression qu'on vient de refermer les portes de la cage.\n\n[[C'est peut-être l'occasion malgré tout ?|Alex 11-22]]",
      "links": [
        {
          "name": "C'est peut-être l'occasion malgré tout ?|Alex 11-22",
          "link": "C'est peut-être l'occasion malgré tout ?|Alex 11-22",
          "broken": true
        }
      ],
      "name": "Alex 11-23",
      "pid": "5.12",
      "position": {
        "x": "1165",
        "y": "878"
      }
    },
    {
      "text": "Comment ça ?\n\n[[Ally va faire ce qu'il faut pour que le harcèlement cesse|Alex 11-26]]",
      "links": [
        {
          "name": "Ally va faire ce qu'il faut pour que le harcèlement cesse|Alex 11-26",
          "link": "Ally va faire ce qu'il faut pour que le harcèlement cesse|Alex 11-26",
          "broken": true
        }
      ],
      "name": "Alex 11-24",
      "pid": "5.13",
      "position": {
        "x": "1288",
        "y": "1275"
      }
    },
    {
      "text": "Je ne sais pas. Il me faut le vrai nom de mes harceleurs pour que je puisse porter plainte. Les policiers ont besoin de quelque chose de plus consistant que le pseudo \"NotAllTroll_95\".\n\n[[Tout ça nous ramène encore à Ally…|Alex 11-7]]",
      "links": [
        {
          "name": "Tout ça nous ramène encore à Ally…|Alex 11-7",
          "link": "Tout ça nous ramène encore à Ally…|Alex 11-7",
          "broken": true
        }
      ],
      "name": "Alex 11-25",
      "pid": "5.14",
      "position": {
        "x": "790",
        "y": "1249"
      }
    },
    {
      "text": "Mais c’est le Studio qui a filé mes données personnelles à ces harceleurs ! Et elle est prête à les lâcher comme ça… Elle est vraiment sans scrupules.\n\n[[Oui, et elle n’a pas encore montré de tout ce dont elle est capable|Alex 11-10]]",
      "links": [
        {
          "name": "Oui, et elle n’a pas encore montré de tout ce dont elle est capable|Alex 11-10",
          "link": "Oui, et elle n’a pas encore montré de tout ce dont elle est capable|Alex 11-10",
          "broken": true
        }
      ],
      "name": "Alex 11-9",
      "pid": "5.15",
      "position": {
        "x": "294",
        "y": "1733"
      }
    },
    {
      "text": "Tu me fais peur. Qu’est-ce qu’elle a encore en réserve ?\n\n[[Tout ce qu’il y a à savoir sur toi|Alex 11-11]]",
      "links": [
        {
          "name": "Tout ce qu’il y a à savoir sur toi|Alex 11-11",
          "link": "Tout ce qu’il y a à savoir sur toi|Alex 11-11",
          "broken": true
        }
      ],
      "name": "Alex 11-10",
      "pid": "5.16",
      "position": {
        "x": "293",
        "y": "1883"
      }
    },
    {
      "text": "C'est vague. De toute façon, qu’est-ce qu’elle pourrait faire de plus que maintenant ?\n\n@if(choiceHasBeenMade \"Ben out\")\n[[Elle a toute tes conversations privées. Imagine les dégats sur ta vie professionnelle juste avec ça|Alex 11-12]]\n\n@else\n[[Elle pourrait donner des éléments à Ben pour que tu passes pour une mauvaise mère. Et vu que la garde est en jeu...|Alex 11-12]]\n@endif",
      "links": [
        {
          "name": "Elle a toute tes conversations privées. Imagine les dégats sur ta vie professionnelle juste avec ça|Alex 11-12",
          "link": "Elle a toute tes conversations privées. Imagine les dégats sur ta vie professionnelle juste avec ça|Alex 11-12",
          "broken": true
        },
        {
          "name": "Elle pourrait donner des éléments à Ben pour que tu passes pour une mauvaise mère. Et vu que la garde est en jeu...|Alex 11-12",
          "link": "Elle pourrait donner des éléments à Ben pour que tu passes pour une mauvaise mère. Et vu que la garde est en jeu...|Alex 11-12",
          "broken": true
        }
      ],
      "name": "Alex 11-11",
      "pid": "5.17",
      "position": {
        "x": "293",
        "y": "2033"
      }
    },
    {
      "text": "… J’ai envie de pleurer. Comment est-ce que je peux lutter contre ça…\n\n[[On peut utiliser les informations de l’appli contre elle|Alex 11-13]]\n",
      "links": [
        {
          "name": "On peut utiliser les informations de l’appli contre elle|Alex 11-13",
          "link": "On peut utiliser les informations de l’appli contre elle|Alex 11-13",
          "broken": true
        }
      ],
      "name": "Alex 11-12",
      "pid": "5.18",
      "position": {
        "x": "293",
        "y": "2183"
      }
    },
    {
      "text": "De quelle façon ?\n\n[[En jouant collectif. En ralliant à ta cause les autres membres de Gao Games. Ils sont concernés également. On monte un dossier solide contre le Studio|Alex 11-14]]\n",
      "links": [
        {
          "name": "En jouant collectif. En ralliant à ta cause les autres membres de Gao Games. Ils sont concernés également. On monte un dossier solide contre le Studio|Alex 11-14",
          "link": "En jouant collectif. En ralliant à ta cause les autres membres de Gao Games. Ils sont concernés également. On monte un dossier solide contre le Studio|Alex 11-14",
          "broken": true
        }
      ],
      "name": "Alex 11-13",
      "pid": "5.19",
      "position": {
        "x": "293",
        "y": "2333"
      }
    },
    {
      "text": "Nikki me dit la même chose, que les gens du Studio sont allés tellement loin dans l’exploitation des données qu’ils risquent gros face à la justice. D’un autre côté, ils sont riches et puissants. Ils auront les bons avocats et cette histoire mettra des années avant d’être réglée.\n\n[[Si Ally est aussi agressive, c’est qu’elle a beaucoup à perdre|Alex 11-15]]",
      "links": [
        {
          "name": "Si Ally est aussi agressive, c’est qu’elle a beaucoup à perdre|Alex 11-15",
          "link": "Si Ally est aussi agressive, c’est qu’elle a beaucoup à perdre|Alex 11-15",
          "broken": true
        }
      ],
      "name": "Alex 11-14",
      "pid": "5.20",
      "position": {
        "x": "293",
        "y": "2483"
      }
    },
    {
      "text": "Tu penses que les autres joueurs seront prêts à suivre quand ils découvriront ce que le Studio a fait avec leurs données personnelles et l’impact que ça a sur leur vie ?\n\n[[Peut-être pas tous, mais il suffit que vous soyez quelques uns pour que l’action prenne de l’ampleur|Alex 11-16]]",
      "links": [
        {
          "name": "Peut-être pas tous, mais il suffit que vous soyez quelques uns pour que l’action prenne de l’ampleur|Alex 11-16",
          "link": "Peut-être pas tous, mais il suffit que vous soyez quelques uns pour que l’action prenne de l’ampleur|Alex 11-16",
          "broken": true
        }
      ],
      "name": "Alex 11-15",
      "pid": "5.21",
      "position": {
        "x": "289",
        "y": "2633"
      }
    },
    {
      "text": "J’ai l’impression de porter un poids trop grand pour mes épaules\nSoit je me bats pour moi, je prends l’argent du Studio et je me tais. Soit je me bats pour tout le monde, sans certitude du résultat.\n\n@if(choiceHasBeenMade \"Alex 11-26\")\n[[Tu n’es pas toute seule Alex. Et c’est pour ça que tu vas y arriver|Alex 11-17]]\n[[Tu as le droit de penser à toi.|Alex 11-17]]\n\n@else\n[[Tu n’es pas toute seule Alex. Et c’est pour ça que tu vas y arriver|Alex 11-17]]\n[[Tu as le droit de penser à toi.|Alex 11-17]]\n@showOnlyIfChoiceMade \"Ally 3b-40\" [[Ally propose un deal intéressant, tu sais|Alex 11-26]]\n\n@endif",
      "links": [
        {
          "name": "Tu n’es pas toute seule Alex. Et c’est pour ça que tu vas y arriver|Alex 11-17",
          "link": "Tu n’es pas toute seule Alex. Et c’est pour ça que tu vas y arriver|Alex 11-17",
          "broken": true
        },
        {
          "name": "Tu as le droit de penser à toi.|Alex 11-17",
          "link": "Tu as le droit de penser à toi.|Alex 11-17",
          "broken": true
        },
        {
          "name": "Tu n’es pas toute seule Alex. Et c’est pour ça que tu vas y arriver|Alex 11-17",
          "link": "Tu n’es pas toute seule Alex. Et c’est pour ça que tu vas y arriver|Alex 11-17",
          "broken": true
        },
        {
          "name": "Tu as le droit de penser à toi.|Alex 11-17",
          "link": "Tu as le droit de penser à toi.|Alex 11-17",
          "broken": true
        },
        {
          "name": "Ally propose un deal intéressant, tu sais|Alex 11-26",
          "link": "Ally propose un deal intéressant, tu sais|Alex 11-26",
          "broken": true
        }
      ],
      "name": "Alex 11-16",
      "pid": "5.22",
      "position": {
        "x": "291",
        "y": "2783"
      }
    },
    {
      "text": "Le temps presse. Il faut que je prenne une décision.",
      "name": "Alex 11-17",
      "pid": "5.23",
      "position": {
        "x": "210",
        "y": "4793"
      }
    },
    {
      "text": "Qu’est-ce que ça veut dire ?\n\n[[J’ai accepté sa proposition|Alex 11-27]]\n[[Ca veut dire qu’elle tient parole|Alex 11-27]]",
      "links": [
        {
          "name": "J’ai accepté sa proposition|Alex 11-27",
          "link": "J’ai accepté sa proposition|Alex 11-27",
          "broken": true
        },
        {
          "name": "Ca veut dire qu’elle tient parole|Alex 11-27",
          "link": "Ca veut dire qu’elle tient parole|Alex 11-27",
          "broken": true
        }
      ],
      "name": "Alex 11-26",
      "pid": "5.24",
      "position": {
        "x": "1460",
        "y": "3085"
      }
    },
    {
      "text": "Ok, super, tu m’as menti. Je t’avais dit que je ne voulais pas qu’elle soit mêlée à tout ça ! Je te faisais confiance !\n\n[[C’était pour t’aider…|Alex 11-28]]\n[[Ca veut dire qu’elle tient parole !|Alex 11-29]]\n",
      "links": [
        {
          "name": "C’était pour t’aider…|Alex 11-28",
          "link": "C’était pour t’aider…|Alex 11-28",
          "broken": true
        },
        {
          "name": "Ca veut dire qu’elle tient parole !|Alex 11-29",
          "link": "Ca veut dire qu’elle tient parole !|Alex 11-29",
          "broken": true
        }
      ],
      "name": "Alex 11-27",
      "pid": "5.25",
      "position": {
        "x": "1460",
        "y": "3235"
      }
    },
    {
      "text": "Pour m'aider sans me demander mon avis !?! Je suis pas une putain de princesse !!!\nJe vais pas attendre que tu règles mes problèmes à ma place ! \nTu vois, là, JE prépare les éléments pour porter plainte ! Je vais aller au commissariat TOUTE SEULE ! J’ai pas besoin que tu agisses A MA PLACE SANS ME LE DIRE. J’ai besoin que tu sois franc avec moi ET QUE TU ME SOUTIENNES !\n\n[[Je m’excuse, je pensais pas à mal…|Alex 11-30]]\n@showOnlyIfChoiceMade \"Ally 3b-40\" [[Tu n'es pas de taille à l'affronter. Il faut accepter qu'elle est la plus forte|Alex 11-31]]",
      "links": [
        {
          "name": "Je m’excuse, je pensais pas à mal…|Alex 11-30",
          "link": "Je m’excuse, je pensais pas à mal…|Alex 11-30",
          "broken": true
        },
        {
          "name": "Tu n'es pas de taille à l'affronter. Il faut accepter qu'elle est la plus forte|Alex 11-31",
          "link": "Tu n'es pas de taille à l'affronter. Il faut accepter qu'elle est la plus forte|Alex 11-31",
          "broken": true
        }
      ],
      "name": "Alex 11-28",
      "pid": "5.26",
      "position": {
        "x": "1434",
        "y": "3544"
      }
    },
    {
      "text": "Elle tient parole comme toi tu tiens parole ? Vous faîte une belle équipe !\n\n[[C’était pour t’aider…|Alex 11-28]]",
      "links": [
        {
          "name": "C’était pour t’aider…|Alex 11-28",
          "link": "C’était pour t’aider…|Alex 11-28",
          "broken": true
        }
      ],
      "name": "Alex 11-29",
      "pid": "5.27",
      "position": {
        "x": "1602",
        "y": "3399"
      }
    },
    {
      "text": "Il faudrait commencer par penser tout court. Maintenant elle va considérer qu’on lui est redevable. Si je ne fais pas ce qu’elle dit, elle va s’acharner ! Merci, hein !\n\n[[Elle s’acharnera de toute façon…|Alex 11-31]]\n[[Je m’excuse. Vraiment.|Alex 11-32]]",
      "links": [
        {
          "name": "Elle s’acharnera de toute façon…|Alex 11-31",
          "link": "Elle s’acharnera de toute façon…|Alex 11-31",
          "broken": true
        },
        {
          "name": "Je m’excuse. Vraiment.|Alex 11-32",
          "link": "Je m’excuse. Vraiment.|Alex 11-32",
          "broken": true
        }
      ],
      "name": "Alex 11-30",
      "pid": "5.28",
      "position": {
        "x": "1439",
        "y": "3716"
      }
    },
    {
      "text": "Et alors !!! C’est une raison pour lui donner des armes supplémentaires ?\n\n[[Tu la vois comme une ennemie, mais elle peut être la solution|Alex 11-35]]\n[[C'est trop dangereux. Penses à toi, à ton fils... et à moi ! T'es pas toute seule dans cette galère, Alex ! |Alex 11-33]]",
      "links": [
        {
          "name": "Tu la vois comme une ennemie, mais elle peut être la solution|Alex 11-35",
          "link": "Tu la vois comme une ennemie, mais elle peut être la solution|Alex 11-35",
          "broken": true
        },
        {
          "name": "C'est trop dangereux. Penses à toi, à ton fils... et à moi ! T'es pas toute seule dans cette galère, Alex ! |Alex 11-33",
          "link": "C'est trop dangereux. Penses à toi, à ton fils... et à moi ! T'es pas toute seule dans cette galère, Alex ! |Alex 11-33",
          "broken": true
        }
      ],
      "name": "Alex 11-31",
      "pid": "5.29",
      "position": {
        "x": "1938",
        "y": "3814"
      }
    },
    {
      "text": "@wait 15\n...\n@if(choiceHasBeenMade \"Alex 11-7\")\nBlaze me laisse faire le sale boulot à sa place\nNikki regarde tout ça comme un jeu\nJe ne sais plus si je peux te faire confiance\n[[C'était un mauvais choix. Je ne cherche vraiment pas à te nuire|Alex 11-45]]\n\n@else\n[[Comment ça se présente cette plainte ?|Alex 11-34]]\n\n@endif",
      "links": [
        {
          "name": "C'était un mauvais choix. Je ne cherche vraiment pas à te nuire|Alex 11-45",
          "link": "C'était un mauvais choix. Je ne cherche vraiment pas à te nuire|Alex 11-45",
          "broken": true
        },
        {
          "name": "Comment ça se présente cette plainte ?|Alex 11-34",
          "link": "Comment ça se présente cette plainte ?|Alex 11-34",
          "broken": true
        }
      ],
      "name": "Alex 11-32",
      "pid": "5.30",
      "position": {
        "x": "1052",
        "y": "3914"
      }
    },
    {
      "text": "@wait 20\nMal. Comment veux-tu que ça se passe !? Je peux pas porter plainte contre les dizaines de personnes qui m’ont insultées sur le chat parce que ça prendrait trop de temps. Je ne peux pas porter plainte contre les 3-4 acharnés qui continuent à m’envoyer des mails parce que je n’ai que leurs pseudo. Il me faudrait leurs identités réelles. Et je ne vois pas à qui les demander. A part au Studio. \n\n[[Ca veut dire passer par Ally…|Alex 11-36]]",
      "links": [
        {
          "name": "Ca veut dire passer par Ally…|Alex 11-36",
          "link": "Ca veut dire passer par Ally…|Alex 11-36",
          "broken": true
        }
      ],
      "name": "Alex 11-34",
      "pid": "5.31",
      "position": {
        "x": "804",
        "y": "3422"
      }
    },
    {
      "text": "[[Je sais que tu vas être contre, mais elle propose un marché|Alex 11-8]]",
      "links": [
        {
          "name": "Je sais que tu vas être contre, mais elle propose un marché|Alex 11-8",
          "link": "Je sais que tu vas être contre, mais elle propose un marché|Alex 11-8",
          "broken": true
        }
      ],
      "name": "Alex 11-36",
      "pid": "5.32",
      "position": {
        "x": "728",
        "y": "2231"
      }
    },
    {
      "text": "Tu… Tu as peur ?\n\n[[Tu te rends pas compte de tout ce que le Studio a sur toi… Et sur moi!|Alex 11-39]]",
      "links": [
        {
          "name": "Tu te rends pas compte de tout ce que le Studio a sur toi… Et sur moi!|Alex 11-39",
          "link": "Tu te rends pas compte de tout ce que le Studio a sur toi… Et sur moi!|Alex 11-39",
          "broken": true
        }
      ],
      "name": "Alex 11-33",
      "pid": "5.33",
      "position": {
        "x": "1893",
        "y": "4112"
      }
    },
    {
      "text": "Ok. Elle t’a complètement retourné la tête. \n\n[[Elle propose des choses intéressantes|Alex 11-37]]\n[[Elle est trop forte. C’est perdu d’avance|Alex 11-33]]",
      "links": [
        {
          "name": "Elle propose des choses intéressantes|Alex 11-37",
          "link": "Elle propose des choses intéressantes|Alex 11-37",
          "broken": true
        },
        {
          "name": "Elle est trop forte. C’est perdu d’avance|Alex 11-33",
          "link": "Elle est trop forte. C’est perdu d’avance|Alex 11-33",
          "broken": true
        }
      ],
      "name": "Alex 11-35",
      "pid": "5.34",
      "position": {
        "x": "2058",
        "y": "3960"
      }
    },
    {
      "text": "Elle propose de l'argent, c'est ça ? Dis-moi, à combien tu estimes le prix d'une vie humaine de qualité ? Ou de seconde main, vu qu'on parle de la mienne ? Vaz-y, donne-moi ton prix au rabais !\n\n[[Je t'offre une porte de sortie. Si tu préfères restée pauvre et paumée, c'est ton choix|Alex 11-57]]\n[[Le prix de ton égo est supérieur à la tranquilité assurée pour la vie de ton fils ?|Alex 11-47]]",
      "links": [
        {
          "name": "Je t'offre une porte de sortie. Si tu préfères restée pauvre et paumée, c'est ton choix|Alex 11-57",
          "link": "Je t'offre une porte de sortie. Si tu préfères restée pauvre et paumée, c'est ton choix|Alex 11-57",
          "broken": true
        },
        {
          "name": "Le prix de ton égo est supérieur à la tranquilité assurée pour la vie de ton fils ?|Alex 11-47",
          "link": "Le prix de ton égo est supérieur à la tranquilité assurée pour la vie de ton fils ?|Alex 11-47",
          "broken": true
        }
      ],
      "name": "Alex 11-37",
      "pid": "5.35",
      "position": {
        "x": "2176",
        "y": "4111"
      }
    },
    {
      "text": "Attends, t’as vu tout ce qu’on a sur eux ?\nQuand les autres joueurs verrons la façon dont l’exploitation de leur profil a nui à leur vie, on ne sera plus tous seuls\nAlly est aussi agressive parce qu’elle a beaucoup à perdre.\nBeaucoup plus que moi.\n\n[[Elle a tout sur toi. Il te reste beaucoup plus à perdre que ce que tu crois.|Alex 11-40]]",
      "links": [
        {
          "name": "Elle a tout sur toi. Il te reste beaucoup plus à perdre que ce que tu crois.|Alex 11-40",
          "link": "Elle a tout sur toi. Il te reste beaucoup plus à perdre que ce que tu crois.|Alex 11-40",
          "broken": true
        }
      ],
      "name": "Alex 11-39",
      "pid": "5.36",
      "position": {
        "x": "1893",
        "y": "4262"
      }
    },
    {
      "text": "De toute façon, qu’est-ce qu’elle pourrait faire de plus que maintenant ?\n\n[[Elle a détruit ta vie professionnelle, elle pourrait également détruire ta vie privée|Alex 11-42]]",
      "links": [
        {
          "name": "Elle a détruit ta vie professionnelle, elle pourrait également détruire ta vie privée|Alex 11-42",
          "link": "Elle a détruit ta vie professionnelle, elle pourrait également détruire ta vie privée|Alex 11-42",
          "broken": true
        }
      ],
      "name": "Alex 11-40",
      "pid": "5.37",
      "position": {
        "x": "1893",
        "y": "4412"
      }
    },
    {
      "text": "Ca sonne comme une menace.\n\n[[Choisis le bon camp, Alex|Alex 11-43]]",
      "links": [
        {
          "name": "Choisis le bon camp, Alex|Alex 11-43",
          "link": "Choisis le bon camp, Alex|Alex 11-43",
          "broken": true
        }
      ],
      "name": "Alex 11-42",
      "pid": "5.38",
      "position": {
        "x": "1889",
        "y": "4562"
      }
    },
    {
      "text": "Double-click this passage to edit it. --",
      "name": "Alex 11-43",
      "pid": "5.39",
      "position": {
        "x": "1893",
        "y": "4784"
      }
    },
    {
      "text": "Je n'ai plus rien à te dire\n\n[[Ally peut alléger ton fardeau ou l'alourdir\nsi tu redeviens raisonnable, fais-nous signe|Alex 11-60]]",
      "name": "Alex 11-57",
      "pid": "5.40",
      "position": {
        "x": "2379",
        "y": "4773"
      }
    },
    {
      "text": "Au moins, les intentions d'Ally sont claires.\nje crois que je ne peux plus compter que sur moi-même.\nVoyons comment je me débrouille à ce jeu là.",
      "name": "Alex 11-45",
      "pid": "5.41",
      "position": {
        "x": "971",
        "y": "4796"
      }
    },
    {
      "text": "Arrête ça tout de suite !\n\n[[Je fais ça pour toi, Alex. Pour ton bien. Pense à ton fils.|Alex 11-42]]",
      "links": [
        {
          "name": "Je fais ça pour toi, Alex. Pour ton bien. Pense à ton fils.|Alex 11-42",
          "link": "Je fais ça pour toi, Alex. Pour ton bien. Pense à ton fils.|Alex 11-42",
          "broken": true
        }
      ],
      "name": "Alex 11-47",
      "pid": "5.42",
      "position": {
        "x": "2090",
        "y": "4396"
      }
    },
    {
      "text": "@wait 10\n@init\nWow\nC'est quoi cette app ?\nC’est quoi ce délire ?\n\n[[C’est une base de données sur les joueurs.|Heu… ok. Et ça sert à quoi ?]]\n[[Le trésor de guerre de Gao Games.|Heu… ok. Et ça sert à quoi ?]]",
      "links": [
        {
          "name": "C’est une base de données sur les joueurs.|Heu… ok. Et ça sert à quoi ?",
          "link": "C’est une base de données sur les joueurs.|Heu… ok. Et ça sert à quoi ?",
          "broken": true
        },
        {
          "name": "Le trésor de guerre de Gao Games.|Heu… ok. Et ça sert à quoi ?",
          "link": "Le trésor de guerre de Gao Games.|Heu… ok. Et ça sert à quoi ?",
          "broken": true
        }
      ],
      "name": "Alex 10",
      "pid": "1",
      "position": {
        "x": "2261",
        "y": "159"
      },
      "tags": [
        "show-only-if"
      ]
    },
    {
      "text": "Heu… ok. Et ça sert à quoi ?\n\n[[A récolter de l’info sur les joueurs.|Ok… On ne devrait pas du tout avoir accès à ces informations, non ? C’est genre super privé ?]]",
      "links": [
        {
          "name": "A récolter de l’info sur les joueurs.|Ok… On ne devrait pas du tout avoir accès à ces informations, non ? C’est genre super privé ?",
          "link": "A récolter de l’info sur les joueurs.|Ok… On ne devrait pas du tout avoir accès à ces informations, non ? C’est genre super privé ?",
          "broken": true
        }
      ],
      "name": "Heu… ok. Et ça sert à quoi ?",
      "pid": "2",
      "position": {
        "x": "2261",
        "y": "308"
      }
    },
    {
      "text": "Ok… On ne devrait pas du tout avoir accès à ces informations, non ? C’est genre super privé ?\n\n[[Exact|Ok… (la meuf qui sait pas quoi dire et qui dit ok à tout… ><). Je vois bien que c’est le moment d’avoir le cerveau disponible pour utiliser ça de façon brillante, mais avec tout ce qui se passe, j’ai la disponibilité d’esprit d’une loutre anxieuse.]]\n[[Blaze nous a donné accès à ces informations pour qu’on s’en serve|Ok… (la meuf qui sait pas quoi dire et qui dit ok à tout… ><). Je vois bien que c’est le moment d’avoir le cerveau disponible pour utiliser ça de façon brillante, mais avec tout ce qui se passe, j’ai la disponibilité d’esprit d’une loutre anxieuse.]]",
      "links": [
        {
          "name": "Exact|Ok… (la meuf qui sait pas quoi dire et qui dit ok à tout… ><). Je vois bien que c’est le moment d’avoir le cerveau disponible pour utiliser ça de façon brillante, mais avec tout ce qui se passe, j’ai la disponibilité d’esprit d’une loutre anxieuse.",
          "link": "Exact|Ok… (la meuf qui sait pas quoi dire et qui dit ok à tout… ><). Je vois bien que c’est le moment d’avoir le cerveau disponible pour utiliser ça de façon brillante, mais avec tout ce qui se passe, j’ai la disponibilité d’esprit d’une loutre anxieuse.",
          "broken": true
        },
        {
          "name": "Blaze nous a donné accès à ces informations pour qu’on s’en serve|Ok… (la meuf qui sait pas quoi dire et qui dit ok à tout… ><). Je vois bien que c’est le moment d’avoir le cerveau disponible pour utiliser ça de façon brillante, mais avec tout ce qui se passe, j’ai la disponibilité d’esprit d’une loutre anxieuse.",
          "link": "Blaze nous a donné accès à ces informations pour qu’on s’en serve|Ok… (la meuf qui sait pas quoi dire et qui dit ok à tout… ><). Je vois bien que c’est le moment d’avoir le cerveau disponible pour utiliser ça de façon brillante, mais avec tout ce qui se passe, j’ai la disponibilité d’esprit d’une loutre anxieuse.",
          "broken": true
        }
      ],
      "name": "Ok… On ne devrait pas du tout avoir accès à ces informations, non ? C’est genre super privé ?",
      "pid": "3",
      "position": {
        "x": "2261",
        "y": "459"
      }
    },
    {
      "text": "Ok… (la meuf qui sait pas quoi dire et qui dit ok à tout… ><). Je vois bien que c’est le moment d’avoir le cerveau disponible pour utiliser ça de façon brillante, mais avec tout ce qui se passe, j’ai la disponibilité d’esprit d’une loutre anxieuse.\n\n[[Une loutre anxieuse ?|C’est ma meilleure image. Je suis tel un animal mignon harcelé par un bouledogue (alors que je devrais figurer sur des vidéo choupettes et virales). Bref. Pas du tout dans mon élément et avec un taux de cortisol quasi létal.]]",
      "links": [
        {
          "name": "Une loutre anxieuse ?|C’est ma meilleure image. Je suis tel un animal mignon harcelé par un bouledogue (alors que je devrais figurer sur des vidéo choupettes et virales). Bref. Pas du tout dans mon élément et avec un taux de cortisol quasi létal.",
          "link": "Une loutre anxieuse ?|C’est ma meilleure image. Je suis tel un animal mignon harcelé par un bouledogue (alors que je devrais figurer sur des vidéo choupettes et virales). Bref. Pas du tout dans mon élément et avec un taux de cortisol quasi létal.",
          "broken": true
        }
      ],
      "name": "Ok… (la meuf qui sait pas quoi dire et qui dit ok à tout… ><). Je vois bien que c’est le moment d’avoir le cerveau disponible pour utiliser ça de façon brillante, mais avec tout ce qui se passe, j’ai la disponibilité d’esprit d’une loutre anxieuse.",
      "pid": "4",
      "position": {
        "x": "2261",
        "y": "609"
      }
    },
    {
      "text": "C’est ma meilleure image. Je suis tel un animal mignon harcelé par un bouledogue (alors que je devrais figurer sur des vidéo choupettes et virales). Bref. Pas du tout dans mon élément et avec un taux de cortisol quasi létal. \n\n[[C’est une bonne image|On en est à un point où je me demande si je ne vais pas porter plainte. Tu sais ce qui est en train de se passer ? Il y a un petit groupe de rageux qui s’est formé. Ils s’échangent des messages, des commentaires sur l’actualité de Gao Games et « des blagues ».]]\n[[Je vois...|On en est à un point où je me demande si je ne vais pas porter plainte. Tu sais ce qui est en train de se passer ? Il y a un petit groupe de rageux qui s’est formé. Ils s’échangent des messages, des commentaires sur l’actualité de Gao Games et « des blagues ».]]",
      "links": [
        {
          "name": "C’est une bonne image|On en est à un point où je me demande si je ne vais pas porter plainte. Tu sais ce qui est en train de se passer ? Il y a un petit groupe de rageux qui s’est formé. Ils s’échangent des messages, des commentaires sur l’actualité de Gao Games et « des blagues ».",
          "link": "C’est une bonne image|On en est à un point où je me demande si je ne vais pas porter plainte. Tu sais ce qui est en train de se passer ? Il y a un petit groupe de rageux qui s’est formé. Ils s’échangent des messages, des commentaires sur l’actualité de Gao Games et « des blagues ».",
          "broken": true
        },
        {
          "name": "Je vois...|On en est à un point où je me demande si je ne vais pas porter plainte. Tu sais ce qui est en train de se passer ? Il y a un petit groupe de rageux qui s’est formé. Ils s’échangent des messages, des commentaires sur l’actualité de Gao Games et « des blagues ».",
          "link": "Je vois...|On en est à un point où je me demande si je ne vais pas porter plainte. Tu sais ce qui est en train de se passer ? Il y a un petit groupe de rageux qui s’est formé. Ils s’échangent des messages, des commentaires sur l’actualité de Gao Games et « des blagues ».",
          "broken": true
        }
      ],
      "name": "C’est ma meilleure image. Je suis tel un animal mignon harcelé par un bouledogue (alors que je devrais figurer sur des vidéo choupettes et virales). Bref. Pas du tout dans mon élément et avec un taux de cortisol quasi létal.",
      "pid": "5",
      "position": {
        "x": "2258",
        "y": "778"
      }
    },
    {
      "text": "On en est à un point où je me demande si je ne vais pas porter plainte. Tu sais ce qui est en train de se passer ? Il y a un petit groupe de rageux qui s’est formé. Ils s’échangent des messages, des commentaires sur l’actualité de Gao Games et « des blagues ».\n\n[[ok|Chanceuse que je suis, j’ai pu voir leur dernières « créations ». Quelqu’un a publié des petits dessins injurieux qui montre « ma journée type » avec ma tête, mon nom, et pire que tout, une photo de MON FILS avec le nom de sa crèche !!! Je flippe en fait. J’ai envie de porter plainte parce que je ne peux pas laisser passer un truc pareil et en même temps j’ai peur que démarrer une action en justice ne fasse que les énerver plus !]]\n[[Tant que ça reste entre eux...|Chanceuse que je suis, j’ai pu voir leur dernières « créations ». Quelqu’un a publié des petits dessins injurieux qui montre « ma journée type » avec ma tête, mon nom, et pire que tout, une photo de MON FILS avec le nom de sa crèche !!! Je flippe en fait. J’ai envie de porter plainte parce que je ne peux pas laisser passer un truc pareil et en même temps j’ai peur que démarrer une action en justice ne fasse que les énerver plus !]]\n[[Comment t’es au courant de l’existence de ce groupe ?|Ils ont invité Nikki. Elle me transfère ce qu’elle voit passer. Il n’y a pas grand monde qui sait que nous sommes proches.]]\t",
      "links": [
        {
          "name": "ok|Chanceuse que je suis, j’ai pu voir leur dernières « créations ». Quelqu’un a publié des petits dessins injurieux qui montre « ma journée type » avec ma tête, mon nom, et pire que tout, une photo de MON FILS avec le nom de sa crèche !!! Je flippe en fait. J’ai envie de porter plainte parce que je ne peux pas laisser passer un truc pareil et en même temps j’ai peur que démarrer une action en justice ne fasse que les énerver plus !",
          "link": "ok|Chanceuse que je suis, j’ai pu voir leur dernières « créations ». Quelqu’un a publié des petits dessins injurieux qui montre « ma journée type » avec ma tête, mon nom, et pire que tout, une photo de MON FILS avec le nom de sa crèche !!! Je flippe en fait. J’ai envie de porter plainte parce que je ne peux pas laisser passer un truc pareil et en même temps j’ai peur que démarrer une action en justice ne fasse que les énerver plus !",
          "broken": true
        },
        {
          "name": "Tant que ça reste entre eux...|Chanceuse que je suis, j’ai pu voir leur dernières « créations ». Quelqu’un a publié des petits dessins injurieux qui montre « ma journée type » avec ma tête, mon nom, et pire que tout, une photo de MON FILS avec le nom de sa crèche !!! Je flippe en fait. J’ai envie de porter plainte parce que je ne peux pas laisser passer un truc pareil et en même temps j’ai peur que démarrer une action en justice ne fasse que les énerver plus !",
          "link": "Tant que ça reste entre eux...|Chanceuse que je suis, j’ai pu voir leur dernières « créations ». Quelqu’un a publié des petits dessins injurieux qui montre « ma journée type » avec ma tête, mon nom, et pire que tout, une photo de MON FILS avec le nom de sa crèche !!! Je flippe en fait. J’ai envie de porter plainte parce que je ne peux pas laisser passer un truc pareil et en même temps j’ai peur que démarrer une action en justice ne fasse que les énerver plus !",
          "broken": true
        },
        {
          "name": "Comment t’es au courant de l’existence de ce groupe ?|Ils ont invité Nikki. Elle me transfère ce qu’elle voit passer. Il n’y a pas grand monde qui sait que nous sommes proches.",
          "link": "Comment t’es au courant de l’existence de ce groupe ?|Ils ont invité Nikki. Elle me transfère ce qu’elle voit passer. Il n’y a pas grand monde qui sait que nous sommes proches.",
          "broken": true
        }
      ],
      "name": "On en est à un point où je me demande si je ne vais pas porter plainte. Tu sais ce qui est en train de se passer ? Il y a un petit groupe de rageux qui s’est formé. Ils s’échangent des messages, des commentaires sur l’actualité de Gao Games et « des blagues ».",
      "pid": "6",
      "position": {
        "x": "2273",
        "y": "948"
      },
      "tags": [
        "show-if"
      ]
    },
    {
      "text": "Chanceuse que je suis, j’ai pu voir leur dernières « créations ». Quelqu’un a publié des petits dessins injurieux qui montre « ma journée type » avec ma tête, mon nom, et pire que tout, une photo de MON FILS avec le nom de sa crèche !!!\nJe flippe en fait.\nJ’ai envie de porter plainte parce que je ne peux pas laisser passer un truc pareil et en même temps j’ai peur que démarrer une action en justice ne fasse que les énerver plus !\n\n[[On peut peut-être essayer de voir si Le Studio peut t’aider ?|Ils n’ont pas levé le petit doigt depuis hier, je ne vois pas pourquoi ils bougeraient maintenant]]\n[[Porte plainte, ça va beaucoup trop loin !|Merci. J’aimerais que tout mon entourage me soutienne autant que toi.]]\n[[Effectivement, ça me semble risqué...|Ha… Tu penses ?]]",
      "links": [
        {
          "name": "On peut peut-être essayer de voir si Le Studio peut t’aider ?|Ils n’ont pas levé le petit doigt depuis hier, je ne vois pas pourquoi ils bougeraient maintenant",
          "link": "On peut peut-être essayer de voir si Le Studio peut t’aider ?|Ils n’ont pas levé le petit doigt depuis hier, je ne vois pas pourquoi ils bougeraient maintenant",
          "broken": true
        },
        {
          "name": "Porte plainte, ça va beaucoup trop loin !|Merci. J’aimerais que tout mon entourage me soutienne autant que toi.",
          "link": "Porte plainte, ça va beaucoup trop loin !|Merci. J’aimerais que tout mon entourage me soutienne autant que toi.",
          "broken": true
        },
        {
          "name": "Effectivement, ça me semble risqué...|Ha… Tu penses ?",
          "link": "Effectivement, ça me semble risqué...|Ha… Tu penses ?",
          "broken": true
        }
      ],
      "name": "Chanceuse que je suis, j’ai pu voir leur dernières « créations ». Quelqu’un a publié des petits dessins injurieux qui montre « ma journée type » avec ma tête, mon nom, et pire que tout, une photo de MON FILS avec le nom de sa crèche !!! Je flippe en fait. J’ai envie de porter plainte parce que je ne peux pas laisser passer un truc pareil et en même temps j’ai peur que démarrer une action en justice ne fasse que les énerver plus !",
      "pid": "7",
      "position": {
        "x": "2186",
        "y": "1154"
      }
    },
    {
      "text": "Ils ont invité Nikki. Elle me transfère ce qu’elle voit passer. Il n’y a pas grand monde qui sait que nous sommes proches.\n\n[[La première faille de sécurité, c’est l’utilisateur...|Chanceuse que je suis, j’ai pu voir leur dernières « créations ». Quelqu’un a publié des petits dessins injurieux qui montre « ma journée type » avec ma tête, mon nom, et pire que tout, une photo de MON FILS avec le nom de sa crèche !!! Je flippe en fait. J’ai envie de porter plainte parce que je ne peux pas laisser passer un truc pareil et en même temps j’ai peur que démarrer une action en justice ne fasse que les énerver plus !]]",
      "links": [
        {
          "name": "La première faille de sécurité, c’est l’utilisateur...|Chanceuse que je suis, j’ai pu voir leur dernières « créations ». Quelqu’un a publié des petits dessins injurieux qui montre « ma journée type » avec ma tête, mon nom, et pire que tout, une photo de MON FILS avec le nom de sa crèche !!! Je flippe en fait. J’ai envie de porter plainte parce que je ne peux pas laisser passer un truc pareil et en même temps j’ai peur que démarrer une action en justice ne fasse que les énerver plus !",
          "link": "La première faille de sécurité, c’est l’utilisateur...|Chanceuse que je suis, j’ai pu voir leur dernières « créations ». Quelqu’un a publié des petits dessins injurieux qui montre « ma journée type » avec ma tête, mon nom, et pire que tout, une photo de MON FILS avec le nom de sa crèche !!! Je flippe en fait. J’ai envie de porter plainte parce que je ne peux pas laisser passer un truc pareil et en même temps j’ai peur que démarrer une action en justice ne fasse que les énerver plus !",
          "broken": true
        }
      ],
      "name": "Ils ont invité Nikki. Elle me transfère ce qu’elle voit passer. Il n’y a pas grand monde qui sait que nous sommes proches.",
      "pid": "8",
      "position": {
        "x": "2338",
        "y": "1154"
      }
    },
    {
      "text": "Ils n’ont pas levé le petit doigt depuis hier, je ne vois pas pourquoi ils bougeraient maintenant\n\n[[Ally m'a contacté. Elle propose de t’aider.|Comment ça, elle propose ? Tu trouves pas ça abusé !? Il faut que je signale tous les messages un à un pour qu’ils soient supprimés ! Et encore, il y a un sacré délai avant que ça se passe. Et d’un coup Ally se réveille et propose de m’aider… C’est louche.]]",
      "links": [
        {
          "name": "Ally m'a contacté. Elle propose de t’aider.|Comment ça, elle propose ? Tu trouves pas ça abusé !? Il faut que je signale tous les messages un à un pour qu’ils soient supprimés ! Et encore, il y a un sacré délai avant que ça se passe. Et d’un coup Ally se réveille et propose de m’aider… C’est louche.",
          "link": "Ally m'a contacté. Elle propose de t’aider.|Comment ça, elle propose ? Tu trouves pas ça abusé !? Il faut que je signale tous les messages un à un pour qu’ils soient supprimés ! Et encore, il y a un sacré délai avant que ça se passe. Et d’un coup Ally se réveille et propose de m’aider… C’est louche.",
          "broken": true
        }
      ],
      "name": "Ils n’ont pas levé le petit doigt depuis hier, je ne vois pas pourquoi ils bougeraient maintenant",
      "pid": "9",
      "position": {
        "x": "2634",
        "y": "1674"
      },
      "tags": [
        "show-if"
      ]
    },
    {
      "text": "Ben me dit que je prends ça trop à cœur et que j’ai qu'à couper mes notifs. (SHOW if J’espère qu’il changera d’avis quand il verra la petite bd\nEt Sol me fait la gueule d’une façon bizarre.(SHOW if et ça m’inquiète au plus au points, tu t'en doutes.)\nEt Ally m'espionne... ><\n\n[[Elle veut comprendre pourquoi Blaze est parti.|La réponse est dans l'appli. Enfin, j'espère. ><]]\n[[Elle est prête à t'aider contre des informations|J’y crois pas. C’est tellement cynique.]]",
      "links": [
        {
          "name": "Elle veut comprendre pourquoi Blaze est parti.|La réponse est dans l'appli. Enfin, j'espère. ><",
          "link": "Elle veut comprendre pourquoi Blaze est parti.|La réponse est dans l'appli. Enfin, j'espère. ><",
          "broken": true
        },
        {
          "name": "Elle est prête à t'aider contre des informations|J’y crois pas. C’est tellement cynique.",
          "link": "Elle est prête à t'aider contre des informations|J’y crois pas. C’est tellement cynique.",
          "broken": true
        }
      ],
      "name": "Ben me dit que je prends ça trop à cœur et que j’ai qu'à couper mes notifs. (SHOW if J’espère qu’il changera d’avis quand il verra la petite bd Et Sol me fait la gueule d’une façon bizarre.(SHOW if et ça m’inquiète au plus au points, tu t'en doutes.) Et Ally m'espionne... ><",
      "pid": "10",
      "position": {
        "x": "2325",
        "y": "2134"
      },
      "tags": [
        "Show-if"
      ]
    },
    {
      "text": "Comment ça, elle propose ? Tu trouves pas ça abusé !? Il faut que je signale tous les messages un à un pour qu’ils soient supprimés ! Et encore, il y a un sacré délai avant que ça se passe. Et d’un coup Ally se réveille et propose de m’aider… C’est louche.\n\n[[Elle propose de l‘aide contre des info sur l’appli|J’y crois pas. C’est tellement cynique.]]\n[[Tu penses qu’elle est vraiment en mesure de t’aider ?|C'est ce qu'elle dit, mais elle a tellement d'influence là-bas ! Elle n'hésite pas à se servir du petit pouvoir qu'elle a pour écraser ceux qu'elle n'aime pas. Je te jure, j'ai entendu de ses histoires... Quand elle prend quelqu'un en grippe, c'est foutu. Qu’est-ce qu’elle propose contre « son aide » ?]]",
      "links": [
        {
          "name": "Elle propose de l‘aide contre des info sur l’appli|J’y crois pas. C’est tellement cynique.",
          "link": "Elle propose de l‘aide contre des info sur l’appli|J’y crois pas. C’est tellement cynique.",
          "broken": true
        },
        {
          "name": "Tu penses qu’elle est vraiment en mesure de t’aider ?|C'est ce qu'elle dit, mais elle a tellement d'influence là-bas ! Elle n'hésite pas à se servir du petit pouvoir qu'elle a pour écraser ceux qu'elle n'aime pas. Je te jure, j'ai entendu de ses histoires... Quand elle prend quelqu'un en grippe, c'est foutu. Qu’est-ce qu’elle propose contre « son aide » ?",
          "link": "Tu penses qu’elle est vraiment en mesure de t’aider ?|C'est ce qu'elle dit, mais elle a tellement d'influence là-bas ! Elle n'hésite pas à se servir du petit pouvoir qu'elle a pour écraser ceux qu'elle n'aime pas. Je te jure, j'ai entendu de ses histoires... Quand elle prend quelqu'un en grippe, c'est foutu. Qu’est-ce qu’elle propose contre « son aide » ?",
          "broken": true
        }
      ],
      "name": "Comment ça, elle propose ? Tu trouves pas ça abusé !? Il faut que je signale tous les messages un à un pour qu’ils soient supprimés ! Et encore, il y a un sacré délai avant que ça se passe. Et d’un coup Ally se réveille et propose de m’aider… C’est louche.",
      "pid": "11",
      "position": {
        "x": "2694",
        "y": "1809"
      }
    },
    {
      "text": "J’y crois pas.\nC’est tellement cynique.\n\n[[C’est cynique, mais c’est une solution|Blaze m’a confié ces informations, il est hors de question que je trahisse sa confiance. Tu devrais arrêter tout de suite de parler de ça avec Ally. Sérieusement. Enfin… Maintenant qu’elle a un os à ronger, elle ne va plus te lâcher. T'aurais jamais dû parler de tout ça !]]\n[[Je trouve aussi, mais je préférais t’en parler quand même|Je ne trahirais jamais Blaze. C'est mal me connaître de penser le contraire. Enfin, venant d'elle... Ally est tenace. Quand elle a un os à ronger, elle ne le lâche plus. Elle va insister jusqu’à obtenir ce qu’elle veut. On trouvera un moyen de la contrer !]]",
      "links": [
        {
          "name": "C’est cynique, mais c’est une solution|Blaze m’a confié ces informations, il est hors de question que je trahisse sa confiance. Tu devrais arrêter tout de suite de parler de ça avec Ally. Sérieusement. Enfin… Maintenant qu’elle a un os à ronger, elle ne va plus te lâcher. T'aurais jamais dû parler de tout ça !",
          "link": "C’est cynique, mais c’est une solution|Blaze m’a confié ces informations, il est hors de question que je trahisse sa confiance. Tu devrais arrêter tout de suite de parler de ça avec Ally. Sérieusement. Enfin… Maintenant qu’elle a un os à ronger, elle ne va plus te lâcher. T'aurais jamais dû parler de tout ça !",
          "broken": true
        },
        {
          "name": "Je trouve aussi, mais je préférais t’en parler quand même|Je ne trahirais jamais Blaze. C'est mal me connaître de penser le contraire. Enfin, venant d'elle... Ally est tenace. Quand elle a un os à ronger, elle ne le lâche plus. Elle va insister jusqu’à obtenir ce qu’elle veut. On trouvera un moyen de la contrer !",
          "link": "Je trouve aussi, mais je préférais t’en parler quand même|Je ne trahirais jamais Blaze. C'est mal me connaître de penser le contraire. Enfin, venant d'elle... Ally est tenace. Quand elle a un os à ronger, elle ne le lâche plus. Elle va insister jusqu’à obtenir ce qu’elle veut. On trouvera un moyen de la contrer !",
          "broken": true
        }
      ],
      "name": "J’y crois pas. C’est tellement cynique.",
      "pid": "12",
      "position": {
        "x": "2599",
        "y": "2500"
      }
    },
    {
      "text": "C'est ce qu'elle dit, mais elle a tellement d'influence là-bas !\nElle n'hésite pas à se servir du petit pouvoir qu'elle a pour écraser ceux qu'elle n'aime pas. Je te jure, j'ai entendu de ses histoires... Quand elle prend quelqu'un en grippe, c'est foutu.\nQu’est-ce qu’elle propose contre « son aide » ?\n\n[[Elle veut des infos sur l’appli|J’y crois pas. C’est tellement cynique.]]",
      "links": [
        {
          "name": "Elle veut des infos sur l’appli|J’y crois pas. C’est tellement cynique.",
          "link": "Elle veut des infos sur l’appli|J’y crois pas. C’est tellement cynique.",
          "broken": true
        }
      ],
      "name": "C'est ce qu'elle dit, mais elle a tellement d'influence là-bas ! Elle n'hésite pas à se servir du petit pouvoir qu'elle a pour écraser ceux qu'elle n'aime pas. Je te jure, j'ai entendu de ses histoires... Quand elle prend quelqu'un en grippe, c'est foutu. Qu’est-ce qu’elle propose contre « son aide » ?",
      "pid": "13",
      "position": {
        "x": "2764",
        "y": "1949"
      }
    },
    {
      "text": "Merci. J’aimerais que tout mon entourage me soutienne autant que toi.\n\n[[Ce n’est pas le cas ?|Ben me dit que je prends ça trop à cœur et que j’ai qu'à couper mes notifs. (SHOW if J’espère qu’il changera d’avis quand il verra la petite bd Et Sol me fait la gueule d’une façon bizarre.(SHOW if et ça m’inquiète au plus au points, tu t'en doutes.) Et Ally m'espionne... ><]]",
      "links": [
        {
          "name": "Ce n’est pas le cas ?|Ben me dit que je prends ça trop à cœur et que j’ai qu'à couper mes notifs. (SHOW if J’espère qu’il changera d’avis quand il verra la petite bd Et Sol me fait la gueule d’une façon bizarre.(SHOW if et ça m’inquiète au plus au points, tu t'en doutes.) Et Ally m'espionne... ><",
          "link": "Ce n’est pas le cas ?|Ben me dit que je prends ça trop à cœur et que j’ai qu'à couper mes notifs. (SHOW if J’espère qu’il changera d’avis quand il verra la petite bd Et Sol me fait la gueule d’une façon bizarre.(SHOW if et ça m’inquiète au plus au points, tu t'en doutes.) Et Ally m'espionne... ><",
          "broken": true
        }
      ],
      "name": "Merci. J’aimerais que tout mon entourage me soutienne autant que toi.",
      "pid": "14",
      "position": {
        "x": "2325",
        "y": "1998"
      }
    },
    {
      "text": "Blaze m’a confié ces informations, il est hors de question que je trahisse sa confiance. Tu devrais arrêter tout de suite de parler de ça avec Ally. Sérieusement.\nEnfin… Maintenant qu’elle a un os à ronger, elle ne va plus te lâcher.\nT'aurais jamais dû parler de tout ça !\n\n[[Excuse-moi|Promets-moi que tu n'accepteras jamais un de ses deal foireux.]]\n[[Oui, bon, c’est fait, c’est fait !|Promets-moi que tu n'accepteras jamais un de ses deal foireux.]]",
      "links": [
        {
          "name": "Excuse-moi|Promets-moi que tu n'accepteras jamais un de ses deal foireux.",
          "link": "Excuse-moi|Promets-moi que tu n'accepteras jamais un de ses deal foireux.",
          "broken": true
        },
        {
          "name": "Oui, bon, c’est fait, c’est fait !|Promets-moi que tu n'accepteras jamais un de ses deal foireux.",
          "link": "Oui, bon, c’est fait, c’est fait !|Promets-moi que tu n'accepteras jamais un de ses deal foireux.",
          "broken": true
        }
      ],
      "name": "Blaze m’a confié ces informations, il est hors de question que je trahisse sa confiance. Tu devrais arrêter tout de suite de parler de ça avec Ally. Sérieusement. Enfin… Maintenant qu’elle a un os à ronger, elle ne va plus te lâcher. T'aurais jamais dû parler de tout ça !",
      "pid": "15",
      "position": {
        "x": "2497",
        "y": "2791"
      }
    },
    {
      "text": "Je ne trahirais jamais Blaze. C'est mal me connaître de penser le contraire. Enfin, venant d'elle...\nAlly est tenace. Quand elle a un os à ronger, elle ne le lâche plus. Elle va insister jusqu’à obtenir ce qu’elle veut. On trouvera un moyen de la contrer !\n\n[[Les réponses sont dans l'appli !|J'espère...]]",
      "links": [
        {
          "name": "Les réponses sont dans l'appli !|J'espère...",
          "link": "Les réponses sont dans l'appli !|J'espère...",
          "broken": true
        }
      ],
      "name": "Je ne trahirais jamais Blaze. C'est mal me connaître de penser le contraire. Enfin, venant d'elle... Ally est tenace. Quand elle a un os à ronger, elle ne le lâche plus. Elle va insister jusqu’à obtenir ce qu’elle veut. On trouvera un moyen de la contrer !",
      "pid": "16",
      "position": {
        "x": "2728",
        "y": "2777"
      }
    },
    {
      "text": "Ha… Tu penses ?\n\n[[Oui, il faut trouver un autre moyen. L’aide du Studio?|Ils n’ont pas levé le petit doigt depuis hier, je ne vois pas pourquoi ils bougeraient maintenant]]\n[[Il vaut mieux ne pas t’exposer plus que tu ne l’es...|Ha… Je pensais avoir ton soutiens sur ce coup.]]",
      "links": [
        {
          "name": "Oui, il faut trouver un autre moyen. L’aide du Studio?|Ils n’ont pas levé le petit doigt depuis hier, je ne vois pas pourquoi ils bougeraient maintenant",
          "link": "Oui, il faut trouver un autre moyen. L’aide du Studio?|Ils n’ont pas levé le petit doigt depuis hier, je ne vois pas pourquoi ils bougeraient maintenant",
          "broken": true
        },
        {
          "name": "Il vaut mieux ne pas t’exposer plus que tu ne l’es...|Ha… Je pensais avoir ton soutiens sur ce coup.",
          "link": "Il vaut mieux ne pas t’exposer plus que tu ne l’es...|Ha… Je pensais avoir ton soutiens sur ce coup.",
          "broken": true
        }
      ],
      "name": "Ha… Tu penses ?",
      "pid": "17",
      "position": {
        "x": "1980",
        "y": "1621"
      }
    },
    {
      "text": "Ha…\nJe pensais avoir ton soutiens sur ce coup.\n\n[[Tu as tout mon soutien, mais je ne pense pas que ne soit une bonne idée.|Je vais réfléchir, alors… Toute cette situation est...  :-( Je sais plus trop quoi faire.]]\n[[Fais ce qui te semble le mieux. Au final, je te soutiendrai, tu sais.|Merci. C’est une décision compliquée, alors si je sens que tu me lâches, je ne suis pas certaine d’avoir la foi d’aller jusqu’au bout.]]",
      "links": [
        {
          "name": "Tu as tout mon soutien, mais je ne pense pas que ne soit une bonne idée.|Je vais réfléchir, alors… Toute cette situation est...  :-( Je sais plus trop quoi faire.",
          "link": "Tu as tout mon soutien, mais je ne pense pas que ne soit une bonne idée.|Je vais réfléchir, alors… Toute cette situation est...  :-( Je sais plus trop quoi faire.",
          "broken": true
        },
        {
          "name": "Fais ce qui te semble le mieux. Au final, je te soutiendrai, tu sais.|Merci. C’est une décision compliquée, alors si je sens que tu me lâches, je ne suis pas certaine d’avoir la foi d’aller jusqu’au bout.",
          "link": "Fais ce qui te semble le mieux. Au final, je te soutiendrai, tu sais.|Merci. C’est une décision compliquée, alors si je sens que tu me lâches, je ne suis pas certaine d’avoir la foi d’aller jusqu’au bout.",
          "broken": true
        }
      ],
      "name": "Ha… Je pensais avoir ton soutiens sur ce coup.",
      "pid": "18",
      "position": {
        "x": "1980",
        "y": "1772"
      }
    },
    {
      "text": "Je vais réfléchir, alors…\nToute cette situation est... \n:-(\nJe sais plus trop quoi faire.\n\n[[Ally peut aider.|Elle ne fait jamais rien gratuitement. :-/  Elle veut quoi en échange ?]]\n[[Il faut comprendre pourquoi Blaze est parti|La réponse est dans l'appli. Enfin, j'espère. ><]]",
      "links": [
        {
          "name": "Ally peut aider.|Elle ne fait jamais rien gratuitement. :-/  Elle veut quoi en échange ?",
          "link": "Ally peut aider.|Elle ne fait jamais rien gratuitement. :-/  Elle veut quoi en échange ?",
          "broken": true
        },
        {
          "name": "Il faut comprendre pourquoi Blaze est parti|La réponse est dans l'appli. Enfin, j'espère. ><",
          "link": "Il faut comprendre pourquoi Blaze est parti|La réponse est dans l'appli. Enfin, j'espère. ><",
          "broken": true
        }
      ],
      "name": "Je vais réfléchir, alors… Toute cette situation est...  :-( Je sais plus trop quoi faire.",
      "pid": "19",
      "position": {
        "x": "1922",
        "y": "2002"
      }
    },
    {
      "text": "Merci. C’est une décision compliquée, alors si je sens que tu me lâches, je ne suis pas certaine d’avoir la foi d’aller jusqu’au bout.\n\n[[:)|Alex-Blaze-1]]",
      "links": [
        {
          "name": ":)|Alex-Blaze-1",
          "link": ":)|Alex-Blaze-1",
          "broken": true
        }
      ],
      "name": "Merci. C’est une décision compliquée, alors si je sens que tu me lâches, je ne suis pas certaine d’avoir la foi d’aller jusqu’au bout.",
      "pid": "20",
      "position": {
        "x": "2124",
        "y": "2002"
      }
    },
    {
      "text": "Elle ne fait jamais rien gratuitement. :-/ \nElle veut quoi en échange ?\n\n[[Elle veut des infos sur l’appli|J’y crois pas. C’est tellement cynique.]]",
      "links": [
        {
          "name": "Elle veut des infos sur l’appli|J’y crois pas. C’est tellement cynique.",
          "link": "Elle veut des infos sur l’appli|J’y crois pas. C’est tellement cynique.",
          "broken": true
        }
      ],
      "name": "Elle ne fait jamais rien gratuitement. :-/  Elle veut quoi en échange ?",
      "pid": "21",
      "position": {
        "x": "1912",
        "y": "2189"
      }
    },
    {
      "text": "Tout le monde n'est pas comme toi, tu sais.\nBen me dit que je prends ça trop à cœur et que j’ai qu'à couper mes notifs.\n@showOnlyIfChoiceMade \"??\" J’espère qu’il changera d’avis quand lui parlerai des petits dessins des autres débiles\nEt Sol me fait la gueule d’une façon bizarre.\n@showOnlyIfChoiceMade \"ben out\" et ça m’inquiète au plus haut point, tu t'en doutes.\nEt Ally m'espionne... ><\n\n[[Elle veut comprendre pourquoi Blaze est parti.|La réponse est dans l'appli. Enfin, j'espère. ><]]",
      "links": [
        {
          "name": "Elle veut comprendre pourquoi Blaze est parti.|La réponse est dans l'appli. Enfin, j'espère. ><",
          "link": "Elle veut comprendre pourquoi Blaze est parti.|La réponse est dans l'appli. Enfin, j'espère. ><",
          "broken": true
        }
      ],
      "name": "Alex-Blaze-1",
      "pid": "22",
      "position": {
        "x": "2134",
        "y": "2143"
      },
      "tags": [
        "show-if"
      ]
    },
    {
      "text": "La réponse est dans l'appli. Enfin, j'espère. ><",
      "name": "La réponse est dans l'appli. Enfin, j'espère. ><",
      "pid": "23",
      "position": {
        "x": "2194",
        "y": "3096"
      }
    },
    {
      "text": "Promets-moi que tu n'accepteras jamais un de ses deal foireux.\n\n[[Ok, ok.|Double-click this passage to edit it. <>]]\n[[Promis|Double-click this passage to edit it. <>]]",
      "links": [
        {
          "name": "Ok, ok.|Double-click this passage to edit it. <>",
          "link": "Ok, ok.|Double-click this passage to edit it. <>",
          "broken": true
        },
        {
          "name": "Promis|Double-click this passage to edit it. <>",
          "link": "Promis|Double-click this passage to edit it. <>",
          "broken": true
        }
      ],
      "name": "Promets-moi que tu n'accepteras jamais un de ses deal foireux.",
      "pid": "24",
      "position": {
        "x": "2497",
        "y": "2941"
      }
    },
    {
      "text": "J'espère...",
      "name": "J'espère...",
      "pid": "25",
      "position": {
        "x": "2725",
        "y": "3099"
      }
    },
    {
      "text": "Double-click this passage to edit it. <>",
      "name": "Double-click this passage to edit it. <>",
      "pid": "26",
      "position": {
        "x": "2497",
        "y": "3091"
      }
    }
  ],
  "name": "AlexBlaze",
  "startnode": "1",
  "creator": "Twine",
  "creator-version": "2.3.13",
  "ifid": "89D64A2C-C06B-4B1F-A410-C56F424F527D"
}

