[
  {
    "playerName": "Amin",
    "message": "… What ?"
  },
  {
    "playerName": "Ángel",
    "message": "Did we get the wrong chatroom?"
  },
  {
    "playerName": "Luca",
    "message": "Are you kidding me?"
  },
  {
    "playerName": "Harriet",
    "message": "I spent the afternoon trying to figure out his stupid game!"
  },
  {
    "playerName": "Armande",
    "message": "What does that mean?"
  },
  {
    "playerName": "Kelci",
    "message": "><"
  },
  {
    "playerName": "Sven",
    "message": "Not kool"
  },
  {
    "playerName": "Kevin",
    "message": "dont getit"
  },
  {
    "playerName": "Nina",
    "message": "Where is Blaze?"
  },
  {
    "playerName": "Sven",
    "message": "Hidden code smwhere?"
  },
  {
    "playerName": "Maruca",
    "message": "So shitty"
  },
  {
    "playerName": "Trevor",
    "message": "He's just fucking with us"
  },
  {
    "playerName": "Kelci",
    "message": "GG"
  },
  {
    "playerName": "Claire",
    "message": "wherare admins?"
  },
  {
    "playerName": "JoNell",
    "message": "Whaz their excuse this time?"
  },
  {
    "playerName": "Luca",
    "message": "They don't give a shit about us"
  },
  {
    "playerName": "Mehdi",
    "message": "yaaa, since they where sellin the studio..."
  },
  {
    "playerName": "Armande",
    "message": "I wanted to see Gao in real life ''''''''''("
  },
  {
    "playerName": "Alex",
    "message": "I am sure there is an explanation :)",
    "isAlex": true
  },
  {
    "playerName": "Luca",
    "message": "And here is Alex, the nice doggie of the Studio..."
  },
  {
    "playerName": "Ajay",
    "message": "Seriously, Alex, this is not the first time something like this has happened."
  },
  {
    "playerName": "Armande",
    "message": "I'm sick of it, in the end!"
  },
  {
    "playerName": "Karima",
    "message": "Every time we should calm down, but we are just fooling ourselves"
  },
  {
    "playerName": "Nina",
    "message": "Where's Blaze?"
  },
  {
    "playerName": "JoNell",
    "message": "He's just fucking with us"
  },
  {
    "playerName": "Harriet",
    "message": "Gao, it is not as it was ..."
  },
  {
    "playerName": "Célia",
    "message": "I think Blaze doesn't care now that he'll be loaded with money"
  },
  {
    "playerName": "Alex",
    "message": "I'm sure Blaze wouldn't let us down like that! :)",
    "isAlex": true
  },
  {
    "playerName": "Amin",
    "message": "Why do you ALWAYS take his side?"
  },
  {
    "playerName": "Sven",
    "message": "So truu"
  },
  {
    "playerName": "Rokaya",
    "message": "What's up with you at the end?"
  },
  {
    "playerName": "Nina",
    "message": "Where is blaze"
  },
  {
    "playerName": "JoNell",
    "message": "Always the same to defend the transparency and in the end..."
  },
  {
    "playerName": "Harriet",
    "message": "Do you have shares in the Studio? Are you going to get your big fat check when they buy it out?"
  },
  {
    "playerName": "Juan",
    "message": "fuckkk"
  },
  {
    "playerName": "Kelci",
    "message": "><"
  },
  {
    "playerName": "Alex",
    "message": "But what's wrong with you!",
    "isAlex": true
  },
  {
    "playerName": "Harriet",
    "message": "the truth is that you're pissing everyone off, Alex"
  },
  {
    "playerName": "Luca",
    "message": "it's hard to hear, but it's the truth"
  },
  {
    "playerName": "Kelci",
    "message": "+1"
  },
  {
    "playerName": "Mehdi",
    "message": "+1"
  },
  {
    "playerName": "Joueur",
    "message": [
      {
        "displayed": "[Don't say anything]",
        "show": false
      },
      {
        "displayed": "Hey! That's enough, leave her alone!",
        "show": true
      }
    ],
    "isMe": true
  },
  {
    "playerName": "Luca",
    "message": "We didn't ask you anything"
  },
  {
    "playerName": "JoNell",
    "message": "You know nothing"
  },
  {
    "playerName": "Harriet",
    "message": "The noob, it looks and it learns"
  },
  {
    "playerName": "Célia",
    "message": "and they keep quiet"
  },
  {
    "playerName": "Mehdi",
    "message": "you are useless"
  },
  {
    "playerName": "JoNell",
    "message": "Shut up"
  },
  {
    "playerName": "Alex",
    "message": "You are all delirious, there is a problem and we will find a solution",
    "isAlex": true
  },
  {
    "playerName": "Harriet",
    "message": "« We'll find a solution » → and then you say you don't work for the Studio??"
  },
  {
    "playerName": "Luca",
    "message": "This is it, she finally reveals herself"
  },
  {
    "playerName": "Ajay",
    "message": "What a surprise!"
  },
  {
    "playerName": "Joueur",
    "message": [
      {
        "displayed": "[Don't say anything]",
        "show": false
      },
      {
        "displayed": "But you know very well that she does not work for the Studio!",
        "show": true
      }
    ],
    "isMe": true
  },
  {
    "playerName": "JoNell",
    "message": "Ha, I think I heard like a vague noise"
  },
  {
    "playerName": "Harriet",
    "message": "I think a Noob spoke"
  },
  {
    "playerName": "Luca",
    "message": "who cares?"
  },
  {
    "playerName": "Juan",
    "message": "+1"
  },
  {
    "playerName": "Kelci",
    "message": "+1"
  },
  {
    "playerName": "JoNell",
    "message": "clap clap"
  },
  {
    "playerName": "Mehdi",
    "message": "+1"
  },
  {
    "playerName": "Nina",
    "message": "where is blaze"
  },
  {
    "playerName": "Harriet",
    "message": "We can always count on Alex to surround herself with nice pets"
  },
  {
    "playerName": "Luca",
    "message": "That changes it, usually, it is her who is held in lead!"
  },
  {
    "playerName": "Mehdi",
    "message": "fuck"
  },
  {
    "playerName": "Kelci",
    "message": "LOL"
  },
  {
    "playerName": "Alex",
    "message": "You're out of line, I'm going to report you.",
    "isAlex": true
  },
  {
    "playerName": "JoNell",
    "message": "How comes you have the rights in the chat?"
  },
  {
    "playerName": "Harriet",
    "message": "it's too much"
  },
  {
    "playerName": "Luca",
    "message": "Go ahead and kick me, you'll feel powerful, it'll take the edge off"
  },
  {
    "playerName": "Juan",
    "message": "Does she really have the rights to the chat?"
  },
  {
    "playerName": "Harriet",
    "message": "…"
  },
  {
    "playerName": "Luca",
    "message": "I m still here, so I dont think"
  },
  {
    "playerName": "Harriet",
    "message": "Hey yeah, it's always the same people who think they are playing in the big league, and in the end..."
  },
  {
    "playerName": "Sven",
    "message": "It's a bad thing that you dont have the level"
  },
  {
    "playerName": "Luca",
    "message": "Oh... Poor Alex persecuted by the evil players. Who are you going to complain to this time? Where is Blaze to protect you now?"
  },
  {
    "playerName": "JoNell",
    "message": "And that's it, the end of Alex"
  },
  {
    "playerName": "Harriet",
    "message": "The END"
  },
  {
    "playerName": "Luca",
    "message": "Everyone in their right place"
  },
  {
    "playerName": "Sven",
    "message": "It's totally deserved"
  },
  {
    "playerName": "Nina",
    "message": "WHERE IS BLAZE !!!!!?!"
  },
  {
    "playerName": "Alex",
    "message": "Alex left the conversation",
    "isAlex": true,
    "isItalic": true
  }
]
