{
  "passages": [
    {
      "text": "@showIfGameHasBeenPlayed TheProsecutor\n@passive\n\n[[Salut !|Lucas 1-1]]\n",
      "links": [
        {
          "name": "Salut !|Lucas 1-1",
          "link": "Salut !|Lucas 1-1",
          "broken": true
        }
      ],
      "name": "Lucas-1",
      "pid": "1",
      "position": {
        "x": "415",
        "y": "171"
      }
    },
    {
      "text": "Oui.\nFinement observé.\n\n[[Haha ^^'|Lucas 1-3]]\n[[Pas très bavard ?|Lucas 1-4]]",
      "links": [
        {
          "name": "Haha ^^'|Lucas 1-3",
          "link": "Haha ^^'|Lucas 1-3",
          "broken": true
        },
        {
          "name": "Pas très bavard ?|Lucas 1-4",
          "link": "Pas très bavard ?|Lucas 1-4",
          "broken": true
        }
      ],
      "name": "Lucas 1-2",
      "pid": "2",
      "position": {
        "x": "416",
        "y": "457"
      }
    },
    {
      "text": "....",
      "name": "Lucas 1-3",
      "pid": "3",
      "position": {
        "x": "339",
        "y": "607"
      }
    },
    {
      "text": "Pas très bavard.",
      "name": "Lucas 1-4",
      "pid": "4",
      "position": {
        "x": "489",
        "y": "607"
      }
    },
    {
      "text": "Bonjour.\n\n[[T’es top player ?|Lucas 1-2]]",
      "links": [
        {
          "name": "T’es top player ?|Lucas 1-2",
          "link": "T’es top player ?|Lucas 1-2",
          "broken": true
        }
      ],
      "name": "Lucas 1-1",
      "pid": "5",
      "position": {
        "x": "420",
        "y": "312"
      }
    }
  ],
  "name": "Lucas",
  "startnode": "1",
  "creator": "Twine",
  "creator-version": "2.3.14",
  "ifid": "7CA3A2DB-AA38-4277-B3C0-445EC5F41861"
}
