{
  "passages": [
    {
      "text": "@showIfGameHasBeenPlayed ThePhotographer\n@passive\n[[Hello|Rokaya 1-1]]\n",
      "links": [
        {
          "name": "Hello|Rokaya 1-1",
          "link": "Hello|Rokaya 1-1",
          "broken": true
        }
      ],
      "name": "Rokaya 1",
      "pid": "1",
      "position": {
        "x": "400",
        "y": "200"
      },
      "tags": [
        "Works",
        "English"
      ]
    },
    {
      "text": "I'm sure you'll figure it out! It's easy once you get the hang of it.  ^^ I hav— had some of the best scores.\n\nThough that's not that impressive considering I'm a colorist.\n\n[[A colorist?|Rokaya 1-4]]",
      "links": [
        {
          "name": "A colorist?|Rokaya 1-4",
          "link": "A colorist?|Rokaya 1-4",
          "broken": true
        }
      ],
      "name": "Rokaya 1-3",
      "pid": "2",
      "position": {
        "x": "500",
        "y": "600"
      },
      "tags": [
        "Works",
        "English"
      ]
    },
    {
      "text": "I work at a paint factory. To tell you the truth, I can see colors just by reading their CMYK codes. \n\nAnd I'm also that weird person online who has an entire blog about color: \"10 bold ways to paint your life red!\" \"5 new ideas for a bright green kitchen!\" ^^\n\n[[Perhaps you can give me some advice, then?|Rokaya 1-6]]\n[[Lame. You can just take pictures of some paint buckets and win.|Rokaya 1-5]]",
      "links": [
        {
          "name": "Perhaps you can give me some advice, then?|Rokaya 1-6",
          "link": "Perhaps you can give me some advice, then?|Rokaya 1-6",
          "broken": true
        },
        {
          "name": "Lame. You can just take pictures of some paint buckets and win.|Rokaya 1-5",
          "link": "Lame. You can just take pictures of some paint buckets and win.|Rokaya 1-5",
          "broken": true
        }
      ],
      "name": "Rokaya 1-4",
      "pid": "3",
      "position": {
        "x": "400",
        "y": "800"
      },
      "tags": [
        "Works",
        "English"
      ]
    },
    {
      "text": "Ha. If it only were that easy.\n\n[[Don't tell me the game actually recognizes an \"artistic vein\"?|Rokaya 1-7]]",
      "links": [
        {
          "name": "Don't tell me the game actually recognizes an \"artistic vein\"?|Rokaya 1-7",
          "link": "Don't tell me the game actually recognizes an \"artistic vein\"?|Rokaya 1-7",
          "broken": true
        }
      ],
      "name": "Rokaya 1-5",
      "pid": "4",
      "position": {
        "x": "200",
        "y": "1000"
      },
      "tags": [
        "Works",
        "English"
      ]
    },
    {
      "text": "Not the game. The Studio.\n\nBut it leads nowhere.\n\n[[What do you mean?|Rokaya 1-8]]",
      "links": [
        {
          "name": "What do you mean?|Rokaya 1-8",
          "link": "What do you mean?|Rokaya 1-8",
          "broken": true
        }
      ],
      "name": "Rokaya 1-7",
      "pid": "5",
      "position": {
        "x": "200",
        "y": "1200"
      },
      "tags": [
        "Works",
        "English"
      ]
    },
    {
      "text": "Gao is just a game. Keep that in mind.\n\n[[??? I know it's just a game.|Rokaya 1-9]]",
      "links": [
        {
          "name": "??? I know it's just a game.|Rokaya 1-9",
          "link": "??? I know it's just a game.|Rokaya 1-9",
          "broken": true
        }
      ],
      "name": "Rokaya 1-8",
      "pid": "6",
      "position": {
        "x": "200",
        "y": "1400"
      },
      "tags": [
        "Works",
        "English"
      ]
    },
    {
      "text": "It is. I just wish I had known that.",
      "name": "Rokaya 1-10",
      "pid": "7",
      "position": {
        "x": "500",
        "y": "1600"
      },
      "tags": [
        "Works",
        "English"
      ]
    },
    {
      "text": "Some advice? Ummm... Don't get too engaged. It will do you no good.\n\n[[Really? Are you that scared of losing?|Rokaya 1-11]]\n[[\"Engaged\"? It's just a game.|Rokaya 1-10]]",
      "links": [
        {
          "name": "Really? Are you that scared of losing?|Rokaya 1-11",
          "link": "Really? Are you that scared of losing?|Rokaya 1-11",
          "broken": true
        },
        {
          "name": "\"Engaged\"? It's just a game.|Rokaya 1-10",
          "link": "\"Engaged\"? It's just a game.|Rokaya 1-10",
          "broken": true
        }
      ],
      "name": "Rokaya 1-6",
      "pid": "8",
      "position": {
        "x": "600",
        "y": "1000"
      },
      "tags": [
        "Works",
        "English"
      ]
    },
    {
      "text": "It is!\nI hav— had some of the best scores.\n\nThough that's not that impressive considering I'm a colorist. :p\n\n[[Colorist?|Rokaya 1-4]]",
      "links": [
        {
          "name": "Colorist?|Rokaya 1-4",
          "link": "Colorist?|Rokaya 1-4",
          "broken": true
        }
      ],
      "name": "Rokaya 1-2",
      "pid": "9",
      "position": {
        "x": "300",
        "y": "600"
      },
      "tags": [
        "Works",
        "English"
      ]
    },
    {
      "text": "Hey! I noticed you've started playing Gao The Photographer! ;-)\n\n[[I have! It's really fun.|Rokaya 1-2]]\n[[I have. But I'm failing miserably. :(|Rokaya 1-3]]",
      "links": [
        {
          "name": "I have! It's really fun.|Rokaya 1-2",
          "link": "I have! It's really fun.|Rokaya 1-2",
          "broken": true
        },
        {
          "name": "I have. But I'm failing miserably. :(|Rokaya 1-3",
          "link": "I have. But I'm failing miserably. :(|Rokaya 1-3",
          "broken": true
        }
      ],
      "name": "Rokaya 1-1",
      "pid": "10",
      "position": {
        "x": "400",
        "y": "400"
      },
      "tags": [
        "Works",
        "English"
      ]
    },
    {
      "text": "... Trust me. If victory meant anything, I would help you.",
      "name": "Rokaya 1-11",
      "pid": "11",
      "position": {
        "x": "700",
        "y": "1600"
      },
      "tags": [
        "Works",
        "English"
      ]
    },
    {
      "text": "Good. ;)",
      "name": "Rokaya 1-9",
      "pid": "12",
      "position": {
        "x": "200",
        "y": "1600"
      },
      "tags": [
        "Works",
        "English"
      ]
    }
  ],
  "name": "Rokaya",
  "startnode": "1",
  "creator": "Twine",
  "creator-version": "2.3.15",
  "ifid": "ED8669A8-1B16-4716-A904-394A793A8195"
}