{
  "passages": [
    {
      "text": "@showIfGameHasBeenPlayed TheIntruder\n@passive\n[[Hello|Sol 1-1]]",
      "links": [
        {
          "name": "Hello|Sol 1-1",
          "link": "Hello|Sol 1-1",
          "broken": true
        }
      ],
      "name": "Sol-1",
      "pid": "1",
      "position": {
        "x": "422",
        "y": "54"
      }
    },
    {
      "text": "Slt\n\nAlex m’a parlé de toi.\n\n[[En bien ?|Sol 1-2]]\n[[Elle m’a aussi parlé de toi|Sol 1-3]]",
      "links": [
        {
          "name": "En bien ?|Sol 1-2",
          "link": "En bien ?|Sol 1-2",
          "broken": true
        },
        {
          "name": "Elle m’a aussi parlé de toi|Sol 1-3",
          "link": "Elle m’a aussi parlé de toi|Sol 1-3",
          "broken": true
        }
      ],
      "name": "Sol 1-1",
      "pid": "40",
      "position": {
        "x": "417",
        "y": "189"
      }
    },
    {
      "text": "A ton avis ?\n\n[[Oui|Sol 1-4]]\n[[Ben, je sais pas... On s’est parlé 5 minutes...|Sol 1-5]]",
      "links": [
        {
          "name": "Oui|Sol 1-4",
          "link": "Oui|Sol 1-4",
          "broken": true
        },
        {
          "name": "Ben, je sais pas... On s’est parlé 5 minutes...|Sol 1-5",
          "link": "Ben, je sais pas... On s’est parlé 5 minutes...|Sol 1-5",
          "broken": true
        }
      ],
      "name": "Sol 1-2",
      "pid": "2",
      "position": {
        "x": "339",
        "y": "321"
      }
    },
    {
      "text": "Nous jouons donc à armes égales.\n\n[[A armes égal ? Je ne suis pas venu ici pour me battre, ok ?|Sol 1-10]]\n[[Tu veux te battre ? Tu es certaine d’être de taille ?|Sol 1-11]]",
      "links": [
        {
          "name": "A armes égal ? Je ne suis pas venu ici pour me battre, ok ?|Sol 1-10",
          "link": "A armes égal ? Je ne suis pas venu ici pour me battre, ok ?|Sol 1-10",
          "broken": true
        },
        {
          "name": "Tu veux te battre ? Tu es certaine d’être de taille ?|Sol 1-11",
          "link": "Tu veux te battre ? Tu es certaine d’être de taille ?|Sol 1-11",
          "broken": true
        }
      ],
      "name": "Sol 1-3",
      "pid": "3",
      "position": {
        "x": "492",
        "y": "321"
      }
    },
    {
      "text": "Ok. De l’assurance. Je respecte ça.\nQue penses-tu d’Alex ?\n\n[[Ok, doucement. On se connait pas. Pourquoi je te parlerais d'elle ?|Sol 1-6]] ",
      "links": [
        {
          "name": "Ok, doucement. On se connait pas. Pourquoi je te parlerais d'elle ?|Sol 1-6",
          "link": "Ok, doucement. On se connait pas. Pourquoi je te parlerais d'elle ?|Sol 1-6",
          "broken": true
        }
      ],
      "name": "Sol 1-4",
      "pid": "4",
      "position": {
        "x": "264",
        "y": "471"
      }
    },
    {
      "text": "I see. Timide.\nJe vais faire avec.\nQue penses-tu d’Alex ? \n\n[[Pourquoi ce que je pense d'Alex t'intéresse ?|Sol 1-6]]",
      "links": [
        {
          "name": "Pourquoi ce que je pense d'Alex t'intéresse ?|Sol 1-6",
          "link": "Pourquoi ce que je pense d'Alex t'intéresse ?|Sol 1-6",
          "broken": true
        }
      ],
      "name": "Sol 1-5",
      "pid": "5",
      "position": {
        "x": "414",
        "y": "471"
      }
    },
    {
      "text": "C’est toi qui dit ça. \n@wait 1 Il n’y a pas une situation dans la vie qui ne vaille pas la peine de se battre.\n@wait 2 Chaque événement est l’occasion de s’améliorer. Je cherche toujours à être une better version de moi-même. C’est pour ça que j’aime  ce jeu du carnet d’adresse. La première fois que j’ai joué, j’ai cancelled deux true contacts avant de trouver l'intruder. Je me suis rendue compte que je ne savais pas qui étaient les gens dans mon propre répertoire téléphonique.\n@wait 7 I felt so bad.\n@wait 8 Désormais, je connais mes contacts par coeur. Aujourd'hui, ma force, c’est mon carnet d’adresse.\n\n[[...D’accord. Et bien maintenant, je vais vous laisser tranquille, toi et ton carnet d’adresse.|Sol 1-12]]",
      "links": [
        {
          "name": "...D’accord. Et bien maintenant, je vais vous laisser tranquille, toi et ton carnet d’adresse.|Sol 1-12",
          "link": "...D’accord. Et bien maintenant, je vais vous laisser tranquille, toi et ton carnet d’adresse.|Sol 1-12",
          "broken": true
        }
      ],
      "name": "Sol 1-10",
      "pid": "6",
      "position": {
        "x": "532",
        "y": "471"
      }
    },
    {
      "text": "Wait !\nJe voudrais savoir.\nQu’est-ce que tu penses d’Alex ?\n\n[[Ok, doucement. On se connait pas. Pourquoi je te parlerais d'elle ?|Sol 1-6]]\n[[Ça ne te regarde pas.|Sol 1-20]]",
      "links": [
        {
          "name": "Ok, doucement. On se connait pas. Pourquoi je te parlerais d'elle ?|Sol 1-6",
          "link": "Ok, doucement. On se connait pas. Pourquoi je te parlerais d'elle ?|Sol 1-6",
          "broken": true
        },
        {
          "name": "Ça ne te regarde pas.|Sol 1-20",
          "link": "Ça ne te regarde pas.|Sol 1-20",
          "broken": true
        }
      ],
      "name": "Sol 1-12",
      "pid": "7",
      "position": {
        "x": "442",
        "y": "657"
      }
    },
    {
      "text": "De la hargne ! I like it !\nJ’aime les gens prêts à se battre pour défendre ce qu’ils sont.\nC’est cet état d’esprit qui m’a amené à devenir top player à Gao The Intruder.\nTu pourrais me devenir sympathique.\n\n[[Ça n’a pas l’air donné à tout le monde.|Sol 1-13]]\n",
      "links": [
        {
          "name": "Ça n’a pas l’air donné à tout le monde.|Sol 1-13",
          "link": "Ça n’a pas l’air donné à tout le monde.|Sol 1-13",
          "broken": true
        }
      ],
      "name": "Sol 1-11",
      "pid": "8",
      "position": {
        "x": "654",
        "y": "471"
      }
    },
    {
      "text": "Tous les insight concernant Alex sont importants. \n\n[[Je ne comprends rien à ce que tu racontes.|Sol 1-7]]\n[[Tous les insights !? Tu veux un benchmark aussi ?|Sol 1-7]] ",
      "links": [
        {
          "name": "Je ne comprends rien à ce que tu racontes.|Sol 1-7",
          "link": "Je ne comprends rien à ce que tu racontes.|Sol 1-7",
          "broken": true
        },
        {
          "name": "Tous les insights !? Tu veux un benchmark aussi ?|Sol 1-7",
          "link": "Tous les insights !? Tu veux un benchmark aussi ?|Sol 1-7",
          "broken": true
        }
      ],
      "name": "Sol 1-6",
      "pid": "9",
      "position": {
        "x": "321",
        "y": "806"
      }
    },
    {
      "text": "C’est une fin de non recevoir ?\n\n[[Oui, cette discussion doit s’arrêter|Sol 1-21]]\n[[Je ne comprends pas ta façon de réfléchir.|Sol 1-22]]",
      "links": [
        {
          "name": "Oui, cette discussion doit s’arrêter|Sol 1-21",
          "link": "Oui, cette discussion doit s’arrêter|Sol 1-21",
          "broken": true
        },
        {
          "name": "Je ne comprends pas ta façon de réfléchir.|Sol 1-22",
          "link": "Je ne comprends pas ta façon de réfléchir.|Sol 1-22",
          "broken": true
        }
      ],
      "name": "Sol 1-20",
      "pid": "10",
      "position": {
        "x": "580",
        "y": "803"
      }
    },
    {
      "text": "C’est ta position and I respect that.\nMais je finirai par savoir ce qu’elle pense, tu sais. Remember : quand je veux une information, je finis toujours par l’obtenir. Always.\n@insertMedia:gao-Gao_the_prosecutor.gif\n\t\n[[T’es vraiment flippante…|Sol 1-44]]\n",
      "links": [
        {
          "name": "T’es vraiment flippante…|Sol 1-44",
          "link": "T’es vraiment flippante…|Sol 1-44",
          "broken": true
        }
      ],
      "name": "Sol 1-21",
      "pid": "11",
      "position": {
        "x": "595",
        "y": "948"
      }
    },
    {
      "text": "C’est un compliment ? C’est un compliment.\n\n[[-_-’]]\n[[><]]",
      "links": [
        {
          "name": "-_-’",
          "link": "-_-’",
          "pid": "13"
        },
        {
          "name": "><",
          "link": "><",
          "broken": true
        }
      ],
      "name": "Sol 1-44",
      "pid": "12",
      "position": {
        "x": "1211",
        "y": "2934"
      }
    },
    {
      "text": "-_-’",
      "name": "-_-’",
      "pid": "13",
      "position": {
        "x": "1136",
        "y": "3084"
      }
    },
    {
      "text": "><",
      "name": "><",
      "pid": "14",
      "position": {
        "x": "1286",
        "y": "3084"
      }
    },
    {
      "text": "Je me pose des questions sur les gens que je m’apprête à laisser entrer dans ma vie et ça me semble normal. \nPas toi ?\n\n[[Sol 1-23]]\n[[Sol 1-24]]",
      "links": [
        {
          "name": "Sol 1-23",
          "link": "Sol 1-23",
          "pid": "16"
        },
        {
          "name": "Sol 1-24",
          "link": "Sol 1-24",
          "pid": "17"
        }
      ],
      "name": "Sol 1-7",
      "pid": "15",
      "position": {
        "x": "321",
        "y": "956"
      }
    },
    {
      "text": "Je vois pas ce qui te choques. Tu t’y prends comment, toi \n\n[[Sol 1-14]]\n[[Je discute directement avec la personne, j’apprends à la connaître… Ce genre de trucs déments que tout le monde fait...|Sol 1-14]]",
      "links": [
        {
          "name": "Sol 1-14",
          "link": "Sol 1-14",
          "pid": "18"
        },
        {
          "name": "Je discute directement avec la personne, j’apprends à la connaître… Ce genre de trucs déments que tout le monde fait...|Sol 1-14",
          "link": "Je discute directement avec la personne, j’apprends à la connaître… Ce genre de trucs déments que tout le monde fait...|Sol 1-14",
          "broken": true
        }
      ],
      "name": "Sol 1-23",
      "pid": "16",
      "position": {
        "x": "509",
        "y": "1139"
      }
    },
    {
      "text": "Pas du tout. Je vois pas pourquoi tu dis ça. \n\n[[Alors je me demande comment tu te comportes face à des choses qui te font peur…|Sol 1-25]]",
      "links": [
        {
          "name": "Alors je me demande comment tu te comportes face à des choses qui te font peur…|Sol 1-25",
          "link": "Alors je me demande comment tu te comportes face à des choses qui te font peur…|Sol 1-25",
          "broken": true
        }
      ],
      "name": "Sol 1-24",
      "pid": "17",
      "position": {
        "x": "665",
        "y": "1143"
      }
    },
    {
      "text": "Chacun ses méthodes.\nMoi j’enquête et ça me réussi très bien. \nBTW, il va falloir que j’évalue les risques, te concernant.\n\n[[Haha ! Attends, à quel moment j’ai dit que je voulais entrer dans ta vie ?|Sol 1-28]]",
      "links": [
        {
          "name": "Haha ! Attends, à quel moment j’ai dit que je voulais entrer dans ta vie ?|Sol 1-28",
          "link": "Haha ! Attends, à quel moment j’ai dit que je voulais entrer dans ta vie ?|Sol 1-28",
          "broken": true
        }
      ],
      "name": "Sol 1-14",
      "pid": "18",
      "position": {
        "x": "400",
        "y": "1292"
      }
    },
    {
      "text": "Si tu entres dans la vie d’Alex, tu vas entrer dans la mienne.\n\n[[Calme-toi, je connais Alex depuis très peu de temps.|Sol 1-29]]",
      "links": [
        {
          "name": "Calme-toi, je connais Alex depuis très peu de temps.|Sol 1-29",
          "link": "Calme-toi, je connais Alex depuis très peu de temps.|Sol 1-29",
          "broken": true
        }
      ],
      "name": "Sol 1-28",
      "pid": "19",
      "position": {
        "x": "552",
        "y": "1742"
      }
    },
    {
      "text": "C’est suffisant pour que j’évalue les risques.\nAnyway, j’ai besoin de ta date et de ton lieu de naissance. J’espère que tu n’es pas Scorpion. Ajay est scorpions. Je déteste les scorpions.\n\n[[C’est un peu arbitraire, non?|Sol 1-30]]\n[[Ne dis pas de mal des Scorpions, stp.|Sol 1-31]]\n[[Ouais. Sale engeance, les scorpions.|Sol 1-32]]",
      "links": [
        {
          "name": "C’est un peu arbitraire, non?|Sol 1-30",
          "link": "C’est un peu arbitraire, non?|Sol 1-30",
          "broken": true
        },
        {
          "name": "Ne dis pas de mal des Scorpions, stp.|Sol 1-31",
          "link": "Ne dis pas de mal des Scorpions, stp.|Sol 1-31",
          "broken": true
        },
        {
          "name": "Ouais. Sale engeance, les scorpions.|Sol 1-32",
          "link": "Ouais. Sale engeance, les scorpions.|Sol 1-32",
          "broken": true
        }
      ],
      "name": "Sol 1-29",
      "pid": "20",
      "position": {
        "x": "550",
        "y": "1892"
      }
    },
    {
      "text": "Crois-moi, c’est l’expérience qui parle.\n\n[[Mouais. Je te suivrais pas là dessus.|Sol 1-33]]",
      "links": [
        {
          "name": "Mouais. Je te suivrais pas là dessus.|Sol 1-33",
          "link": "Mouais. Je te suivrais pas là dessus.|Sol 1-33",
          "broken": true
        }
      ],
      "name": "Sol 1-30",
      "pid": "21",
      "position": {
        "x": "400",
        "y": "2042"
      }
    },
    {
      "text": "Ha. Tu es scorpion, peut-être ?\n\n[[Je suis scorpion|Sol 1-34]]\n[[Non, pas du tout|Sol 1-35]]\n",
      "links": [
        {
          "name": "Je suis scorpion|Sol 1-34",
          "link": "Je suis scorpion|Sol 1-34",
          "broken": true
        },
        {
          "name": "Non, pas du tout|Sol 1-35",
          "link": "Non, pas du tout|Sol 1-35",
          "broken": true
        }
      ],
      "name": "Sol 1-31",
      "pid": "22",
      "position": {
        "x": "550",
        "y": "2042"
      }
    },
    {
      "text": "On est toujours déçu par les scopions. Always.\nJe pourrais te parler des heures d'Ajay... Mais on ne va pas s'éterniser sur les bad memories.\nVoyons la suite pour toi.\n\n[[Ajay ? Il s'est passé quoi avec Ajay ?|Sol 1-36]]\n[[La suite?|Sol 1-37]]",
      "links": [
        {
          "name": "Ajay ? Il s'est passé quoi avec Ajay ?|Sol 1-36",
          "link": "Ajay ? Il s'est passé quoi avec Ajay ?|Sol 1-36",
          "broken": true
        },
        {
          "name": "La suite?|Sol 1-37",
          "link": "La suite?|Sol 1-37",
          "broken": true
        }
      ],
      "name": "Sol 1-32",
      "pid": "23",
      "position": {
        "x": "715",
        "y": "2044"
      }
    },
    {
      "text": "If you want. De toute façon, l’astrologie n’est pas le seul critère. \n\n[[Et c’est quoi, les autres critères ?|Sol 1-37]]\n[[Et bien, ça me rassure de savoir qu’il y a d’autres « critères ».|Sol 1-37]]",
      "links": [
        {
          "name": "Et c’est quoi, les autres critères ?|Sol 1-37",
          "link": "Et c’est quoi, les autres critères ?|Sol 1-37",
          "broken": true
        },
        {
          "name": "Et bien, ça me rassure de savoir qu’il y a d’autres « critères ».|Sol 1-37",
          "link": "Et bien, ça me rassure de savoir qu’il y a d’autres « critères ».|Sol 1-37",
          "broken": true
        }
      ],
      "name": "Sol 1-33",
      "pid": "24",
      "position": {
        "x": "400",
        "y": "2192"
      }
    },
    {
      "text": "J’ai aussi besoin de savoir... Tu as ton permis ? Tu as déjà au des amendes pour excès de vitesse ? Pour avoir brûlé un feu rouge ? \nTu as des allergies ? Tes parents sont divorcés ? Tu es dans une relation stable ou célibataire ? Tu as déjà trompé ton partenaire ou est-ce que tu as déjà eu une relation avec une personne mariée ? \nLa date de ta dernière visite chez le dentiste ?\n\n[[Stop. Tout ceci va trop loin.|Sol 1-38]]\n[[Haha. Je me sens pas très à l’aise.|Sol 1-39]]",
      "links": [
        {
          "name": "Stop. Tout ceci va trop loin.|Sol 1-38",
          "link": "Stop. Tout ceci va trop loin.|Sol 1-38",
          "broken": true
        },
        {
          "name": "Haha. Je me sens pas très à l’aise.|Sol 1-39",
          "link": "Haha. Je me sens pas très à l’aise.|Sol 1-39",
          "broken": true
        }
      ],
      "name": "Sol 1-37",
      "pid": "25",
      "position": {
        "x": "524",
        "y": "2369"
      }
    },
    {
      "text": "Ok.\nFine.\nJe prends note.\nRétention d’information et refus d’obtempérer. Tu as des problèmes avec l’autorité.\n\n[[Mais quel est le rapport ?|Sol 1-40]]\n[[D’où tu aurais de l’autorité sur moi ?|Sol 1-40]]",
      "links": [
        {
          "name": "Mais quel est le rapport ?|Sol 1-40",
          "link": "Mais quel est le rapport ?|Sol 1-40",
          "broken": true
        },
        {
          "name": "D’où tu aurais de l’autorité sur moi ?|Sol 1-40",
          "link": "D’où tu aurais de l’autorité sur moi ?|Sol 1-40",
          "broken": true
        }
      ],
      "name": "Sol 1-38",
      "pid": "26",
      "position": {
        "x": "492",
        "y": "2570"
      }
    },
    {
      "text": "C'est trop speed pour toi ? Je n’aime pas laisser traîner les choses.\nD’ailleurs, j’ai proposé un date à Alex et pour l’instant, elle ne me répond pas. Tu sais quelque chose ? Elle t’a parlé de moi ? \n\n[[Heu… oui et pour l’instant elle hésite|Sol 1-42]]\n[[Je ne vais pas répondre à sa place, tu sais.|Sol 1-43]]",
      "links": [
        {
          "name": "Heu… oui et pour l’instant elle hésite|Sol 1-42",
          "link": "Heu… oui et pour l’instant elle hésite|Sol 1-42",
          "broken": true
        },
        {
          "name": "Je ne vais pas répondre à sa place, tu sais.|Sol 1-43",
          "link": "Je ne vais pas répondre à sa place, tu sais.|Sol 1-43",
          "broken": true
        }
      ],
      "name": "Sol 1-39",
      "pid": "27",
      "position": {
        "x": "641",
        "y": "2567"
      }
    },
    {
      "text": "Je suis certaine que tu es du genre à t’inscrire sur les réseaux sociaux avec un faux nom ou à aimer faire des petites choses illégales :\ntraverser en dehors des clous, regarder de temps en temps des films piratés, et éventuellement avoir un usage régulier de « drogue récréative » au mépris de toutes les campagnes de sensibilisation. \nJe sais où tout ça mène et au final, ça ne fait pas de toi une bonne personne pour Alex.\n\n[[Mais t’es pas bien ?! On va arrêter ici cette conversation qui devient vraiment malsaine!|Sol 1-41]]",
      "links": [
        {
          "name": "Mais t’es pas bien ?! On va arrêter ici cette conversation qui devient vraiment malsaine!|Sol 1-41",
          "link": "Mais t’es pas bien ?! On va arrêter ici cette conversation qui devient vraiment malsaine!|Sol 1-41",
          "broken": true
        }
      ],
      "name": "Sol 1-40",
      "pid": "28",
      "position": {
        "x": "491",
        "y": "2720"
      }
    },
    {
      "text": "Si tu veux. Garde tes petits secrets. Mais souviens-toi : quand je veux une information, je finis toujours par l’obtenir. Always.\n\n[[T’es vraiment flippante…|Sol 1-44]]",
      "links": [
        {
          "name": "T’es vraiment flippante…|Sol 1-44",
          "link": "T’es vraiment flippante…|Sol 1-44",
          "broken": true
        }
      ],
      "name": "Sol 1-41",
      "pid": "29",
      "position": {
        "x": "491",
        "y": "2868"
      }
    },
    {
      "text": "Oh. I have a baaaad feeling about this. La suite va peut-être me détromper. May be. Mais j’en doute.\n\n[[La suite?|Sol 1-37]]",
      "links": [
        {
          "name": "La suite?|Sol 1-37",
          "link": "La suite?|Sol 1-37",
          "broken": true
        }
      ],
      "name": "Sol 1-34",
      "pid": "30",
      "position": {
        "x": "520",
        "y": "2192"
      }
    },
    {
      "text": "Tant mieux ! Tu m’as fais peur ! \nÇa fait un good point pour toi. \nVoyons si les autres critères confirment le first contact.\n\n[[les autres critères ?|Sol 1-37]]\n",
      "links": [
        {
          "name": "les autres critères ?|Sol 1-37",
          "link": "les autres critères ?|Sol 1-37",
          "broken": true
        }
      ],
      "name": "Sol 1-35",
      "pid": "31",
      "position": {
        "x": "625",
        "y": "2190"
      }
    },
    {
      "text": "C'est le top player à Prosecutor. \nJe pensais enfin avoir trouvé un Scorpion à qui faire confiance... Il n'est pas safe. Ce que tu lui racontes tombe dans les mauvaises oreilles. Ses petits jeux ne sont pas innocents. \nAnyway, cette rencontre a challenge mes principes. Depuis, je suis précautionneuse avec les new faces.\nRevenons à ton cas. L'astrologie n'est pas le seul critère. J'ai encore quelques questions.\n\n[[Il y a encore beaucoup de questions ?|Sol 1-37]]",
      "links": [
        {
          "name": "Il y a encore beaucoup de questions ?|Sol 1-37",
          "link": "Il y a encore beaucoup de questions ?|Sol 1-37",
          "broken": true
        }
      ],
      "name": "Sol 1-36",
      "pid": "32",
      "position": {
        "x": "745",
        "y": "2193"
      }
    },
    {
      "text": "Merci pour l’insight. Tu es peut-être utile après tout.",
      "name": "Sol 1-42",
      "pid": "33",
      "position": {
        "x": "636",
        "y": "3085"
      }
    },
    {
      "text": "C’est ta position et je respecte ça.\nMais je finirai par savoir ce qu’elle pense, tu sais. Quand je veux une information, je finis toujours par l’obtenir.\n@insertMedia:gao-Gao_the_spy.gif\n\t\n[[T’es vraiment flippante…|Sol 1-44]]",
      "links": [
        {
          "name": "T’es vraiment flippante…|Sol 1-44",
          "link": "T’es vraiment flippante…|Sol 1-44",
          "broken": true
        }
      ],
      "name": "Sol 1-43",
      "pid": "34",
      "position": {
        "x": "716",
        "y": "2717"
      }
    },
    {
      "text": "Je n’ai peur de rien.\n\n[[Haha. Oui, bien sur.|Sol 1-26]]",
      "links": [
        {
          "name": "Haha. Oui, bien sur.|Sol 1-26",
          "link": "Haha. Oui, bien sur.|Sol 1-26",
          "broken": true
        }
      ],
      "name": "Sol 1-25",
      "pid": "35",
      "position": {
        "x": "666",
        "y": "1288"
      }
    },
    {
      "text": "Je kill les risques avant qu’ils apparaissent.\nCrois-moi, il n’y a pas grand-chose que je ne maîtrise pas.\n\n[[J’ai peur de commencer à te croire…|Sol 1-27]]",
      "links": [
        {
          "name": "J’ai peur de commencer à te croire…|Sol 1-27",
          "link": "J’ai peur de commencer à te croire…|Sol 1-27",
          "broken": true
        }
      ],
      "name": "Sol 1-26",
      "pid": "36",
      "position": {
        "x": "665",
        "y": "1438"
      }
    },
    {
      "text": "Donc la question suivante, c’est de savoir si tu es un risque ou pas.\n\n[[Haha ! Attends, à quel moment j’ai dit que je voulais entrer dans ta vie ?|Sol 1-28]]\n",
      "links": [
        {
          "name": "Haha ! Attends, à quel moment j’ai dit que je voulais entrer dans ta vie ?|Sol 1-28",
          "link": "Haha ! Attends, à quel moment j’ai dit que je voulais entrer dans ta vie ?|Sol 1-28",
          "broken": true
        }
      ],
      "name": "Sol 1-27",
      "pid": "37",
      "position": {
        "x": "665",
        "y": "1588"
      }
    },
    {
      "text": "Et bien, c'est plutôt easy. \nJe me pose des questions sur les gens que je m’apprête à laisser entrer dans ma vie. Seems legit. \n\n[[De là à enquêter sur eux auprès d’inconnus…|Sol 1-23]]\n[[On dirait que laisser des gens entrer dans ta vie te terrorise.|Sol 1-24]]",
      "links": [
        {
          "name": "De là à enquêter sur eux auprès d’inconnus…|Sol 1-23",
          "link": "De là à enquêter sur eux auprès d’inconnus…|Sol 1-23",
          "broken": true
        },
        {
          "name": "On dirait que laisser des gens entrer dans ta vie te terrorise.|Sol 1-24",
          "link": "On dirait que laisser des gens entrer dans ta vie te terrorise.|Sol 1-24",
          "broken": true
        }
      ],
      "name": "Sol 1-22",
      "pid": "38",
      "position": {
        "x": "712",
        "y": "954"
      }
    },
    {
      "text": "Non. Je suis très méfiante avec les new faces. J’ai trop donné.\nAnyway, j'ai process le truc et j'ai établi un protocole de rencontre.\n\n[[Ca me semble un peu extrême|Sol 1-14]]",
      "links": [
        {
          "name": "Ca me semble un peu extrême|Sol 1-14",
          "link": "Ca me semble un peu extrême|Sol 1-14",
          "broken": true
        }
      ],
      "name": "Sol 1-13",
      "pid": "39",
      "position": {
        "x": "630",
        "y": "667"
      }
    }
  ],
  "name": "Sol",
  "startnode": "1",
  "creator": "Twine",
  "creator-version": "2.3.14",
  "ifid": "34CEAD63-F2CC-47EA-AD9B-30CDB88C6ED1"
}

