{
  "passages": [
    {
      "text": "@showIfGameHasBeenPlayed ThePhotographer\n@passive\n[[Hola.|Rokaya 1-1]]\n",
      "links": [
        {
          "name": "Hola.|Rokaya 1-1",
          "link": "Hola.|Rokaya 1-1",
          "broken": true
        }
      ],
      "name": "Rokaya 1",
      "pid": "1",
      "position": {
        "x": "408",
        "y": "172"
      },
      "tags": [
        "Works",
        "Español"
      ]
    },
    {
      "text": ":( \n\n¡Es mi juego preferido! ^^ Tengo... Tenía muy buenos puntajes. Aunque en realidad no debería jactarme tanto porque soy colorista. :)\n\n[[¿Colorista?|Rokaya 1-4]]",
      "links": [
        {
          "name": "¿Colorista?|Rokaya 1-4",
          "link": "¿Colorista?|Rokaya 1-4",
          "broken": true
        }
      ],
      "name": "Rokaya 1-3",
      "pid": "2",
      "position": {
        "x": "527",
        "y": "537"
      },
      "tags": [
        "Works",
        "Español"
      ]
    },
    {
      "text": "Trabajo en una fábrica de fabricación de pinturas. Para serte sincera, soy capaz de ver los colores con tan sólo ver sus códigos CMYK. También escribo artículos en línea: \"¡10 combinaciones increíbles para pintar las paredes de tu casa!\" Cosas de ese estilo. ^^\n\n[[¡Ay! ¡De pronto me puedes dar consejos!|Rokaya 1-6]]\n[[Cómo no vas a ganar... Solo tienes que tomarle fotos a un par de tarros de pintura. -_-|Rokaya 1-5]]",
      "links": [
        {
          "name": "¡Ay! ¡De pronto me puedes dar consejos!|Rokaya 1-6",
          "link": "¡Ay! ¡De pronto me puedes dar consejos!|Rokaya 1-6",
          "broken": true
        },
        {
          "name": "Cómo no vas a ganar... Solo tienes que tomarle fotos a un par de tarros de pintura. -_-|Rokaya 1-5",
          "link": "Cómo no vas a ganar... Solo tienes que tomarle fotos a un par de tarros de pintura. -_-|Rokaya 1-5",
          "broken": true
        }
      ],
      "name": "Rokaya 1-4",
      "pid": "3",
      "position": {
        "x": "445",
        "y": "685"
      },
      "tags": [
        "Works",
        "Español"
      ]
    },
    {
      "text": "No es tan simple en realidad.\n\n[[Déjame adivinar. El juego reconoce tu \"vena artística\".|Rokaya 1-7]]",
      "links": [
        {
          "name": "Déjame adivinar. El juego reconoce tu \"vena artística\".|Rokaya 1-7",
          "link": "Déjame adivinar. El juego reconoce tu \"vena artística\".|Rokaya 1-7",
          "broken": true
        }
      ],
      "name": "Rokaya 1-5",
      "pid": "4",
      "position": {
        "x": "339",
        "y": "841"
      },
      "tags": [
        "Works",
        "Español"
      ]
    },
    {
      "text": "El juego, no. Pero sus dueños, sí. \n... Igual no sirve de nada.\n\n[[¿Qué quieres decir?|Rokaya 1-8]]",
      "links": [
        {
          "name": "¿Qué quieres decir?|Rokaya 1-8",
          "link": "¿Qué quieres decir?|Rokaya 1-8",
          "broken": true
        }
      ],
      "name": "Rokaya 1-7",
      "pid": "5",
      "position": {
        "x": "332",
        "y": "987"
      },
      "tags": [
        "Works",
        "Español"
      ]
    },
    {
      "text": "Todo esto es solo un juego. Recuérdalo.\n\n[[o_O Obvio es solo un juego.|Rokaya 1-9]]",
      "links": [
        {
          "name": "o_O Obvio es solo un juego.|Rokaya 1-9",
          "link": "o_O Obvio es solo un juego.|Rokaya 1-9",
          "broken": true
        }
      ],
      "name": "Rokaya 1-8",
      "pid": "6",
      "position": {
        "x": "334",
        "y": "1146"
      },
      "tags": [
        "Works",
        "Español"
      ]
    },
    {
      "text": ":) No lo olvides.",
      "name": "Rokaya 1-10",
      "pid": "7",
      "position": {
        "x": "596",
        "y": "1194"
      },
      "tags": [
        "Works",
        "Español"
      ]
    },
    {
      "text": "¿Un consejo? Mmmm... No te involucres mucho con el juego. A la larga no lo vale.\n\n[[¿Ese es tu consejo, en serio? ¿Te da tanto miedo que alguien rompa tu record?|Rokaya 1-11]]\n[[¿Por qué habría de involucrarme? xD Es sólo un juego...|Rokaya 1-10]]",
      "links": [
        {
          "name": "¿Ese es tu consejo, en serio? ¿Te da tanto miedo que alguien rompa tu record?|Rokaya 1-11",
          "link": "¿Ese es tu consejo, en serio? ¿Te da tanto miedo que alguien rompa tu record?|Rokaya 1-11",
          "broken": true
        },
        {
          "name": "¿Por qué habría de involucrarme? xD Es sólo un juego...|Rokaya 1-10",
          "link": "¿Por qué habría de involucrarme? xD Es sólo un juego...|Rokaya 1-10",
          "broken": true
        }
      ],
      "name": "Rokaya 1-6",
      "pid": "8",
      "position": {
        "x": "657",
        "y": "840"
      },
      "tags": [
        "Works",
        "Español"
      ]
    },
    {
      "text": "¡A mí me encanta!\nTengo... Bueno, tenía muy buenos puntajes. Pero creo que era un poco trampa teniendo en cuenta que soy colorista. :p\n\n[[¡Colorista?|Rokaya 1-4]]",
      "links": [
        {
          "name": "¡Colorista?|Rokaya 1-4",
          "link": "¡Colorista?|Rokaya 1-4",
          "broken": true
        }
      ],
      "name": "Rokaya 1-2",
      "pid": "9",
      "position": {
        "x": "337",
        "y": "538"
      },
      "tags": [
        "Works",
        "Español"
      ]
    },
    {
      "text": "¡Hola! ¡Veo que has estado jugando Gao el Fotógrafo! ;-)\n\n[[¡Sí! Me ha gustado mucho.|Rokaya 1-2]]\n[[Sí. Pero no me va muy bien. :(|Rokaya 1-3]]",
      "links": [
        {
          "name": "¡Sí! Me ha gustado mucho.|Rokaya 1-2",
          "link": "¡Sí! Me ha gustado mucho.|Rokaya 1-2",
          "broken": true
        },
        {
          "name": "Sí. Pero no me va muy bien. :(|Rokaya 1-3",
          "link": "Sí. Pero no me va muy bien. :(|Rokaya 1-3",
          "broken": true
        }
      ],
      "name": "Rokaya 1-1",
      "pid": "10",
      "position": {
        "x": "424",
        "y": "368"
      },
      "tags": [
        "Works",
        "Español"
      ]
    },
    {
      "text": "Gana todo lo que quieras. A la larga nada te pertenece. Ni siquiera la victoria.",
      "name": "Rokaya 1-11",
      "pid": "11",
      "position": {
        "x": "827",
        "y": "1190"
      },
      "tags": [
        "Works",
        "Español"
      ]
    },
    {
      "text": ";)",
      "name": "Rokaya 1-9",
      "pid": "12",
      "position": {
        "x": "334",
        "y": "1296"
      },
      "tags": [
        "Works",
        "Español"
      ]
    }
  ],
  "name": "Rokaya",
  "startnode": "1",
  "creator": "Twine",
  "creator-version": "2.3.15",
  "ifid": "ED8669A8-1B16-4716-A904-394A793A8195"
}