{
  "passages": [
    {
      "text": "@init\nTadaaam… hop !\nAlors, elle est pas belle ma messagerie faite maison ?\n\n[[Impressionant. Comment t’as fait ?|Nikki 3-1]]",
      "links": [
        {
          "name": "Impressionant. Comment t’as fait ?|Nikki 3-1",
          "link": "Impressionant. Comment t’as fait ?|Nikki 3-1",
          "broken": true
        }
      ],
      "name": "Nikki 3-0",
      "pid": "1",
      "position": {
        "x": "364",
        "y": "118"
      }
    },
    {
      "text": "J’ai taffé. J’ai le contrôle de l’accès, alors je suis un peu comme chez moi ici. Je me sens bien, je suis à deux doigts de refaire la déco. Mais bon, coder ce chat chiffré m’a demandé pas mal de taf, alors pour le moment, je suis en mode touriste.\n\n[[Le chat est chiffré ?|Nikki 3-2]]",
      "links": [
        {
          "name": "Le chat est chiffré ?|Nikki 3-2",
          "link": "Le chat est chiffré ?|Nikki 3-2",
          "broken": true
        }
      ],
      "name": "Nikki 3-1",
      "pid": "2",
      "position": {
        "x": "360",
        "y": "279"
      }
    },
    {
      "text": "Yep.  Nous sommes les seuls à pouvoir lire ces messages. C’est la magie du chiffffrement bout en bout. Tu t’en rends pas compte parce qu’on s’écrit normalement, mais contrairement au mini chat de gao.games, personne ne peut espionner nos conversations.\nSauf si tu fais des captures d’écrans et que tu les mails à quelqu’un du Studio. Au hasard, cette fouine d’Ally.\nMais pourquoi tu ferais ça, hein, bb ?\n\n[[Tu penses que le Studio lit tous nos messages ?|Nikki 3-3]]",
      "links": [
        {
          "name": "Tu penses que le Studio lit tous nos messages ?|Nikki 3-3",
          "link": "Tu penses que le Studio lit tous nos messages ?|Nikki 3-3",
          "broken": true
        }
      ],
      "name": "Nikki 3-2",
      "pid": "3",
      "position": {
        "x": "360",
        "y": "429"
      },
      "tags": [
        "connaissance"
      ]
    },
    {
      "text": "En théorie, ils peuvent le faire. Et vu les circonstances, allez, je dirais qu’il y a 99,9999 de chance qu’ils soient en train de décrypter le moindre émoji que t’as envoyé à Alex.\n\n[[Mais c’est des conversations privées !|Nikki 3-4]]",
      "links": [
        {
          "name": "Mais c’est des conversations privées !|Nikki 3-4",
          "link": "Mais c’est des conversations privées !|Nikki 3-4",
          "broken": true
        }
      ],
      "name": "Nikki 3-3",
      "pid": "4",
      "position": {
        "x": "359",
        "y": "579"
      }
    },
    {
      "text": "Elles l’ont jamais vraiment été, chaton.\nJe te rassure, le Studio est pas le seul à faire ça. Et ça peut concerner absolument toutes les données qui transitent par les serveurs des boites du web. Les petites comme les grosses.\n\n[[Mais ça veut dire que y’a des gens qui lisent tout ce que j’écris sur mon téléphone si c’est pas chiffré ?|Nikki 3-5]]",
      "links": [
        {
          "name": "Mais ça veut dire que y’a des gens qui lisent tout ce que j’écris sur mon téléphone si c’est pas chiffré ?|Nikki 3-5",
          "link": "Mais ça veut dire que y’a des gens qui lisent tout ce que j’écris sur mon téléphone si c’est pas chiffré ?|Nikki 3-5",
          "broken": true
        }
      ],
      "name": "Nikki 3-4",
      "pid": "5",
      "position": {
        "x": "353",
        "y": "728"
      }
    },
    {
      "text": "Impossible de savoir s’ils le font systématiquement ou non, mais t’as capté : ils le peuvent s’ils le veulent.\nEt c’est pareil pour tous tes appels téléphoniques, les photos ou vidéos que t’envoies, les endroits où tu vas, etc. Dès que tu donnes une autorisation d’accès à une appli, toutes tes données peuvent être potentiellement exploitées.\nEt après, tout finit dans une base donnée, comme celle-ci.\n\n[[Pour quoi faire ?|Nikki 3-6]]",
      "links": [
        {
          "name": "Pour quoi faire ?|Nikki 3-6",
          "link": "Pour quoi faire ?|Nikki 3-6",
          "broken": true
        }
      ],
      "name": "Nikki 3-5",
      "pid": "6",
      "position": {
        "x": "358",
        "y": "878"
      },
      "tags": [
        "connaissance"
      ]
    },
    {
      "text": "Principalement à faire de l’argent.\nMais ça ne concerne pas que ta petite tête. Ce sont les données de milliards d’individus qui sont collectées. En vrai, ça prend une place de fou. Toute cette montagne hallucinante d’information est stockée dans de gigantesques centre-serveurs alimentés en électricité 24h/24.\nJe te raconte pas la facture énergétique.\n\n[[Parce qu’en plus, ça pollue ?|Nikki 3-7]]\n[[J’imagine bien...|Nikki 3-7]]",
      "links": [
        {
          "name": "Parce qu’en plus, ça pollue ?|Nikki 3-7",
          "link": "Parce qu’en plus, ça pollue ?|Nikki 3-7",
          "broken": true
        },
        {
          "name": "J’imagine bien...|Nikki 3-7",
          "link": "J’imagine bien...|Nikki 3-7",
          "broken": true
        }
      ],
      "name": "Nikki 3-6",
      "pid": "7",
      "position": {
        "x": "355",
        "y": "1008"
      },
      "tags": [
        "connaissance"
      ]
    },
    {
      "text": "Laisser traîner ses données, c’est comme ranger ses pizzas dans le frigo du voisin. C’est sympa, ça prend moins de place chez toi et c’est lui qui paie l’électricité.\nSauf que rien n’empêche le type de taper dans tes pizzas ou de se barrer avec le frigo.\n\n[[On s’en fout, ces pizzas sont duplicables à l’infini. Dans les faits, personne ne m’arnaque|Nikki 3-8]]\n[[Je suis d’accord, c’est pas la meilleure façon de garder ses pizzas|Nikki 3-13]]",
      "links": [
        {
          "name": "On s’en fout, ces pizzas sont duplicables à l’infini. Dans les faits, personne ne m’arnaque|Nikki 3-8",
          "link": "On s’en fout, ces pizzas sont duplicables à l’infini. Dans les faits, personne ne m’arnaque|Nikki 3-8",
          "broken": true
        },
        {
          "name": "Je suis d’accord, c’est pas la meilleure façon de garder ses pizzas|Nikki 3-13",
          "link": "Je suis d’accord, c’est pas la meilleure façon de garder ses pizzas|Nikki 3-13",
          "broken": true
        }
      ],
      "name": "Nikki 3-7",
      "pid": "8",
      "position": {
        "x": "356",
        "y": "1150"
      }
    },
    {
      "text": "OK. Mettons que dans ce frigo, il y ait des bouts de ton cerveau dans lequel un type a planté deux électrodes pour comprendre tes pensées, tes goûts, tes frustrations... Et il se fait de la thune en revendant les infos sans te demander ton avis.\nElle te plait plus cette image ?\n\n[[Je préférais la pizza.|Nikki 3-9]]",
      "links": [
        {
          "name": "Je préférais la pizza.|Nikki 3-9",
          "link": "Je préférais la pizza.|Nikki 3-9",
          "broken": true
        }
      ],
      "name": "Nikki 3-8",
      "pid": "9",
      "position": {
        "x": "594",
        "y": "1341"
      }
    },
    {
      "text": "Et ouai. On croyait jouer à un jeu avec un chat mignon et 5 minutes plus tard, tu retrouves ton cerveau découpé en tranches dans le frigo d’un type qui aime un peu trop les gants en latex.\nLife sucks, bb.\n\n[[Je veux pas finir dans le frigo d’un psychopathe !|Nikki 3-10]]\n[[C’est déplaisant|Nikki 3-14]]",
      "links": [
        {
          "name": "Je veux pas finir dans le frigo d’un psychopathe !|Nikki 3-10",
          "link": "Je veux pas finir dans le frigo d’un psychopathe !|Nikki 3-10",
          "broken": true
        },
        {
          "name": "C’est déplaisant|Nikki 3-14",
          "link": "C’est déplaisant|Nikki 3-14",
          "broken": true
        }
      ],
      "name": "Nikki 3-9",
      "pid": "10",
      "position": {
        "x": "602",
        "y": "1496"
      }
    },
    {
      "text": "J’aime quand tu paniques, bb. Par contre, j’ai pas l’âme d’un sauveur. Va falloir te bouger pour sortir du frigo.\nTu comprends ce qui ce joue avec cette base de données ?\n\n[[Pas vraiment|Nikki 3-11]]\n[[J’ai pas encore regardé|Nikki 3-11]]\n[[Oui. Faut faire quoi de tout ça?|Nikki 3-12]]",
      "links": [
        {
          "name": "Pas vraiment|Nikki 3-11",
          "link": "Pas vraiment|Nikki 3-11",
          "broken": true
        },
        {
          "name": "J’ai pas encore regardé|Nikki 3-11",
          "link": "J’ai pas encore regardé|Nikki 3-11",
          "broken": true
        },
        {
          "name": "Oui. Faut faire quoi de tout ça?|Nikki 3-12",
          "link": "Oui. Faut faire quoi de tout ça?|Nikki 3-12",
          "broken": true
        }
      ],
      "name": "Nikki 3-10",
      "pid": "11",
      "position": {
        "x": "51",
        "y": "1692"
      }
    },
    {
      "text": "Je te conseille de fouiller un peu, c’est instructif.\nOn reprendra cette conversation ensuite\n\n[[Effectivement, c’est instructif|Nikki 3-12]]",
      "links": [
        {
          "name": "Effectivement, c’est instructif|Nikki 3-12",
          "link": "Effectivement, c’est instructif|Nikki 3-12",
          "broken": true
        }
      ],
      "name": "Nikki 3-11",
      "pid": "12",
      "position": {
        "x": "544",
        "y": "1757"
      },
      "tags": [
        "show-if"
      ]
    },
    {
      "text": "On dirait que Blaze est en mode Wikileaks. Il a filé la base de données à Alex pour qu’elle diffuse l’info et qu’elle fasse péter un scandale.\nSérieux, le gars se découvre une conscience et son premier réflexe c’est la refiler à quelqu’un d’autre et se tirer à Hawaï.\n\n[[Il est à Hawaï !?|Nikki 3-15]]\n[[Il prend des risques, non ?|Nikki 3-16]]\n[[Il a quand même décidé de planter sa propre boite|Nikki 3-16]]",
      "links": [
        {
          "name": "Il est à Hawaï !?|Nikki 3-15",
          "link": "Il est à Hawaï !?|Nikki 3-15",
          "broken": true
        },
        {
          "name": "Il prend des risques, non ?|Nikki 3-16",
          "link": "Il prend des risques, non ?|Nikki 3-16",
          "broken": true
        },
        {
          "name": "Il a quand même décidé de planter sa propre boite|Nikki 3-16",
          "link": "Il a quand même décidé de planter sa propre boite|Nikki 3-16",
          "broken": true
        }
      ],
      "name": "Nikki 3-12",
      "pid": "13",
      "position": {
        "x": "473",
        "y": "2094"
      }
    },
    {
      "text": "Ravie que ma métaphore te plaise\nDu coup, tu comprends ce qui se joue ici.\n\n[[Pas vraiment|Nikki 3-11]]\n[[J’ai pas encore regardé|Nikki 3-11]]",
      "links": [
        {
          "name": "Pas vraiment|Nikki 3-11",
          "link": "Pas vraiment|Nikki 3-11",
          "broken": true
        },
        {
          "name": "J’ai pas encore regardé|Nikki 3-11",
          "link": "J’ai pas encore regardé|Nikki 3-11",
          "broken": true
        }
      ],
      "name": "Nikki 3-13",
      "pid": "14",
      "position": {
        "x": "252",
        "y": "1376"
      }
    },
    {
      "text": "Et ouai.\nDu coup, tu comprends ce qui ce joue ici ?\n\n[[Pas vraiment|Nikki 3-11]]\n[[J’ai pas encore regardé|Nikki 3-11]]\n[[Oui. Faut faire quoi de tout ça?|Nikki 3-12]]",
      "links": [
        {
          "name": "Pas vraiment|Nikki 3-11",
          "link": "Pas vraiment|Nikki 3-11",
          "broken": true
        },
        {
          "name": "J’ai pas encore regardé|Nikki 3-11",
          "link": "J’ai pas encore regardé|Nikki 3-11",
          "broken": true
        },
        {
          "name": "Oui. Faut faire quoi de tout ça?|Nikki 3-12",
          "link": "Oui. Faut faire quoi de tout ça?|Nikki 3-12",
          "broken": true
        }
      ],
      "name": "Nikki 3-14",
      "pid": "15",
      "position": {
        "x": "1071",
        "y": "1858"
      }
    },
    {
      "text": "Hein ? Mais non !\n\n[[Mais tu viens de dire...|Nikki 3-17]]",
      "links": [
        {
          "name": "Mais tu viens de dire...|Nikki 3-17",
          "link": "Mais tu viens de dire...|Nikki 3-17",
          "broken": true
        }
      ],
      "name": "Nikki 3-15",
      "pid": "16",
      "position": {
        "x": "393",
        "y": "2267"
      }
    },
    {
      "text": "Alooooors\nOn va partir de la base\nCe mec a fondé une boite qui compte plusieurs dizaines de salariés\nIl est pas pauvre\nAu minimum, il a le fric pour se payer les avocats qui vont bien et négocier un petit chèque de départ\nPendant ce temps, qui gère la merde ?\nAlex\nQui se prend un petit harcèlement oklm ?\nAlex\n\n[[Ok, les situations sont liées, mais elle se fait harceler par des joueurs frustrés, pas par des sbires à la solde du Studio...|Nikki 3-20]]",
      "links": [
        {
          "name": "Ok, les situations sont liées, mais elle se fait harceler par des joueurs frustrés, pas par des sbires à la solde du Studio...|Nikki 3-20",
          "link": "Ok, les situations sont liées, mais elle se fait harceler par des joueurs frustrés, pas par des sbires à la solde du Studio...|Nikki 3-20",
          "broken": true
        }
      ],
      "name": "Nikki 3-16",
      "pid": "17",
      "position": {
        "x": "603",
        "y": "2319"
      }
    },
    {
      "text": "Je me suis infiltré.e dans le petit groupe de trolls qui la harcèlent.\nIls utilisent une messagerie via une app chiffrée\nTout le monde est sous pseudo\nTout le monde fait super gaffe à son anonymat.\nC’est propre.\nUn peu trop, à mon avis.\nÇa sent le truc piloté. Ya trop d’argent en jeu.\n\n[[Alex aimerait savoir qui ils sont. Ce sera plus simple pour elle si elle décide de porter plainte.|Nikki 3-21]]\n[[L’anonymat, c’est vraiment la plaie d’internet|Nikki 3-22]]",
      "links": [
        {
          "name": "Alex aimerait savoir qui ils sont. Ce sera plus simple pour elle si elle décide de porter plainte.|Nikki 3-21",
          "link": "Alex aimerait savoir qui ils sont. Ce sera plus simple pour elle si elle décide de porter plainte.|Nikki 3-21",
          "broken": true
        },
        {
          "name": "L’anonymat, c’est vraiment la plaie d’internet|Nikki 3-22",
          "link": "L’anonymat, c’est vraiment la plaie d’internet|Nikki 3-22",
          "broken": true
        }
      ],
      "name": "Nikki 3-20",
      "pid": "18",
      "position": {
        "x": "599",
        "y": "2853"
      },
      "tags": [
        "connaissance"
      ]
    },
    {
      "text": "Ca va être compliqué\nJ’ai essayé de les tracer.\nIl se peut que je trouve des trucs\nMais ça va prendre un temps de malade\nEncore plus pour prouver que le Studio est derrière tout ça\n\n[[T’es sûre de ce que t’avances ?|Nikki 3-23]]",
      "links": [
        {
          "name": "T’es sûre de ce que t’avances ?|Nikki 3-23",
          "link": "T’es sûre de ce que t’avances ?|Nikki 3-23",
          "broken": true
        }
      ],
      "name": "Nikki 3-21",
      "pid": "19",
      "position": {
        "x": "512",
        "y": "2994"
      }
    },
    {
      "text": "Mmmm...\n\n[[T’es pas d’accord ?|Nikki 3-30]]\n[[Attends, mais c’est évident ! Si on avait le nom de ces gens, la situation serait déjà réglée !|Nikki 3-30]]",
      "links": [
        {
          "name": "T’es pas d’accord ?|Nikki 3-30",
          "link": "T’es pas d’accord ?|Nikki 3-30",
          "broken": true
        },
        {
          "name": "Attends, mais c’est évident ! Si on avait le nom de ces gens, la situation serait déjà réglée !|Nikki 3-30",
          "link": "Attends, mais c’est évident ! Si on avait le nom de ces gens, la situation serait déjà réglée !|Nikki 3-30",
          "broken": true
        }
      ],
      "name": "Nikki 3-22",
      "pid": "20",
      "position": {
        "x": "658",
        "y": "2994"
      }
    },
    {
      "text": "Les mecs sont en feu pour pas grand-chose. La petite prise de tête dans le chat après le drama de Blaze, ok.\nMais ça dure. Et les proportions du truc !\n\n[[C’est vrai que les réactions sont excessives.|Nikki 3-24]]\n[[Je vois pas en quoi c’est une preuve contre le Studio|Nikki 3-24]]",
      "links": [
        {
          "name": "C’est vrai que les réactions sont excessives.|Nikki 3-24",
          "link": "C’est vrai que les réactions sont excessives.|Nikki 3-24",
          "broken": true
        },
        {
          "name": "Je vois pas en quoi c’est une preuve contre le Studio|Nikki 3-24",
          "link": "Je vois pas en quoi c’est une preuve contre le Studio|Nikki 3-24",
          "broken": true
        }
      ],
      "name": "Nikki 3-23",
      "pid": "21",
      "position": {
        "x": "508",
        "y": "3144"
      }
    },
    {
      "text": "J’ai rien pour le prouver, mais ça m’étonnerait pas qu’Ally soit derrière tout ça. Le timing est trop gros : Alex récupère l’app de Blaze, Ally veut l’accès, Alex refuse et bim ! dans la minute, harcèlement.\n\n[[Oui, enfin, Ally, c’est pas Dark Vador...|Nikki 3-25]]\n[[Tu lui prêtes pas un peu trop de pouvoir ?|Nikki 3-25]]",
      "links": [
        {
          "name": "Oui, enfin, Ally, c’est pas Dark Vador...|Nikki 3-25",
          "link": "Oui, enfin, Ally, c’est pas Dark Vador...|Nikki 3-25",
          "broken": true
        },
        {
          "name": "Tu lui prêtes pas un peu trop de pouvoir ?|Nikki 3-25",
          "link": "Tu lui prêtes pas un peu trop de pouvoir ?|Nikki 3-25",
          "broken": true
        }
      ],
      "name": "Nikki 3-24",
      "pid": "22",
      "position": {
        "x": "508",
        "y": "3294"
      }
    },
    {
      "text": "Crois-moi, elle est pas du tout fair.\nEt elle est tout à fait en mesure de monter rapidement une opération de déstabilisation.\n\n[[OK. Mais on n’a pas de preuve|Nikki 3-26]]",
      "links": [
        {
          "name": "OK. Mais on n’a pas de preuve|Nikki 3-26",
          "link": "OK. Mais on n’a pas de preuve|Nikki 3-26",
          "broken": true
        }
      ],
      "name": "Nikki 3-25",
      "pid": "23",
      "position": {
        "x": "508",
        "y": "3444"
      }
    },
    {
      "text": "Et ouai. L’anonymat, cette merveille à double tranchant.\n\n[[Je vois pas bien en quoi c’est une merveille|Nikki 3-27]]\n[[Des fois faut faire un effort pour se souvenir pourquoi c’est chouette ;)|Nikki 3-27]]",
      "links": [
        {
          "name": "Je vois pas bien en quoi c’est une merveille|Nikki 3-27",
          "link": "Je vois pas bien en quoi c’est une merveille|Nikki 3-27",
          "broken": true
        },
        {
          "name": "Des fois faut faire un effort pour se souvenir pourquoi c’est chouette ;)|Nikki 3-27",
          "link": "Des fois faut faire un effort pour se souvenir pourquoi c’est chouette ;)|Nikki 3-27",
          "broken": true
        }
      ],
      "name": "Nikki 3-26",
      "pid": "24",
      "position": {
        "x": "508",
        "y": "3594"
      }
    },
    {
      "text": "C’est comme pisser la porte ouverte. C’est sympa tant qu’on est tout seul dans l’appart.\nTu saisis ?\n\n[[Je suis pas sur…|Nikki 3-30]]\n[[T’as un don pour les images...|Nikki 3-30]]",
      "links": [
        {
          "name": "Je suis pas sur…|Nikki 3-30",
          "link": "Je suis pas sur…|Nikki 3-30",
          "broken": true
        },
        {
          "name": "T’as un don pour les images...|Nikki 3-30",
          "link": "T’as un don pour les images...|Nikki 3-30",
          "broken": true
        }
      ],
      "name": "Nikki 3-27",
      "pid": "25",
      "position": {
        "x": "508",
        "y": "3744"
      }
    },
    {
      "text": "OK.\nBack to basics, bb.\nTu vas pisser la porte ouverte ?\nSur une échelle de 1 à 10, t’es tranquille comment avec l’idée que des gens puissent entrer dans ta maison sans te demander ton avis ? Que des inconnus passent chez toi pour te regarder dormir ?\nC’est NORMAL d’avoir des choses à cacher.\n\n[[Tu parles d’intimité. L’anonymat, c’est un autre sujet|Nikki 3-31]]\n[[Vu comme ça...|Nikki 3-31]]",
      "links": [
        {
          "name": "Tu parles d’intimité. L’anonymat, c’est un autre sujet|Nikki 3-31",
          "link": "Tu parles d’intimité. L’anonymat, c’est un autre sujet|Nikki 3-31",
          "broken": true
        },
        {
          "name": "Vu comme ça...|Nikki 3-31",
          "link": "Vu comme ça...|Nikki 3-31",
          "broken": true
        }
      ],
      "name": "Nikki 3-30",
      "pid": "26",
      "position": {
        "x": "678",
        "y": "3854"
      }
    },
    {
      "text": "Je t’assure, personne ne veut se justifier de la liste des sites qu’il consulte.\nToi-même, tu ne ferais pas les mêmes recherches si tu avais quelqu’un en permanence en train de lire par dessus ton épaule. Et pourtant...\n\n[[Je pense pas...|Nikki 3-32]]\n[[Ok, mais là, précisément, si ces types se cachaient pas derrière un pseudo, on pourrait les choper.|Nikki 3-33]]",
      "links": [
        {
          "name": "Je pense pas...|Nikki 3-32",
          "link": "Je pense pas...|Nikki 3-32",
          "broken": true
        },
        {
          "name": "Ok, mais là, précisément, si ces types se cachaient pas derrière un pseudo, on pourrait les choper.|Nikki 3-33",
          "link": "Ok, mais là, précisément, si ces types se cachaient pas derrière un pseudo, on pourrait les choper.|Nikki 3-33",
          "broken": true
        }
      ],
      "name": "Nikki 3-31",
      "pid": "27",
      "position": {
        "x": "670",
        "y": "4012"
      },
      "tags": [
        "connaissance"
      ]
    },
    {
      "text": "Tu crois ce que tu veux, mais t’as toutes les sciences sociales contre toi.\n\n[[Bah c’est bien ce que je dis, les gens se planquent derrière des pseudos pour faire ce qu’ils veulent|Nikki 3-33]]",
      "links": [
        {
          "name": "Bah c’est bien ce que je dis, les gens se planquent derrière des pseudos pour faire ce qu’ils veulent|Nikki 3-33",
          "link": "Bah c’est bien ce que je dis, les gens se planquent derrière des pseudos pour faire ce qu’ils veulent|Nikki 3-33",
          "broken": true
        }
      ],
      "name": "Nikki 3-32",
      "pid": "28",
      "position": {
        "x": "606",
        "y": "4144"
      }
    },
    {
      "text": "Bah en fait on peut\nSur Internet, l’anonymat n’existe presque pas\nToutes les connexions laissent des traces et les intermédiaires techniques ont l’obligation de les conserver\nDe nombreuses lois permettent déjà de les exploiter et de lever le pseudonymat\n\n\n[[Si on connaissait leurs noms, ces gens se comporteraient surement différemment.|Nikki 3-34]]\n[[Alors... Alex n’a pas besoin de l’aide du Studio pour porter plainte ?|Nikki 3-50]]",
      "links": [
        {
          "name": "Si on connaissait leurs noms, ces gens se comporteraient surement différemment.|Nikki 3-34",
          "link": "Si on connaissait leurs noms, ces gens se comporteraient surement différemment.|Nikki 3-34",
          "broken": true
        },
        {
          "name": "Alors... Alex n’a pas besoin de l’aide du Studio pour porter plainte ?|Nikki 3-50",
          "link": "Alors... Alex n’a pas besoin de l’aide du Studio pour porter plainte ?|Nikki 3-50",
          "broken": true
        }
      ],
      "name": "Nikki 3-33",
      "pid": "29",
      "position": {
        "x": "772",
        "y": "4256"
      }
    },
    {
      "text": "Pas forcément.\nL’anonymat n’a jamais été une condition nécessaire pour que des gens en harcèlent d’autres. J’en veux pour preuve... le collège ! le travail ! Tous ces lieux merveilleux les harceleurs exercent à visage découvert ! Avec la complicité silencieuse du public !\nLe harcèlement, c’est un phénomène de groupe. C’est un phénomène collectif.\nC’est pas l’anonymat, le problème, c’est la société le problème. La question de l’intimité, c’est une question collective.\n\n[[Bah, c’est aux gens de savoir se défendre|Nikki 3-35]]\n[[C’est jamais agréable d’être seul contre le groupe|Nikki 3-35]]",
      "links": [
        {
          "name": "Bah, c’est aux gens de savoir se défendre|Nikki 3-35",
          "link": "Bah, c’est aux gens de savoir se défendre|Nikki 3-35",
          "broken": true
        },
        {
          "name": "C’est jamais agréable d’être seul contre le groupe|Nikki 3-35",
          "link": "C’est jamais agréable d’être seul contre le groupe|Nikki 3-35",
          "broken": true
        }
      ],
      "name": "Nikki 3-34",
      "pid": "30",
      "position": {
        "x": "757",
        "y": "4412"
      }
    },
    {
      "text": "Les gens ne devraient pas se sentir stupides ou courrir de risques parce qu’ils ne maîtrisent pas les outils de protection. Je veux dire, on sort pas en armure dans la rue et pourtant, des gens roulent en bagnole. Ben la loi et le code de la route protègent les petits piétons contre les grosses voitures. On est collectivement d’accord pour dire que c’est les chauffards les tocards. Ben sur les réseaux, ça devrait être pareil. Collectif.\n\n[[Ok, mais ça me dit toujours pas ce que je dois faire avec ces données|Nikki 3-36]]",
      "links": [
        {
          "name": "Ok, mais ça me dit toujours pas ce que je dois faire avec ces données|Nikki 3-36",
          "link": "Ok, mais ça me dit toujours pas ce que je dois faire avec ces données|Nikki 3-36",
          "broken": true
        }
      ],
      "name": "Nikki 3-35",
      "pid": "31",
      "position": {
        "x": "757",
        "y": "4562"
      }
    },
    {
      "text": "@init\n\nJe vais pas prendre des décisions à ta place, bb.\nT’as toutes les clés en main\nPar contre, t’as pas mille ans pour réfléchir.\nL’équipe d’en face, ils vont finir par entrer dans l’appli.\nQuand ils vont comprendre ce qu’on a dans les mains, ils vont déployer tout leur arsenal juridique pour nous faire accuser de piratage ou de violation du secret des affaires.\nEt là, t’auras plus le choix de rien.\n\n[[Mes choix...|Nikki 4-1]]",
      "links": [
        {
          "name": "Mes choix...|Nikki 4-1",
          "link": "Mes choix...|Nikki 4-1",
          "broken": true
        }
      ],
      "name": "Nikki 4-0",
      "pid": "32",
      "position": {
        "x": "2014",
        "y": "116"
      }
    },
    {
      "text": "1/ Tu laisses tomber Alex pour vivre ta meilleure vie avec les papattes, l’argent et Ally pour seule compagnie. Good luck with that…\n2/ Accepter la proposition d’Ally et du Studio et la compensation financière pour Alex et ceux dont tu as vu les profils (et tant pis pour les autres)\n3/ Tu soutiens Alex dans son combat contre le Studio. Ce ne sera pas facile. Et tu dis adieu aux petits jeux, aux papattes et à toutes les offres alléchantes du Studio.",
      "name": "Nikki 4-1",
      "pid": "33",
      "position": {
        "x": "2028",
        "y": "276"
      }
    },
    {
      "text": "Mais on s’en fout !\nOn n’est pas là pour prendre le thé avec lui\nOn veut comprendre ce qu’il a dans la tête\net on a une app qu’il a codée avec son petit cerveau de génie médiocre\nOn est comme dans sa tête\nTu comprends ?\n\n[[T’es pas obligé de me parler sur ce ton. T’es vraiment pas très agréable|Nikki 3-19]]",
      "links": [
        {
          "name": "T’es pas obligé de me parler sur ce ton. T’es vraiment pas très agréable|Nikki 3-19",
          "link": "T’es pas obligé de me parler sur ce ton. T’es vraiment pas très agréable|Nikki 3-19",
          "broken": true
        }
      ],
      "name": "Nikki 3-18",
      "pid": "34",
      "position": {
        "x": "394",
        "y": "2567"
      }
    },
    {
      "text": "Moi, désagréable ? Tu veux des gens désagréables ? Je te conseille le petit groupe de troll qui harcèle Alex.\n\n[[Tu les connais ?|Nikki 3-20]]",
      "links": [
        {
          "name": "Tu les connais ?|Nikki 3-20",
          "link": "Tu les connais ?|Nikki 3-20",
          "broken": true
        }
      ],
      "name": "Nikki 3-19",
      "pid": "35",
      "position": {
        "x": "397",
        "y": "2717"
      }
    },
    {
      "text": "-_-'\nokay...\ncette journée va être compliquée\n\n[[Mais il est où ?|Nikki 3-18]]",
      "links": [
        {
          "name": "Mais il est où ?|Nikki 3-18",
          "link": "Mais il est où ?|Nikki 3-18",
          "broken": true
        }
      ],
      "name": "Nikki 3-17",
      "pid": "36",
      "position": {
        "x": "393",
        "y": "2398"
      }
    },
    {
      "text": "En théorie. Mais bon, la question va être celle des moyens accordés à la justice pour faire son travail. Ça va prendre des plombes. Ça me fout en rogne. Tout ça pour une situation qui aurait pu être évitée !\n\n[[Comment éviter ça ?|Nikki 3-51]]",
      "links": [
        {
          "name": "Comment éviter ça ?|Nikki 3-51",
          "link": "Comment éviter ça ?|Nikki 3-51",
          "broken": true
        }
      ],
      "name": "Nikki 3-50",
      "pid": "37",
      "position": {
        "x": "877",
        "y": "4406"
      }
    },
    {
      "text": "Les gens ne devraient JAMAIS courir de risques parce qu’ils ne maîtrisent pas les outils de protection. Je veux dire, on sort pas en armure dans la rue et pourtant, des gens roulent en bagnole. Ben la loi et le code de la route protègent les petits piétons contre les grosses voitures. On est collectivement d’accord pour dire que c’est les chauffards les tocards. Ben sur les internets, ça devrait être pareil.\n\n[[Je suis d’accord, mais ça me dit toujours pas ce que je dois faire avec ces données|Nikki 3-36]]",
      "links": [
        {
          "name": "Je suis d’accord, mais ça me dit toujours pas ce que je dois faire avec ces données|Nikki 3-36",
          "link": "Je suis d’accord, mais ça me dit toujours pas ce que je dois faire avec ces données|Nikki 3-36",
          "broken": true
        }
      ],
      "name": "Nikki 3-51",
      "pid": "38",
      "position": {
        "x": "873",
        "y": "4556"
      }
    },
    {
      "text": "Déjà, explore la base de données. Je vois que tu peux récupérer des connaissances dans l’espèce de carnet de codes qu’avait codé Blaze. Il devait avoir prévu le coup.\n\nSauf que ce qu’il a pas compris, c’est que les connaissances, toutes seules, ça sert à que dalle. Faut aussi savoir faire les choses, pouvoir passer à l’action.\n\n[[Tu proposes quoi ?|Nikki 3-37]]",
      "links": [
        {
          "name": "Tu proposes quoi ?|Nikki 3-37",
          "link": "Tu proposes quoi ?|Nikki 3-37",
          "broken": true
        }
      ],
      "name": "Nikki 3-36",
      "pid": "39",
      "position": {
        "x": "830",
        "y": "4712"
      }
    },
    {
      "text": "Pour chaque connaissance que t’as récupérée, je vais te rajouter des infos sur quoi faire, OK? On fait ça au fur et à mesure. Comme ça ça fera des sortes de tutoriels que tu peux regarder pour réagir.\n\nLe B-A BA, le manuel de base, tu vois le genre?\n\nJe te laisse faire ça, pendant ce temps-là je t’envoie les infos à toi et Alex.",
      "name": "Nikki 3-37",
      "pid": "40",
      "position": {
        "x": "830",
        "y": "4862"
      }
    }
  ],
  "name": "NikkiBlaze",
  "startnode": "1",
  "creator": "Twine",
  "creator-version": "2.3.14",
  "ifid": "4FD2E6F3-0A46-4DA3-B192-7BE8DB13CD82"
}
