{
  "passages": [
    {
      "text": "@init\n¡Wow!\n¿Qué es esta locura?\n\n[[Es una base de datos de los jugadores de Gao.|Alex 10-1]]\n[[Es el tesoro más preciado del Estudio.|Alex 10-1]]",
      "links": [
        {
          "name": "Es una base de datos de los jugadores de Gao.|Alex 10-1",
          "link": "Es una base de datos de los jugadores de Gao.|Alex 10-1",
          "broken": true
        },
        {
          "name": "Es el tesoro más preciado del Estudio.|Alex 10-1",
          "link": "Es el tesoro más preciado del Estudio.|Alex 10-1",
          "broken": true
        }
      ],
      "name": "Alex 10",
      "pid": "1",
      "position": {
        "x": "833",
        "y": "227"
      },
      "tags": [
        "init",
        "Español"
      ]
    },
    {
      "text": "Ok... ¿Y para qué sirve?\n\n[[Para almacenar y evaluar la información privada de los jugadores.|Alex 10-2]]",
      "links": [
        {
          "name": "Para almacenar y evaluar la información privada de los jugadores.|Alex 10-2",
          "link": "Para almacenar y evaluar la información privada de los jugadores.|Alex 10-2",
          "broken": true
        }
      ],
      "name": "Alex 10-1",
      "pid": "2",
      "position": {
        "x": "833",
        "y": "377"
      },
      "tags": [
        "Español"
      ]
    },
    {
      "text": "... ¿Y nosotros sí deberíamos tener acceso a esto? No es como... ¿Muy privado? \n\n[[Lo es. :S|Alex 10-3]]\n[[Blaze te dio acceso a esta información por algo.|Alex 10-3]]",
      "links": [
        {
          "name": "Lo es. :S|Alex 10-3",
          "link": "Lo es. :S|Alex 10-3",
          "broken": true
        },
        {
          "name": "Blaze te dio acceso a esta información por algo.|Alex 10-3",
          "link": "Blaze te dio acceso a esta información por algo.|Alex 10-3",
          "broken": true
        }
      ],
      "name": "Alex 10-2",
      "pid": "3",
      "position": {
        "x": "833",
        "y": "527"
      },
      "tags": [
        "Español"
      ]
    },
    {
      "text": "Ok... (La chica que no sabe qué más decir que Ok... ><) Sé que es el momento de tener el cerebro 100 disponible para utilizar esta información de manera brillante pero, con todo lo que está pasando, tengo la disponabilidad espiritual de una nutria ansiosa.\n\n[[¿Una nutria ansiosa?|Alex 10-6]]",
      "links": [
        {
          "name": "¿Una nutria ansiosa?|Alex 10-6",
          "link": "¿Una nutria ansiosa?|Alex 10-6",
          "broken": true
        }
      ],
      "name": "Alex 10-3",
      "pid": "4",
      "position": {
        "x": "833",
        "y": "677"
      },
      "tags": [
        "Español"
      ]
    },
    {
      "text": "Fue lo único que se me ocurrió ><. Me siento como un animal demasiado tierno arrinconado por un bulldog (cuando debería estar figurando en videos tiernos y virales)... \n\nEn fin. No me siento nada en mi elemento y creo que mis niveles de cortisol están al borde de la letalidad.\n\n[[Tranquila...|Alex 10-7]]\n[[:(|Alex 10-7]]",
      "links": [
        {
          "name": "Tranquila...|Alex 10-7",
          "link": "Tranquila...|Alex 10-7",
          "broken": true
        },
        {
          "name": ":(|Alex 10-7",
          "link": ":(|Alex 10-7",
          "broken": true
        }
      ],
      "name": "Alex 10-6",
      "pid": "5",
      "position": {
        "x": "830",
        "y": "846"
      },
      "tags": [
        "Español"
      ]
    },
    {
      "text": "Me siento en un punto crítico... como que me pregunto si realmente no debería ir a la policía. \n\n¿Sabes lo que está pasando ahora? Los más radicales en su disgusto hacia mí formaron un grupito privado en el que intercambian mensajes, comentarios sobre lo que está pasando con Gao y chistes sobre Blaze y sobre mí.\n\n[[:S :S :S|Alex 10-8]]\n[[Mientras se quede entre ellos y ya...|Alex 10-8]]\n[[¿Cómo te enteraste?|Alex 10-9]]",
      "links": [
        {
          "name": ":S :S :S|Alex 10-8",
          "link": ":S :S :S|Alex 10-8",
          "broken": true
        },
        {
          "name": "Mientras se quede entre ellos y ya...|Alex 10-8",
          "link": "Mientras se quede entre ellos y ya...|Alex 10-8",
          "broken": true
        },
        {
          "name": "¿Cómo te enteraste?|Alex 10-9",
          "link": "¿Cómo te enteraste?|Alex 10-9",
          "broken": true
        }
      ],
      "name": "Alex 10-7",
      "pid": "6",
      "position": {
        "x": "850",
        "y": "1012"
      },
      "tags": [
        "Español"
      ]
    },
    {
      "text": "¡Cosas horribles! ¡Uno de ellos publicó una serie de caricaturas satíricas sobre \"Un día en la vida de Alex\", usando fotos mías y fotos de MI HIJO en el colegio!  \n\nQuiero llorar. Sé que debería ir a la policía y detenerlos, pero al mismo tiempo tengo miedo de que denunciarlos los alborote aún más. :( :( :(\n\n[[¿Podemos quizás pedirle ayuda al Estudio?|Alex 10-10]]\n[[¡Tienes que denunciarlos! ¡Esto ya es demasiado!|Alex 10-11]]\n[[Es una posibilidad. :S|Alex 10-18]]",
      "links": [
        {
          "name": "¿Podemos quizás pedirle ayuda al Estudio?|Alex 10-10",
          "link": "¿Podemos quizás pedirle ayuda al Estudio?|Alex 10-10",
          "broken": true
        },
        {
          "name": "¡Tienes que denunciarlos! ¡Esto ya es demasiado!|Alex 10-11",
          "link": "¡Tienes que denunciarlos! ¡Esto ya es demasiado!|Alex 10-11",
          "broken": true
        },
        {
          "name": "Es una posibilidad. :S|Alex 10-18",
          "link": "Es una posibilidad. :S|Alex 10-18",
          "broken": true
        }
      ],
      "name": "Alex 10-8",
      "pid": "7",
      "position": {
        "x": "758",
        "y": "1218"
      },
      "tags": [
        "Español"
      ]
    },
    {
      "text": "Invitaron a Nikki... (No mucha gente sabe que somos cercanas.) que cada que puede me transfiere lo que están diciendo.\n\n[[¿Y qué tanto dicen?|Alex 10-8]]",
      "links": [
        {
          "name": "¿Y qué tanto dicen?|Alex 10-8",
          "link": "¿Y qué tanto dicen?|Alex 10-8",
          "broken": true
        }
      ],
      "name": "Alex 10-9",
      "pid": "8",
      "position": {
        "x": "916",
        "y": "1222"
      },
      "tags": [
        "Español"
      ]
    },
    {
      "text": "No han hecho nada desde ayer. -_- No veo por qué habrían de hacer algo ahora.\n\n[[... Ally me contactó. Y nos propone algo para ayudarte.|Alex 10-13]]",
      "links": [
        {
          "name": "... Ally me contactó. Y nos propone algo para ayudarte.|Alex 10-13",
          "link": "... Ally me contactó. Y nos propone algo para ayudarte.|Alex 10-13",
          "broken": true
        }
      ],
      "name": "Alex 10-10",
      "pid": "9",
      "position": {
        "x": "1205",
        "y": "1744"
      },
      "tags": [
        "Español"
      ]
    },
    {
      "text": "Ben dice que me tomo demasiado en serio los mensajes que me llegan.\nSol desapareció de repente.\nY Ally me espía... ><\n\n[[Está desesperada por entender por qué Blaze desapareció.|Alex 10-24]]\n[[... Ally está dispuesta a ayudarte a cambio de información.|Alex 10-14]]",
      "links": [
        {
          "name": "Está desesperada por entender por qué Blaze desapareció.|Alex 10-24",
          "link": "Está desesperada por entender por qué Blaze desapareció.|Alex 10-24",
          "broken": true
        },
        {
          "name": "... Ally está dispuesta a ayudarte a cambio de información.|Alex 10-14",
          "link": "... Ally está dispuesta a ayudarte a cambio de información.|Alex 10-14",
          "broken": true
        }
      ],
      "name": "Alex 10-12",
      "pid": "10",
      "position": {
        "x": "897",
        "y": "2202"
      },
      "tags": [
        "Español"
      ]
    },
    {
      "text": "¡¿Cómo así, \"nos propone\"?! ¡¿No te suena abusivo?! Mientras el Estudio se cruza de brazos yo tengo que reportar uno a uno cada mensaje que recibo para que el sistema los elimine. ¿Y ahora Ally en vez de actuar PROPONE?\n\n[[Dice que si le decimos qué hay en el App te ayuda.|Alex 10-14]]\n[[¿Sí crees que Ally tenga los medios para hacer algo?|Alex 10-15]]",
      "links": [
        {
          "name": "Dice que si le decimos qué hay en el App te ayuda.|Alex 10-14",
          "link": "Dice que si le decimos qué hay en el App te ayuda.|Alex 10-14",
          "broken": true
        },
        {
          "name": "¿Sí crees que Ally tenga los medios para hacer algo?|Alex 10-15",
          "link": "¿Sí crees que Ally tenga los medios para hacer algo?|Alex 10-15",
          "broken": true
        }
      ],
      "name": "Alex 10-13",
      "pid": "11",
      "position": {
        "x": "1266",
        "y": "1877"
      },
      "tags": [
        "Español"
      ]
    },
    {
      "text": "No lo puedo creer... Es tan cínica.\n\n[[Lo es... Pero nos está dando una salida.|Alex 10-16]]\n[[Es horrible. Yo sé. Pero tenías que saberlo.|Alex 10-17]]",
      "links": [
        {
          "name": "Lo es... Pero nos está dando una salida.|Alex 10-16",
          "link": "Lo es... Pero nos está dando una salida.|Alex 10-16",
          "broken": true
        },
        {
          "name": "Es horrible. Yo sé. Pero tenías que saberlo.|Alex 10-17",
          "link": "Es horrible. Yo sé. Pero tenías que saberlo.|Alex 10-17",
          "broken": true
        }
      ],
      "name": "Alex 10-14",
      "pid": "12",
      "position": {
        "x": "1171",
        "y": "2568"
      },
      "tags": [
        "Español"
      ]
    },
    {
      "text": "Sí. Ally tiene muchísima influencia en el Estudio.\n\nMe han contado muchas historias... Los demás empleados dicen que ella no duda en usar su posición para joder a quien no le cae bien. Y que cuando se empeña con algo no se detiene...\n\n*Suspiro* ¿Qué es lo que \"propone\"?\n\n[[Que nos ayuda si le damos información sobre el contenido del App.|Alex 10-14]]",
      "links": [
        {
          "name": "Que nos ayuda si le damos información sobre el contenido del App.|Alex 10-14",
          "link": "Que nos ayuda si le damos información sobre el contenido del App.|Alex 10-14",
          "broken": true
        }
      ],
      "name": "Alex 10-15",
      "pid": "13",
      "position": {
        "x": "1334",
        "y": "2017"
      },
      "tags": [
        "Español"
      ]
    },
    {
      "text": ":) Tu apoyo me da fuerzas... Gracias de verdad. Quisiera que los demás a mi alrededor me apoyaran tanto como tú.\n\n[[¿No lo hacen?|Alex 10-12]]",
      "links": [
        {
          "name": "¿No lo hacen?|Alex 10-12",
          "link": "¿No lo hacen?|Alex 10-12",
          "broken": true
        }
      ],
      "name": "Alex 10-11",
      "pid": "14",
      "position": {
        "x": "897",
        "y": "2066"
      },
      "tags": [
        "Español"
      ]
    },
    {
      "text": "¡Jamás traicionaría la confianza de Blaze! \n\n...¿Cómo pudiste abrir esa puerta? Ally es terrible, cuando se obsesiona con algo no suelta.\n\n...Quiero que dejes de hablar con ella inmediatamente.\n\n[[...Ok. Perdón.|Alex 10-25]]\n[[-_- Lo hecho hecho está.|Alex 10-25]]",
      "links": [
        {
          "name": "...Ok. Perdón.|Alex 10-25",
          "link": "...Ok. Perdón.|Alex 10-25",
          "broken": true
        },
        {
          "name": "-_- Lo hecho hecho está.|Alex 10-25",
          "link": "-_- Lo hecho hecho está.|Alex 10-25",
          "broken": true
        }
      ],
      "name": "Alex 10-16",
      "pid": "15",
      "position": {
        "x": "1069",
        "y": "2859"
      },
      "tags": [
        "Español"
      ]
    },
    {
      "text": "Jamás traicionaría a Blaze. Cualquiera que me conoce lo sabe. Aunque ella...\n\nAlly es terrible. Cuando tiene algo en la cabeza no lo suelta.\n\n... Estoy segura que va a insistir e insistir hasta que le demos lo que quiere. ¿Cómo hacemos para resistir?\n\n[[¡Tenemos que entender lo que Blaze te quiso decir con el App!|Alex 10-26]]",
      "links": [
        {
          "name": "¡Tenemos que entender lo que Blaze te quiso decir con el App!|Alex 10-26",
          "link": "¡Tenemos que entender lo que Blaze te quiso decir con el App!|Alex 10-26",
          "broken": true
        }
      ],
      "name": "Alex 10-17",
      "pid": "16",
      "position": {
        "x": "1300",
        "y": "2845"
      },
      "tags": [
        "Español"
      ]
    },
    {
      "text": "¿Cierto?\n\n[[Sí. Tenemos que encontrar otra salida... ¿De pronto pedirle ayuda al Estudio?|Alex 10-10]]\n[[Sí. Es mejor que no te expongas más.|Alex 10-19]]",
      "links": [
        {
          "name": "Sí. Tenemos que encontrar otra salida... ¿De pronto pedirle ayuda al Estudio?|Alex 10-10",
          "link": "Sí. Tenemos que encontrar otra salida... ¿De pronto pedirle ayuda al Estudio?|Alex 10-10",
          "broken": true
        },
        {
          "name": "Sí. Es mejor que no te expongas más.|Alex 10-19",
          "link": "Sí. Es mejor que no te expongas más.|Alex 10-19",
          "broken": true
        }
      ],
      "name": "Alex 10-18",
      "pid": "17",
      "position": {
        "x": "556",
        "y": "1689"
      },
      "tags": [
        "Español"
      ]
    },
    {
      "text": "-_-\nPensé que me apoyabas...\n\n[[Alex. Te apoyo totalmente... Solo no creo que sea una buena idea.|Alex 10-20]]\n[[Alex. Me preocupo por ti. Es todo.|Alex 10-21]]",
      "links": [
        {
          "name": "Alex. Te apoyo totalmente... Solo no creo que sea una buena idea.|Alex 10-20",
          "link": "Alex. Te apoyo totalmente... Solo no creo que sea una buena idea.|Alex 10-20",
          "broken": true
        },
        {
          "name": "Alex. Me preocupo por ti. Es todo.|Alex 10-21",
          "link": "Alex. Me preocupo por ti. Es todo.|Alex 10-21",
          "broken": true
        }
      ],
      "name": "Alex 10-19",
      "pid": "18",
      "position": {
        "x": "552",
        "y": "1839"
      },
      "tags": [
        "Español"
      ]
    },
    {
      "text": "Voy a pensarlo un poco más entonces...\nToda esta situación es... :-(\n\nNo sé qué hacer...\n\n[[Ally dice que te puede ayudar...|Alex 10-22]]\n[[Tenemos que entender por qué Blaze se fue.|Alex 10-24]]",
      "links": [
        {
          "name": "Ally dice que te puede ayudar...|Alex 10-22",
          "link": "Ally dice que te puede ayudar...|Alex 10-22",
          "broken": true
        },
        {
          "name": "Tenemos que entender por qué Blaze se fue.|Alex 10-24",
          "link": "Tenemos que entender por qué Blaze se fue.|Alex 10-24",
          "broken": true
        }
      ],
      "name": "Alex 10-20",
      "pid": "19",
      "position": {
        "x": "494",
        "y": "2070"
      },
      "tags": [
        "Español"
      ]
    },
    {
      "text": "Gracias. Es una situación tan difícil de tomar... y me siento tan sola.\n\nSiento que si me sueltas no voy a ser capaz de sobrevivir a esto.\n\n[[No te voy a soltar. :)|Alex 10-23]]",
      "links": [
        {
          "name": "No te voy a soltar. :)|Alex 10-23",
          "link": "No te voy a soltar. :)|Alex 10-23",
          "broken": true
        }
      ],
      "name": "Alex 10-21",
      "pid": "20",
      "position": {
        "x": "696",
        "y": "2070"
      },
      "tags": [
        "Español"
      ]
    },
    {
      "text": "¿Ally? Ella nunca da puntada sin dedal.\n¿Qué espera a cambio?\n\n[[Información sobre el App.|Alex 10-14]]",
      "links": [
        {
          "name": "Información sobre el App.|Alex 10-14",
          "link": "Información sobre el App.|Alex 10-14",
          "broken": true
        }
      ],
      "name": "Alex 10-22",
      "pid": "21",
      "position": {
        "x": "480",
        "y": "2257"
      },
      "tags": [
        "Español"
      ]
    },
    {
      "text": "Eres especial. ¿sabes? \n\nEl resto de gente a mi alrededor parece incapaz de apoyarme. Ben dice que me tomo los mensajes muy en serio, que debería silenciar mi celular y ya. Sol desapareció de repente. Y Ally me espía... ><\n\n[[Está desesperada por entender por qué Blaze se fue.|Alex 10-24]]",
      "links": [
        {
          "name": "Está desesperada por entender por qué Blaze se fue.|Alex 10-24",
          "link": "Está desesperada por entender por qué Blaze se fue.|Alex 10-24",
          "broken": true
        }
      ],
      "name": "Alex 10-23",
      "pid": "22",
      "position": {
        "x": "714",
        "y": "2359"
      },
      "tags": [
        "Español"
      ]
    },
    {
      "text": "Seguro la respuesta está en el App.\n\n... Espero que esté. ><",
      "name": "Alex 10-24",
      "pid": "23",
      "position": {
        "x": "628",
        "y": "3159"
      },
      "tags": [
        "Español"
      ]
    },
    {
      "text": "Prométeme que NUNCA vas a aceptar ninguno de sus tratos.\n\n[[...|Alex 10-27]]\n[[Lo prometo.|Alex 10-27]]",
      "links": [
        {
          "name": "...|Alex 10-27",
          "link": "...|Alex 10-27",
          "broken": true
        },
        {
          "name": "Lo prometo.|Alex 10-27",
          "link": "Lo prometo.|Alex 10-27",
          "broken": true
        }
      ],
      "name": "Alex 10-25",
      "pid": "24",
      "position": {
        "x": "1069",
        "y": "3009"
      },
      "tags": [
        "Español"
      ]
    },
    {
      "text": "Sí...",
      "name": "Alex 10-26",
      "pid": "25",
      "position": {
        "x": "1297",
        "y": "3163"
      },
      "tags": [
        "Español"
      ]
    },
    {
      "text": "*Respira hondo, Alex.*",
      "name": "Alex 10-27",
      "pid": "26",
      "position": {
        "x": "1065",
        "y": "3159"
      },
      "tags": [
        "Español"
      ]
    },
    {
      "text": "@init\nYo que pensaba que este día no tenía cómo empeorar... \n@if(choiceHasBeenMade \"Ben out\")\nSol me acaba de avisar que el puesto que me ofreció ya no está disponible.\n\n[[¡¿Por qué?!|Alex 11-1]]\n\n@else\nAcabo de tener una pelea horrible con Ben. Creo que se acabó... Otra vez.\n\n[[:S ¿Qué pasó?|Alex 11-20]]\n@endif",
      "links": [
        {
          "name": "¡¿Por qué?!|Alex 11-1",
          "link": "¡¿Por qué?!|Alex 11-1",
          "broken": true
        },
        {
          "name": ":S ¿Qué pasó?|Alex 11-20",
          "link": ":S ¿Qué pasó?|Alex 11-20",
          "broken": true
        }
      ],
      "name": "Alex-11",
      "pid": "27",
      "position": {
        "x": "2674",
        "y": "239"
      },
      "tags": [
        "if",
        "Español"
      ]
    },
    {
      "text": "Le conté lo de las caricaturas y enloquecío. Me dijo que siempre tomo malas decisiones, que nunca debí haberme involucrado tanto con Gao. Me reprochó horrible haber expuesto la seguridad de Ulysses.\n\n... Me dio TANTA rabia.¡¿El idiota apenas si sabe cambiar un pañal y ahora viene a decirme cómo hacer con mi hijo?!\n\nEn fin. Después de que nos dijéramos hasta de que nos íbamos a morir se fue. No sin antes amenazarme con que me iba a pelear la custodia.\n\n[[Hace un año que te encargas de todo. Son palabras al aire y ya.|Alex 11-3]]\n[[Ay, Alex... Trata de calmarte.|Alex 11-4]]",
      "links": [
        {
          "name": "Hace un año que te encargas de todo. Son palabras al aire y ya.|Alex 11-3",
          "link": "Hace un año que te encargas de todo. Son palabras al aire y ya.|Alex 11-3",
          "broken": true
        },
        {
          "name": "Ay, Alex... Trata de calmarte.|Alex 11-4",
          "link": "Ay, Alex... Trata de calmarte.|Alex 11-4",
          "broken": true
        }
      ],
      "name": "Alex 11-1",
      "pid": "28",
      "position": {
        "x": "2647",
        "y": "450"
      },
      "tags": [
        "Español"
      ]
    },
    {
      "text": "Porque el trabajo involucraba a la comunidad de Gao... Y pues ahora esa gente me detesta...\n\nLo que me parte es que ya presenté mi renuncia en mi trabajo anterior, entonces me va a tocar volver a donde mi jefe con el rabo entre las patas.\n\n... Siento que voy a vomitar.\n\n[[Todo va a estar bien...|Alex 11-21]]",
      "links": [
        {
          "name": "Todo va a estar bien...|Alex 11-21",
          "link": "Todo va a estar bien...|Alex 11-21",
          "broken": true
        }
      ],
      "name": "Alex 11-20",
      "pid": "29",
      "position": {
        "x": "3214",
        "y": "747"
      },
      "tags": [
        "Español"
      ]
    },
    {
      "text": "Ay. Quisiera poder creerte y ya.\nPero es que sonó tan decidido...\n\nY yo que lo único que quería era que me apoyara... Me siento tan sola otra vez.\n@insertMedia:emoji_sad\n\n[[Pues... yo estoy aquí. xD|Alex 11-5]]",
      "links": [
        {
          "name": "Pues... yo estoy aquí. xD|Alex 11-5",
          "link": "Pues... yo estoy aquí. xD|Alex 11-5",
          "broken": true
        }
      ],
      "name": "Alex 11-3",
      "pid": "30",
      "position": {
        "x": "2616",
        "y": "706"
      },
      "tags": [
        "emoji-coeur-brisé",
        "Español"
      ]
    },
    {
      "text": "¡LLevo una hora tratando!\nEl problema es que si me calmo... Si dejo de estar emputada, ¿Qué me queda?\n\n¿Más allá del miedo y de una tristeza demoledora?\n@insertMedia:emoji_sad\n\n[[¿Qué puedo hacer para ayudarte?|Alex 11-6]]",
      "links": [
        {
          "name": "¿Qué puedo hacer para ayudarte?|Alex 11-6",
          "link": "¿Qué puedo hacer para ayudarte?|Alex 11-6",
          "broken": true
        }
      ],
      "name": "Alex 11-4",
      "pid": "31",
      "position": {
        "x": "2766",
        "y": "706"
      },
      "tags": [
        "emoji-coeur-brisé",
        "Español"
      ]
    },
    {
      "text": "Yo sé. Gracias por todo. <3 <3 <3\n\n[[¿Qué puedo hacer para ayudarte?|Alex 11-6]]",
      "links": [
        {
          "name": "¿Qué puedo hacer para ayudarte?|Alex 11-6",
          "link": "¿Qué puedo hacer para ayudarte?|Alex 11-6",
          "broken": true
        }
      ],
      "name": "Alex 11-5",
      "pid": "32",
      "position": {
        "x": "2512",
        "y": "932"
      },
      "tags": [
        "Español"
      ]
    },
    {
      "text": "Pegarle un puño a esos idiotas del grupito. Ufff, eso sería un alivio enorme...\n\nMentiras. Solo me frustra no poder saber quienes son. Porque no hay manera de denunciar a \"SuperBob\" y compañía. Si tan solo tuviera sus verdaderos nombres...\n\n[[Ally me propuso algo al respecto...|Alex 11-7]]",
      "links": [
        {
          "name": "Ally me propuso algo al respecto...|Alex 11-7",
          "link": "Ally me propuso algo al respecto...|Alex 11-7",
          "broken": true
        }
      ],
      "name": "Alex 11-6",
      "pid": "33",
      "position": {
        "x": "2777",
        "y": "915"
      },
      "tags": [
        "Español"
      ]
    },
    {
      "text": "¿Qué?\n\n[[Sé que no te gusta que hable con ella pero...|Alex 11-8]]",
      "links": [
        {
          "name": "Sé que no te gusta que hable con ella pero...|Alex 11-8",
          "link": "Sé que no te gusta que hable con ella pero...|Alex 11-8",
          "broken": true
        }
      ],
      "name": "Alex 11-7",
      "pid": "34",
      "position": {
        "x": "2777",
        "y": "1053"
      },
      "tags": [
        "Español"
      ]
    },
    {
      "text": "Dime que propone.\n\n[[Ally dice que te da los nombres de tus acosadores... si prometes no hacer nada en contra del Estudio.|Alex 11-9]]",
      "links": [
        {
          "name": "Ally dice que te da los nombres de tus acosadores... si prometes no hacer nada en contra del Estudio.|Alex 11-9",
          "link": "Ally dice que te da los nombres de tus acosadores... si prometes no hacer nada en contra del Estudio.|Alex 11-9",
          "broken": true
        }
      ],
      "name": "Alex 11-8",
      "pid": "35",
      "position": {
        "x": "2805",
        "y": "1207"
      },
      "tags": [
        "Español"
      ]
    },
    {
      "text": "¡No es verdad y lo sabes!\n\nMi antiguo jefe piensa que todos deberían entregarse al trabajo de cuerpo y alma. Estoy seguro que no me va a aceptar un reintegro. Menos después de la regañada que me pegó en la reunión. :( :( :(\n\n[[¿qué vas a hacer entonces?|Alex 11-22]]\n[[¿Igual te querías ir, no?|Alex 11-23]]",
      "links": [
        {
          "name": "¿qué vas a hacer entonces?|Alex 11-22",
          "link": "¿qué vas a hacer entonces?|Alex 11-22",
          "broken": true
        },
        {
          "name": "¿Igual te querías ir, no?|Alex 11-23",
          "link": "¿Igual te querías ir, no?|Alex 11-23",
          "broken": true
        }
      ],
      "name": "Alex 11-21",
      "pid": "36",
      "position": {
        "x": "3214",
        "y": "896"
      },
      "tags": [
        "Español"
      ]
    },
    {
      "text": "No sé... Creo que voy a volver a donde mis papás un tiempo con Ulysses.\n@insertMedia:emoji_sad\n\nTe juro que he intentado encontrar trabajo en otras partes. Pero nada. Esto del desempleo, sumado a los insultos que me llegan a cada instante, me desborda. \n\nY a pesar de que hay algo en mí me dice que vaya y reporte la situación ante la policía, no soy capaz. Como que siento que sería echarle leña al fuego y extender lo que está pasando para siempre...\n\n@if(choiceHasBeenMade \"Ally 3b-40\")\n[[No te preocupes por los mensajes. Ya no van a llegarte más.|Alex 11-24]]\n\n@else\n[[¿Sí crees que podría resultar algo de denunciar?|Alex 11-25]]\n\n@endif",
      "links": [
        {
          "name": "No te preocupes por los mensajes. Ya no van a llegarte más.|Alex 11-24",
          "link": "No te preocupes por los mensajes. Ya no van a llegarte más.|Alex 11-24",
          "broken": true
        },
        {
          "name": "¿Sí crees que podría resultar algo de denunciar?|Alex 11-25",
          "link": "¿Sí crees que podría resultar algo de denunciar?|Alex 11-25",
          "broken": true
        }
      ],
      "name": "Alex 11-22",
      "pid": "37",
      "position": {
        "x": "3177",
        "y": "1252"
      },
      "tags": [
        "emoji-larmes",
        "joueur-pro-ou-anti-studio",
        "Español"
      ]
    },
    {
      "text": "¡Obvio me quería ir! Cuando Sol me ofreció trabajo sentí un alivio enorme... \n\nAhora solo siento asfixia.\n\n[[¿Y si lo ves como una oportunidad?|Alex 11-22]]",
      "links": [
        {
          "name": "¿Y si lo ves como una oportunidad?|Alex 11-22",
          "link": "¿Y si lo ves como una oportunidad?|Alex 11-22",
          "broken": true
        }
      ],
      "name": "Alex 11-23",
      "pid": "38",
      "position": {
        "x": "3289",
        "y": "1046"
      },
      "tags": [
        "Español"
      ]
    },
    {
      "text": "¿Por qué?\n\n[[...Ally va a hacer que el acoso se detenga.|Alex 11-26]]",
      "links": [
        {
          "name": "...Ally va a hacer que el acoso se detenga.|Alex 11-26",
          "link": "...Ally va a hacer que el acoso se detenga.|Alex 11-26",
          "broken": true
        }
      ],
      "name": "Alex 11-24",
      "pid": "39",
      "position": {
        "x": "3412",
        "y": "1443"
      },
      "tags": [
        "Español"
      ]
    },
    {
      "text": "¿A veces? Siento que, si tuviera los nombres de verdad de toda esa gente, seguro algo positivo resultaría de denunciar... Pero que con \"NotATroll_95\" y \"ColombianPowah\" no conseguiría más que un espaldarazo burlón de \"ánimo\".\n\n[[Ally me propuso algo al respecto...|Alex 11-7]]",
      "links": [
        {
          "name": "Ally me propuso algo al respecto...|Alex 11-7",
          "link": "Ally me propuso algo al respecto...|Alex 11-7",
          "broken": true
        }
      ],
      "name": "Alex 11-25",
      "pid": "40",
      "position": {
        "x": "2986",
        "y": "1149"
      },
      "tags": [
        "Español"
      ]
    },
    {
      "text": "!!! ¡Pero si fueron ellos quienes le dieron toda mi información a la comunidad! ... Lo increíble es que esté dispuesta a sacrificarla así como así. Realmente no tiene escrúpulos...\n\n[[No. :( Y eso que siento que aún no ha desplegado todo su arsenal.|Alex 11-10]]",
      "links": [
        {
          "name": "No. :( Y eso que siento que aún no ha desplegado todo su arsenal.|Alex 11-10",
          "link": "No. :( Y eso que siento que aún no ha desplegado todo su arsenal.|Alex 11-10",
          "broken": true
        }
      ],
      "name": "Alex 11-9",
      "pid": "41",
      "position": {
        "x": "2690",
        "y": "1573"
      },
      "tags": [
        "Español"
      ]
    },
    {
      "text": "Me asustas. ¿Qué más podría hacer?\n\n[[Hacer público TODO lo que tiene sobre nosotros.|Alex 11-11]]",
      "links": [
        {
          "name": "Hacer público TODO lo que tiene sobre nosotros.|Alex 11-11",
          "link": "Hacer público TODO lo que tiene sobre nosotros.|Alex 11-11",
          "broken": true
        }
      ],
      "name": "Alex 11-10",
      "pid": "42",
      "position": {
        "x": "2693",
        "y": "1723"
      },
      "tags": [
        "Español"
      ]
    },
    {
      "text": "¿Qué más tiene acaso?\n\n@if(choiceHasBeenMade \"Ben out\")\n[[Tiene todas tus conversaciones privadas (y las mías). Imagínate el daño que causaría que alguien las leyera.|Alex 11-12]]\n\n@else\n[[Todas tus conversaciones privadas (y las mías). Fácilmente podría pasárselas a Ben para que las utilice en una disputa por la custodia de Ulysses...|Alex 11-12]]\n\n@endif",
      "links": [
        {
          "name": "Tiene todas tus conversaciones privadas (y las mías). Imagínate el daño que causaría que alguien las leyera.|Alex 11-12",
          "link": "Tiene todas tus conversaciones privadas (y las mías). Imagínate el daño que causaría que alguien las leyera.|Alex 11-12",
          "broken": true
        },
        {
          "name": "Todas tus conversaciones privadas (y las mías). Fácilmente podría pasárselas a Ben para que las utilice en una disputa por la custodia de Ulysses...|Alex 11-12",
          "link": "Todas tus conversaciones privadas (y las mías). Fácilmente podría pasárselas a Ben para que las utilice en una disputa por la custodia de Ulysses...|Alex 11-12",
          "broken": true
        }
      ],
      "name": "Alex 11-11",
      "pid": "43",
      "position": {
        "x": "2689",
        "y": "1872"
      },
      "tags": [
        "if",
        "Español"
      ]
    },
    {
      "text": "... Quiero llorar. ¿Qué podemos hacer ante esto?\n\n[[Podemos usar la información que hay en el App en contra del Estudio.|Alex 11-13]]",
      "links": [
        {
          "name": "Podemos usar la información que hay en el App en contra del Estudio.|Alex 11-13",
          "link": "Podemos usar la información que hay en el App en contra del Estudio.|Alex 11-13",
          "broken": true
        }
      ],
      "name": "Alex 11-12",
      "pid": "44",
      "position": {
        "x": "2689",
        "y": "2023"
      },
      "tags": [
        "Español"
      ]
    },
    {
      "text": "¿Cómo?\n\n[[Trabajando en equipo. Sé que (a pesar de todo lo que está pasando) la gente de la comunidad de Gao se uniría a nosotros si les mostramos todo lo que hemos descubierto. Juntos podríamos presentar una demanda colectiva.|Alex 11-14]]",
      "links": [
        {
          "name": "Trabajando en equipo. Sé que (a pesar de todo lo que está pasando) la gente de la comunidad de Gao se uniría a nosotros si les mostramos todo lo que hemos descubierto. Juntos podríamos presentar una demanda colectiva.|Alex 11-14",
          "link": "Trabajando en equipo. Sé que (a pesar de todo lo que está pasando) la gente de la comunidad de Gao se uniría a nosotros si les mostramos todo lo que hemos descubierto. Juntos podríamos presentar una demanda colectiva.|Alex 11-14",
          "broken": true
        }
      ],
      "name": "Alex 11-13",
      "pid": "45",
      "position": {
        "x": "2693",
        "y": "2181"
      },
      "tags": [
        "Español"
      ]
    },
    {
      "text": "Nikki dijo lo mismo. Dijo que la gente del Estudio se dio garra con nuestros datos y que están en riesgo si todo esto se hace público. Pero igual tienen la plata para contratar buenos abogados y alargar el proceso durante años. :/ \n\n[[Si Ally está siendo tan agresiva, es porque sabe que el Estudio no está a salvo.|Alex 11-15]]",
      "links": [
        {
          "name": "Si Ally está siendo tan agresiva, es porque sabe que el Estudio no está a salvo.|Alex 11-15",
          "link": "Si Ally está siendo tan agresiva, es porque sabe que el Estudio no está a salvo.|Alex 11-15",
          "broken": true
        }
      ],
      "name": "Alex 11-14",
      "pid": "46",
      "position": {
        "x": "2689",
        "y": "2331"
      },
      "tags": [
        "Español"
      ]
    },
    {
      "text": "¿Si crees que los demás jugadores se unirían a nosotras? (Acuérdate que me odian ahora -_-) \n\n[[De pronto no todos, pero sí los suficientes para que la demanda tome fuerza.|Alex 11-16]]",
      "links": [
        {
          "name": "De pronto no todos, pero sí los suficientes para que la demanda tome fuerza.|Alex 11-16",
          "link": "De pronto no todos, pero sí los suficientes para que la demanda tome fuerza.|Alex 11-16",
          "broken": true
        }
      ],
      "name": "Alex 11-15",
      "pid": "47",
      "position": {
        "x": "2685",
        "y": "2481"
      },
      "tags": [
        "Español"
      ]
    },
    {
      "text": "No sé, no sé, no sé. Siento que es una responsabilidad tan grande...\n\nPor un lado podría callarme y aceptar la reparación del Estudio, mientras que por el otro podría luchar al lado de gente que me ha tratado horrible, sin garantías de nada...\n\n@if(choiceHasBeenMade \"Ally 3b-40\")\n[[Está bien si no quieres luchar...|Alex 11-17]]\n[[Si decides luchar no vas a estar sola nunca.|Alex 11-17]]\n[[Ally hizo una propuesta interesante, sabes.|Alex 11-26]]\n\n@else\n[[Está bien si no quieres luchar...|Alex 11-17]]\n[[Si decides luchar no vas a estar sola nunca.|Alex 11-17]]\n\n@endif\n\n\n",
      "links": [
        {
          "name": "Está bien si no quieres luchar...|Alex 11-17",
          "link": "Está bien si no quieres luchar...|Alex 11-17",
          "broken": true
        },
        {
          "name": "Si decides luchar no vas a estar sola nunca.|Alex 11-17",
          "link": "Si decides luchar no vas a estar sola nunca.|Alex 11-17",
          "broken": true
        },
        {
          "name": "Ally hizo una propuesta interesante, sabes.|Alex 11-26",
          "link": "Ally hizo una propuesta interesante, sabes.|Alex 11-26",
          "broken": true
        },
        {
          "name": "Está bien si no quieres luchar...|Alex 11-17",
          "link": "Está bien si no quieres luchar...|Alex 11-17",
          "broken": true
        },
        {
          "name": "Si decides luchar no vas a estar sola nunca.|Alex 11-17",
          "link": "Si decides luchar no vas a estar sola nunca.|Alex 11-17",
          "broken": true
        }
      ],
      "name": "Alex 11-16",
      "pid": "48",
      "position": {
        "x": "2691",
        "y": "2631"
      },
      "tags": [
        "if",
        "Español"
      ]
    },
    {
      "text": "... Gracias. Por todo... Voy a pensarlo bien.",
      "name": "Alex 11-17",
      "pid": "49",
      "position": {
        "x": "2702",
        "y": "2809"
      },
      "tags": [
        "Español"
      ]
    },
    {
      "text": "¿Cómo así?\n\n[[... Hice un trato con ella.|Alex 11-27]]",
      "links": [
        {
          "name": "... Hice un trato con ella.|Alex 11-27",
          "link": "... Hice un trato con ella.|Alex 11-27",
          "broken": true
        }
      ],
      "name": "Alex 11-26",
      "pid": "50",
      "position": {
        "x": "3436",
        "y": "2829"
      },
      "tags": [
        "Español"
      ]
    },
    {
      "text": "No lo puedo creer... ¡¿Cómo pudiste aceptar un trato con ella?!\n\n[[Estoy ayudándote, Alex...|Alex 11-28]]\n[[¡Pero quiere decir que cumple con su promesa !|Alex 11-29]]",
      "links": [
        {
          "name": "Estoy ayudándote, Alex...|Alex 11-28",
          "link": "Estoy ayudándote, Alex...|Alex 11-28",
          "broken": true
        },
        {
          "name": "¡Pero quiere decir que cumple con su promesa !|Alex 11-29",
          "link": "¡Pero quiere decir que cumple con su promesa !|Alex 11-29",
          "broken": true
        }
      ],
      "name": "Alex 11-27",
      "pid": "51",
      "position": {
        "x": "3441",
        "y": "2979"
      },
      "tags": [
        "Español"
      ]
    },
    {
      "text": "¡¿Ayudándome?! ¡¿Sin consultarme nada?! No soy una princesa que necesita que la salven! \n\n¡Ahora voy a hacer todo SOLA! ¡Voy a ir a la comisaría SOLA!\n\n¡Nunca te pedí que resolvieras mis problemas, lo único que necesitaba era que fueras SINCERA y que me apoyaras!\n\n[[Alex... Perdón...|Alex 11-30]]\n@showOnlyIfChoiceMade \"Ally 3b-40\" \n[[Alex. Ally es más fuerte.|Alex 11-31]]",
      "links": [
        {
          "name": "Alex... Perdón...|Alex 11-30",
          "link": "Alex... Perdón...|Alex 11-30",
          "broken": true
        },
        {
          "name": "Alex. Ally es más fuerte.|Alex 11-31",
          "link": "Alex. Ally es más fuerte.|Alex 11-31",
          "broken": true
        }
      ],
      "name": "Alex 11-28",
      "pid": "52",
      "position": {
        "x": "3606",
        "y": "3188"
      },
      "tags": [
        "if",
        "Español"
      ]
    },
    {
      "text": "¡Sólo tenías que pensar! Ahora ella va a esperar que le entreguemos todo lo que Blaze dejó. \n\nGracias por nada.\n\n[[Alex. Ally es más fuerte.|Alex 11-31]]\n[[Alex. Perdón. No quise traicionarte...|Alex 11-32]]",
      "links": [
        {
          "name": "Alex. Ally es más fuerte.|Alex 11-31",
          "link": "Alex. Ally es más fuerte.|Alex 11-31",
          "broken": true
        },
        {
          "name": "Alex. Perdón. No quise traicionarte...|Alex 11-32",
          "link": "Alex. Perdón. No quise traicionarte...|Alex 11-32",
          "broken": true
        }
      ],
      "name": "Alex 11-30",
      "pid": "53",
      "position": {
        "x": "3415",
        "y": "3458"
      },
      "tags": [
        "Español"
      ]
    },
    {
      "text": "¡¿Y entonces?! ¿Por eso tenías que entregarle todo?\n\n[[Alex. Ally no es tu enemiga, es la solución.|Alex 11-35]]\n[[Seguir resistiendo era muy peligroso... Piensa en tu futuro, en tu hijo... Piensa en mí. ¡No eres la única en este mierdero, Alex!|Alex 11-33]]",
      "links": [
        {
          "name": "Alex. Ally no es tu enemiga, es la solución.|Alex 11-35",
          "link": "Alex. Ally no es tu enemiga, es la solución.|Alex 11-35",
          "broken": true
        },
        {
          "name": "Seguir resistiendo era muy peligroso... Piensa en tu futuro, en tu hijo... Piensa en mí. ¡No eres la única en este mierdero, Alex!|Alex 11-33",
          "link": "Seguir resistiendo era muy peligroso... Piensa en tu futuro, en tu hijo... Piensa en mí. ¡No eres la única en este mierdero, Alex!|Alex 11-33",
          "broken": true
        }
      ],
      "name": "Alex 11-31",
      "pid": "54",
      "position": {
        "x": "3902",
        "y": "3510"
      },
      "tags": [
        "Español"
      ]
    },
    {
      "text": "... Blaze me deja el mierdero y se larga.\nNikki piensa que todo es un juego.\nY tú... Ya no sé en quien confiar.\n\n[[Alex. Créeme. Lo último que quiero es lastimarte.|Alex 11-45]]",
      "links": [
        {
          "name": "Alex. Créeme. Lo último que quiero es lastimarte.|Alex 11-45",
          "link": "Alex. Créeme. Lo último que quiero es lastimarte.|Alex 11-45",
          "broken": true
        }
      ],
      "name": "Alex 11-32",
      "pid": "55",
      "position": {
        "x": "3360",
        "y": "3634"
      },
      "tags": [
        "Español"
      ]
    },
    {
      "text": "... ¿Tienes miedo?\n\n[[Sí. No te alcanzas a imaginar toda la información que el Estudio tiene de ti... y de mí.|Alex 11-39]]",
      "links": [
        {
          "name": "Sí. No te alcanzas a imaginar toda la información que el Estudio tiene de ti... y de mí.|Alex 11-39",
          "link": "Sí. No te alcanzas a imaginar toda la información que el Estudio tiene de ti... y de mí.|Alex 11-39",
          "broken": true
        }
      ],
      "name": "Alex 11-33",
      "pid": "56",
      "position": {
        "x": "3857",
        "y": "3808"
      },
      "tags": [
        "Español"
      ]
    },
    {
      "text": "Wow... Realmente te lavó el cerebro.\n\n[[-_- Lo que propone es interesante.|Alex 11-37]]\n[[Alex... La situación estaba perdida desde el comienzo.|Alex 11-33]]",
      "links": [
        {
          "name": "-_- Lo que propone es interesante.|Alex 11-37",
          "link": "-_- Lo que propone es interesante.|Alex 11-37",
          "broken": true
        },
        {
          "name": "Alex... La situación estaba perdida desde el comienzo.|Alex 11-33",
          "link": "Alex... La situación estaba perdida desde el comienzo.|Alex 11-33",
          "broken": true
        }
      ],
      "name": "Alex 11-35",
      "pid": "57",
      "position": {
        "x": "4022",
        "y": "3656"
      },
      "tags": [
        "Español"
      ]
    },
    {
      "text": "Déjame adivinar... ¿Te propuso dinero, cierto? Solo por saber, dime, ¿cuánto crees que vale una vida humana y de calidad? Me conformo con una de segunda como la mía. ¡A ver! ¡Dime cuánto vale!\n\n[[Alex. Te estoy ofreciendo una salida. Si prefieres terminar pobre y jodida es tu decisión.|Alex 11-57]]\n[[¿El precio de tu ego es superior a garantizar la vida de tu hijo?|Alex 11-47]]",
      "links": [
        {
          "name": "Alex. Te estoy ofreciendo una salida. Si prefieres terminar pobre y jodida es tu decisión.|Alex 11-57",
          "link": "Alex. Te estoy ofreciendo una salida. Si prefieres terminar pobre y jodida es tu decisión.|Alex 11-57",
          "broken": true
        },
        {
          "name": "¿El precio de tu ego es superior a garantizar la vida de tu hijo?|Alex 11-47",
          "link": "¿El precio de tu ego es superior a garantizar la vida de tu hijo?|Alex 11-47",
          "broken": true
        }
      ],
      "name": "Alex 11-37",
      "pid": "58",
      "position": {
        "x": "4140",
        "y": "3807"
      },
      "tags": [
        "Español"
      ]
    },
    {
      "text": "Espera. ¿Acaso no ves todo lo que tenemos sobre ellos?\n\nCuando los demás jugadores vean la manera en que el Estudio está explotando sus datos y jodiendo sus vidas, seguro se unirán a nuestra lucha. \n\nAlly está siendo así de agresiva porque tiene mucho que perder. Mucho más que yo al menos.\n\n[[Alex. No. Todavía te queda mucho por perder.|Alex 11-40]]",
      "links": [
        {
          "name": "Alex. No. Todavía te queda mucho por perder.|Alex 11-40",
          "link": "Alex. No. Todavía te queda mucho por perder.|Alex 11-40",
          "broken": true
        }
      ],
      "name": "Alex 11-39",
      "pid": "59",
      "position": {
        "x": "3857",
        "y": "3958"
      },
      "tags": [
        "Español"
      ]
    },
    {
      "text": "... ¿Como qué?\n\n[[Ally podría pasarle tus conversaciones privadas a Ben.|Alex 11-42]]",
      "links": [
        {
          "name": "Ally podría pasarle tus conversaciones privadas a Ben.|Alex 11-42",
          "link": "Ally podría pasarle tus conversaciones privadas a Ben.|Alex 11-42",
          "broken": true
        }
      ],
      "name": "Alex 11-40",
      "pid": "60",
      "position": {
        "x": "3857",
        "y": "4108"
      },
      "tags": [
        "Español"
      ]
    },
    {
      "text": "... ¿Me estás chantajeando?\n\n[[Escoje bien, Alex.|Alex 11-43]]",
      "links": [
        {
          "name": "Escoje bien, Alex.|Alex 11-43",
          "link": "Escoje bien, Alex.|Alex 11-43",
          "broken": true
        }
      ],
      "name": "Alex 11-42",
      "pid": "61",
      "position": {
        "x": "3853",
        "y": "4258"
      },
      "tags": [
        "Español"
      ]
    },
    {
      "text": "........",
      "name": "Alex 11-43",
      "pid": "62",
      "position": {
        "x": "3857",
        "y": "4480"
      },
      "tags": [
        "Español"
      ]
    },
    {
      "text": "Ya no tengo nada que decirte.\n\n[[... Alex... Ally puede solucionar todos tus problemas. Si cambias de opinión, avísame.]]",
      "links": [
        {
          "name": "... Alex... Ally puede solucionar todos tus problemas. Si cambias de opinión, avísame.",
          "link": "... Alex... Ally puede solucionar todos tus problemas. Si cambias de opinión, avísame.",
          "broken": true
        }
      ],
      "name": "Alex 11-57",
      "pid": "63",
      "position": {
        "x": "4343",
        "y": "4469"
      },
      "tags": [
        "Español"
      ]
    },
    {
      "text": "...",
      "name": "... Alex... Ally puede solucionar todos tus problemas. Si cambias de opinión, avísame.",
      "pid": "121",
      "position": {
        "x": "3100",
        "y": "4500"
      },
      "tags": [
        "English"
      ]
    },
    {
      "text": "... No sé si pueda volver a confiar en ti...\n\nVoy a ver cómo me las arreglo.",
      "name": "Alex 11-45",
      "pid": "64",
      "position": {
        "x": "3283",
        "y": "4516"
      },
      "tags": [
        "Español"
      ]
    },
    {
      "text": "¡¿Cómo te atreves a mencionar a Ulysses?!\n\n[[Alex. Hago esto por tu bien.|Alex 11-42]]",
      "links": [
        {
          "name": "Alex. Hago esto por tu bien.|Alex 11-42",
          "link": "Alex. Hago esto por tu bien.|Alex 11-42",
          "broken": true
        }
      ],
      "name": "Alex 11-47",
      "pid": "65",
      "position": {
        "x": "4054",
        "y": "4092"
      },
      "tags": [
        "Español"
      ]
    },
    {
      "text": "¡¿Será que cumple con su promesa como tú cumples con la tuya?!\n\n[[Estoy ayudándote, Alex...|Alex 11-28]]",
      "links": [
        {
          "name": "Estoy ayudándote, Alex...|Alex 11-28",
          "link": "Estoy ayudándote, Alex...|Alex 11-28",
          "broken": true
        }
      ],
      "name": "Alex 11-29",
      "pid": "66",
      "position": {
        "x": "3678",
        "y": "3002"
      }
    }
  ],
  "name": "AlexBlaze",
  "startnode": "1",
  "creator": "Twine",
  "creator-version": "2.3.15",
  "ifid": "35DC0395-FABD-41C5-A1AA-C8E5B05831F0"
}
