{
  "passages": [
    {
      "text": "@showIfGameHasBeenPlayed TheIntruder\n@passive\n[[Hello|Sol 1-1]]",
      "links": [
        {
          "name": "Hello|Sol 1-1",
          "link": "Hello|Sol 1-1",
          "broken": true
        }
      ],
      "name": "Sol-1",
      "pid": "1",
      "position": {
        "x": "1300",
        "y": "100"
      },
      "tags": [
        "Works",
        "English"
      ]
    },
    {
      "text": "What do you think?\n\n[[Ha. Of course she did.|Sol 1-4]]\n[[Well I don't know... We've just met...|Sol 1-5]]",
      "links": [
        {
          "name": "Ha. Of course she did.|Sol 1-4",
          "link": "Ha. Of course she did.|Sol 1-4",
          "broken": true
        },
        {
          "name": "Well I don't know... We've just met...|Sol 1-5",
          "link": "Well I don't know... We've just met...|Sol 1-5",
          "broken": true
        }
      ],
      "name": "Sol 1-2",
      "pid": "2",
      "position": {
        "x": "700",
        "y": "500"
      },
      "tags": [
        "Works",
        "English"
      ]
    },
    {
      "text": "We fight on even ground then?\n\n[[\"Fight on even ground?\" I'm not here to fight, alright?|Sol 1-10]]\n[[You wanna fight? You think you got what it takes?|Sol 1-11]]",
      "links": [
        {
          "name": "\"Fight on even ground?\" I'm not here to fight, alright?|Sol 1-10",
          "link": "\"Fight on even ground?\" I'm not here to fight, alright?|Sol 1-10",
          "broken": true
        },
        {
          "name": "You wanna fight? You think you got what it takes?|Sol 1-11",
          "link": "You wanna fight? You think you got what it takes?|Sol 1-11",
          "broken": true
        }
      ],
      "name": "Sol 1-3",
      "pid": "3",
      "position": {
        "x": "1901",
        "y": "498"
      },
      "tags": [
        "Works",
        "English"
      ]
    },
    {
      "text": "OK. Some confidence. I like that...\nSo, what do you think of Alex?\n\n[[Woah, slow down. I don't know you. Why would I tell you about her?|Sol 1-6]] ",
      "links": [
        {
          "name": "Woah, slow down. I don't know you. Why would I tell you about her?|Sol 1-6",
          "link": "Woah, slow down. I don't know you. Why would I tell you about her?|Sol 1-6",
          "broken": true
        }
      ],
      "name": "Sol 1-4",
      "pid": "4",
      "position": {
        "x": "500",
        "y": "700"
      },
      "tags": [
        "Works",
        "English"
      ]
    },
    {
      "text": "A shy soul are you?\nI can deal with that.\nSo tell me. What do you think of Alex?\n\n[[Why do you care what I think of her?|Sol 1-6]]",
      "links": [
        {
          "name": "Why do you care what I think of her?|Sol 1-6",
          "link": "Why do you care what I think of her?|Sol 1-6",
          "broken": true
        }
      ],
      "name": "Sol 1-5",
      "pid": "5",
      "position": {
        "x": "901",
        "y": "700"
      },
      "tags": [
        "Works",
        "English"
      ]
    },
    {
      "text": "That's what you think.\n\nThere is no situation in life where fighting isn't worth it. Everything that happens is a challenge—an opportunity to become a better version of yourself. That's why I love Gao The Intruder. \n\nThe first time I played it, I accidentally deleted two real-life contacts before identifying the intruder. And I realized I didn't know who the people in my contact list were. #feelsbad\n\nNowadays, however, I can recall each and every one in an instant. My contacts have become my strength.\n\n[[Ooook... I'm going to leave you and your contacts alone now.|Sol 1-12]]",
      "links": [
        {
          "name": "Ooook... I'm going to leave you and your contacts alone now.|Sol 1-12",
          "link": "Ooook... I'm going to leave you and your contacts alone now.|Sol 1-12",
          "broken": true
        }
      ],
      "name": "Sol 1-10",
      "pid": "6",
      "position": {
        "x": "1600",
        "y": "700"
      },
      "tags": [
        "Works",
        "English"
      ]
    },
    {
      "text": "Wait!\nI would like to know what you think of Alex.\n\n[[Woah, slow down. We don't know each other. Why would I tell you about her?|Sol 1-6]]\n[[It's none of your business.|Sol 1-20]]",
      "links": [
        {
          "name": "Woah, slow down. We don't know each other. Why would I tell you about her?|Sol 1-6",
          "link": "Woah, slow down. We don't know each other. Why would I tell you about her?|Sol 1-6",
          "broken": true
        },
        {
          "name": "It's none of your business.|Sol 1-20",
          "link": "It's none of your business.|Sol 1-20",
          "broken": true
        }
      ],
      "name": "Sol 1-12",
      "pid": "7",
      "position": {
        "x": "1600",
        "y": "898"
      },
      "tags": [
        "Works",
        "English"
      ]
    },
    {
      "text": "Some spunk! I like it!\nI love people who stand for themselves.\nIt's the kind of spirit that I share. And it led me to become a Top Player on Gao The Intruder.\nYou know what... I think you might grow on me.\n\n[[... Why do I feel like it doesn't happen often?|Sol 1-13]]\n",
      "links": [
        {
          "name": "... Why do I feel like it doesn't happen often?|Sol 1-13",
          "link": "... Why do I feel like it doesn't happen often?|Sol 1-13",
          "broken": true
        }
      ],
      "name": "Sol 1-11",
      "pid": "8",
      "position": {
        "x": "2200",
        "y": "700"
      },
      "tags": [
        "Works",
        "English"
      ]
    },
    {
      "text": "I care about Alex. And every insight concerning her is relevant.\n\n[[Every insight? Want a benchmark test with that?|Sol 1-7]] ",
      "links": [
        {
          "name": "Every insight? Want a benchmark test with that?|Sol 1-7",
          "link": "Every insight? Want a benchmark test with that?|Sol 1-7",
          "broken": true
        }
      ],
      "name": "Sol 1-6",
      "pid": "9",
      "position": {
        "x": "700",
        "y": "1100"
      },
      "tags": [
        "Works",
        "English"
      ]
    },
    {
      "text": "Are you sure?\n\n[[Yes, this conversation is over.|Sol 1-21]]\n[[... Why are you so interested?|Sol 1-22]]",
      "links": [
        {
          "name": "Yes, this conversation is over.|Sol 1-21",
          "link": "Yes, this conversation is over.|Sol 1-21",
          "broken": true
        },
        {
          "name": "... Why are you so interested?|Sol 1-22",
          "link": "... Why are you so interested?|Sol 1-22",
          "broken": true
        }
      ],
      "name": "Sol 1-20",
      "pid": "10",
      "position": {
        "x": "1901",
        "y": "1100"
      },
      "tags": [
        "Works",
        "English"
      ]
    },
    {
      "text": "Alright. Suit yourself.\n... But I'll figure out what you think eventually, you know? \nWhen I want a piece of information, I get it. ALWAYS.\n\n@insertMedia:gao_gao_the_prosecutor\n\n[[You're crazy...|Sol 1-44]]\n",
      "links": [
        {
          "name": "You're crazy...|Sol 1-44",
          "link": "You're crazy...|Sol 1-44",
          "broken": true
        }
      ],
      "name": "Sol 1-21",
      "pid": "11",
      "position": {
        "x": "1900",
        "y": "1300"
      },
      "tags": [
        "Works",
        "English"
      ]
    },
    {
      "text": "Is that a compliment? I think it's a compliment.\n\n[[-_-]]\n[[><]]",
      "links": [
        {
          "name": "-_-",
          "link": "-_-",
          "pid": "13"
        },
        {
          "name": "><",
          "link": "><",
          "broken": true
        }
      ],
      "name": "Sol 1-44",
      "pid": "12",
      "position": {
        "x": "2100",
        "y": "3900"
      },
      "tags": [
        "Works",
        "English"
      ]
    },
    {
      "text": "-_-",
      "name": "-_-",
      "pid": "13",
      "position": {
        "x": "2000",
        "y": "4100"
      },
      "tags": [
        "Works",
        "English"
      ]
    },
    {
      "text": "><",
      "name": "><",
      "pid": "14",
      "position": {
        "x": "2200",
        "y": "4100"
      },
      "tags": [
        "Works",
        "English"
      ]
    },
    {
      "text": "Ha. Funny. I just ask around. It's a good thing to do when you're considering letting someone into your life. No?\n\n[[No. It's just weird.|Sol 1-23]]\n[[Seems like you're terrified of letting people in.|Sol 1-24]]",
      "links": [
        {
          "name": "No. It's just weird.|Sol 1-23",
          "link": "No. It's just weird.|Sol 1-23",
          "broken": true
        },
        {
          "name": "Seems like you're terrified of letting people in.|Sol 1-24",
          "link": "Seems like you're terrified of letting people in.|Sol 1-24",
          "broken": true
        }
      ],
      "name": "Sol 1-7",
      "pid": "15",
      "position": {
        "x": "700",
        "y": "1300"
      },
      "tags": [
        "Works",
        "English"
      ]
    },
    {
      "text": "-_- How would YOU handle it then?\n\n[[I would engage the person directly and get to know them. You know... Like most everyone else does...|Sol 1-14]]",
      "links": [
        {
          "name": "I would engage the person directly and get to know them. You know... Like most everyone else does...|Sol 1-14",
          "link": "I would engage the person directly and get to know them. You know... Like most everyone else does...|Sol 1-14",
          "broken": true
        }
      ],
      "name": "Sol 1-23",
      "pid": "16",
      "position": {
        "x": "1300",
        "y": "1500"
      },
      "tags": [
        "Works",
        "English"
      ]
    },
    {
      "text": "I'm not! I'm just careful.\n\n[[Are you like that with everything?|Sol 1-25]]",
      "links": [
        {
          "name": "Are you like that with everything?|Sol 1-25",
          "link": "Are you like that with everything?|Sol 1-25",
          "broken": true
        }
      ],
      "name": "Sol 1-24",
      "pid": "17",
      "position": {
        "x": "1100",
        "y": "1500"
      },
      "tags": [
        "Works",
        "English"
      ]
    },
    {
      "text": "To each its own.\nI ask around and it works for me.\nBTW, now I'm going to have to ask around about as well.\n\n[[LOL! Wait. I never said I wanted to be a part of your life.|Sol 1-28]]",
      "links": [
        {
          "name": "LOL! Wait. I never said I wanted to be a part of your life.|Sol 1-28",
          "link": "LOL! Wait. I never said I wanted to be a part of your life.|Sol 1-28",
          "broken": true
        }
      ],
      "name": "Sol 1-14",
      "pid": "18",
      "position": {
        "x": "1300",
        "y": "1700"
      },
      "tags": [
        "Works",
        "English"
      ]
    },
    {
      "text": "I know. But anyone who becomes involved with Alex becomes involved with me.\n\n[[Woman. You're getting a little ahead of yourself. Alex and I just met.|Sol 1-29]]",
      "links": [
        {
          "name": "Woman. You're getting a little ahead of yourself. Alex and I just met.|Sol 1-29",
          "link": "Woman. You're getting a little ahead of yourself. Alex and I just met.|Sol 1-29",
          "broken": true
        }
      ],
      "name": "Sol 1-28",
      "pid": "19",
      "position": {
        "x": "1300",
        "y": "2300"
      },
      "tags": [
        "Works",
        "English"
      ]
    },
    {
      "text": "For long enough. \n\nYour interaction has already warranted a standard R.A.I. (Risk Assessment Inquiry).\n\nPlease state your birthplace and birthday. (*Please don't be a Scorpio. I hate Scorpios.*)\n\n[[Isn't that a little arbitrary?|Sol 1-30]]\n[[... Don't bad mouth Scorpios.|Sol 1-31]]\n[[...(So do I.)|Sol 1-32]]",
      "links": [
        {
          "name": "Isn't that a little arbitrary?|Sol 1-30",
          "link": "Isn't that a little arbitrary?|Sol 1-30",
          "broken": true
        },
        {
          "name": "... Don't bad mouth Scorpios.|Sol 1-31",
          "link": "... Don't bad mouth Scorpios.|Sol 1-31",
          "broken": true
        },
        {
          "name": "...(So do I.)|Sol 1-32",
          "link": "...(So do I.)|Sol 1-32",
          "broken": true
        }
      ],
      "name": "Sol 1-29",
      "pid": "20",
      "position": {
        "x": "1300",
        "y": "2498"
      },
      "tags": [
        "Works",
        "English"
      ]
    },
    {
      "text": "Trust me, I speak from experience.\n\n[[Ok. Ok. I believe you.|Sol 1-33]]",
      "links": [
        {
          "name": "Ok. Ok. I believe you.|Sol 1-33",
          "link": "Ok. Ok. I believe you.|Sol 1-33",
          "broken": true
        }
      ],
      "name": "Sol 1-30",
      "pid": "21",
      "position": {
        "x": "1100",
        "y": "2700"
      },
      "tags": [
        "Works",
        "English"
      ]
    },
    {
      "text": "Oh, no. You're a Scorpio?\n\n[[I am.|Sol 1-34]]\n[[Of course not.|Sol 1-35]]\n",
      "links": [
        {
          "name": "I am.|Sol 1-34",
          "link": "I am.|Sol 1-34",
          "broken": true
        },
        {
          "name": "Of course not.|Sol 1-35",
          "link": "Of course not.|Sol 1-35",
          "broken": true
        }
      ],
      "name": "Sol 1-31",
      "pid": "22",
      "position": {
        "x": "1300",
        "y": "2700"
      },
      "tags": [
        "Works",
        "English"
      ]
    },
    {
      "text": "Scorpios always let you down. Always.\nI could tell you a million disappointing truths about the Scorpio Top Player, Ajay... \n\nBut we shouldn't focus on bad memories. We should focus on you.\n\n[[Ajay? Who's that?|Sol 1-36]]\n[[On me?|Sol 1-37]]",
      "links": [
        {
          "name": "Ajay? Who's that?|Sol 1-36",
          "link": "Ajay? Who's that?|Sol 1-36",
          "broken": true
        },
        {
          "name": "On me?|Sol 1-37",
          "link": "On me?|Sol 1-37",
          "broken": true
        }
      ],
      "name": "Sol 1-32",
      "pid": "23",
      "position": {
        "x": "1500",
        "y": "2700"
      },
      "tags": [
        "Works",
        "English"
      ]
    },
    {
      "text": "Good. Now let's finish the R.A.I.\n\n[[*Sighs*|Sol 1-37]]\n",
      "links": [
        {
          "name": "*Sighs*|Sol 1-37",
          "link": "*Sighs*|Sol 1-37",
          "broken": true
        }
      ],
      "name": "Sol 1-33",
      "pid": "24",
      "position": {
        "x": "1000",
        "y": "2900"
      },
      "tags": [
        "Works",
        "English"
      ]
    },
    {
      "text": "Do you have a driver's license? If so, have you ever been fined for speeding? For running a red light?\nWhat about allergies? Are your parents divorced? Are you dating right now? Or are you living \"La Vida Loca\"? Have you ever cheated, or broken a relationship up? When did you last go to the dentist?\n\n[[...|Sol 1-38]]\n[[Hahahahahaha. What is this!|Sol 1-39]]",
      "links": [
        {
          "name": "...|Sol 1-38",
          "link": "...|Sol 1-38",
          "broken": true
        },
        {
          "name": "Hahahahahaha. What is this!|Sol 1-39",
          "link": "Hahahahahaha. What is this!|Sol 1-39",
          "broken": true
        }
      ],
      "name": "Sol 1-37",
      "pid": "25",
      "position": {
        "x": "1300",
        "y": "3100"
      },
      "tags": [
        "Works",
        "English"
      ]
    },
    {
      "text": "We are opting for silence now?\n\n.....\n\nFine.\nI take note.\nSubject withholds information and is unwilling to cooperate (a classic case of CAI).\n\n[[CAI?|Sol 1-40]]",
      "links": [
        {
          "name": "CAI?|Sol 1-40",
          "link": "CAI?|Sol 1-40",
          "broken": true
        }
      ],
      "name": "Sol 1-38",
      "pid": "26",
      "position": {
        "x": "1200",
        "y": "3300"
      },
      "tags": [
        "Works",
        "English"
      ]
    },
    {
      "text": "it's called speed, baby. Can't waste time.\n\nTalking about wasting time. I asked Alex out and she hasn't replied yet. Do you know anything?\n\n[[Ummm... Not much. She's taking her time.|Sol 1-42]]\n[[... I won't answer for her.|Sol 1-43]]",
      "links": [
        {
          "name": "Ummm... Not much. She's taking her time.|Sol 1-42",
          "link": "Ummm... Not much. She's taking her time.|Sol 1-42",
          "broken": true
        },
        {
          "name": "... I won't answer for her.|Sol 1-43",
          "link": "... I won't answer for her.|Sol 1-43",
          "broken": true
        }
      ],
      "name": "Sol 1-39",
      "pid": "27",
      "position": {
        "x": "1400",
        "y": "3298"
      },
      "tags": [
        "Works",
        "English"
      ]
    },
    {
      "text": "Chronic Authority Issues.\n\nI'm sure you're the archetypical case: You hide your real name on social media, pirate old movies, smoke some weed on the size, uncaring if the boys next door see you through the window.\n\nThe type of person that never tells the truth.\n\n[[What the hell's wrong with you! I'm ending this conversation right now!|Sol 1-41]]",
      "links": [
        {
          "name": "What the hell's wrong with you! I'm ending this conversation right now!|Sol 1-41",
          "link": "What the hell's wrong with you! I'm ending this conversation right now!|Sol 1-41",
          "broken": true
        }
      ],
      "name": "Sol 1-40",
      "pid": "28",
      "position": {
        "x": "1300",
        "y": "3500"
      },
      "tags": [
        "Works",
        "English"
      ]
    },
    {
      "text": "...I have a baaaad feeling about this. Then again. Perhaps the next questions will redeem you.\n\n[[Next questions?|Sol 1-37]]",
      "links": [
        {
          "name": "Next questions?|Sol 1-37",
          "link": "Next questions?|Sol 1-37",
          "broken": true
        }
      ],
      "name": "Sol 1-34",
      "pid": "29",
      "position": {
        "x": "1200",
        "y": "2900"
      },
      "tags": [
        "Works",
        "English"
      ]
    },
    {
      "text": "Thank God! You had me sweating for an instant. \n\nNow let's continue our R.A.I.\n\n[[Is this going to take long?|Sol 1-37]]\n",
      "links": [
        {
          "name": "Is this going to take long?|Sol 1-37",
          "link": "Is this going to take long?|Sol 1-37",
          "broken": true
        }
      ],
      "name": "Sol 1-35",
      "pid": "30",
      "position": {
        "x": "1400",
        "y": "2898"
      },
      "tags": [
        "Works",
        "English"
      ]
    },
    {
      "text": "He's the best player at Gao The Prosecutor.\n\nAt first I thought he could be trusted... But I was wrong. Whatever you tell him leaks away. His little games are NOT innocent.\n\nAnyway, after that I promised myself I would never skip a R.A.I.\n\nSo let's continue.\n\n[[-_- How long is this \"R.A.I.\"?|Sol 1-37]]",
      "links": [
        {
          "name": "-_- How long is this \"R.A.I.\"?|Sol 1-37",
          "link": "-_- How long is this \"R.A.I.\"?|Sol 1-37",
          "broken": true
        }
      ],
      "name": "Sol 1-36",
      "pid": "31",
      "position": {
        "x": "1600",
        "y": "2900"
      },
      "tags": [
        "Works",
        "English"
      ]
    },
    {
      "text": "Thanks for the insight, Sir, I might let you in some day (when we finish our R.A.I. of course).",
      "name": "Sol 1-42",
      "pid": "32",
      "position": {
        "x": "1500",
        "y": "4100"
      },
      "tags": [
        "Works",
        "English"
      ]
    },
    {
      "text": "I am. And it makes me invincible.\n\n[[Haha. Yeah, right.|Sol 1-26]]",
      "links": [
        {
          "name": "Haha. Yeah, right.|Sol 1-26",
          "link": "Haha. Yeah, right.|Sol 1-26",
          "broken": true
        }
      ],
      "name": "Sol 1-25",
      "pid": "33",
      "position": {
        "x": "1100",
        "y": "1700"
      },
      "tags": [
        "Works",
        "English"
      ]
    },
    {
      "text": "I stop danger in its tracks. \nBelieve me when I tell you; NOTHING surprises me.\n\n[[Ok. Ok... I believe you.|Sol 1-27]]",
      "links": [
        {
          "name": "Ok. Ok... I believe you.|Sol 1-27",
          "link": "Ok. Ok... I believe you.|Sol 1-27",
          "broken": true
        }
      ],
      "name": "Sol 1-26",
      "pid": "34",
      "position": {
        "x": "1100",
        "y": "1900"
      },
      "tags": [
        "Works",
        "English"
      ]
    },
    {
      "text": "Good. Now, onto the next part of our exchange; are YOU dangerous?\n\n[[Wait. I never said I wanted to be a part of your life.|Sol 1-28]]\n",
      "links": [
        {
          "name": "Wait. I never said I wanted to be a part of your life.|Sol 1-28",
          "link": "Wait. I never said I wanted to be a part of your life.|Sol 1-28",
          "broken": true
        }
      ],
      "name": "Sol 1-27",
      "pid": "35",
      "position": {
        "x": "1100",
        "y": "2100"
      },
      "tags": [
        "Works",
        "English"
      ]
    },
    {
      "text": "No special reason. I just ask around whenever I'm close to letting someone into my life. It's good insurance.\n\n[[Not when you make complete strangers uncomfortable...|Sol 1-23]]\n[[Seems to me like you're terrified of letting people in.|Sol 1-24]]",
      "links": [
        {
          "name": "Not when you make complete strangers uncomfortable...|Sol 1-23",
          "link": "Not when you make complete strangers uncomfortable...|Sol 1-23",
          "broken": true
        },
        {
          "name": "Seems to me like you're terrified of letting people in.|Sol 1-24",
          "link": "Seems to me like you're terrified of letting people in.|Sol 1-24",
          "broken": true
        }
      ],
      "name": "Sol 1-22",
      "pid": "36",
      "position": {
        "x": "1200",
        "y": "1300"
      },
      "tags": [
        "Works",
        "English"
      ]
    },
    {
      "text": "Good read. It doesn't. I am... apprehensive concerning new people. I've been hurt in the past.\nAnyway, after some bad experiences I've figured out a \"new acquaintance\" protocol.\n\n[[Isn't that a bit paranoid?|Sol 1-23]]",
      "links": [
        {
          "name": "Isn't that a bit paranoid?|Sol 1-23",
          "link": "Isn't that a bit paranoid?|Sol 1-23",
          "broken": true
        }
      ],
      "name": "Sol 1-13",
      "pid": "37",
      "position": {
        "x": "2200",
        "y": "900"
      },
      "tags": [
        "Works",
        "English"
      ]
    },
    {
      "text": "Hi.\n\nAlex told me about you.\n\n[[Really?|Sol 1-2]]\n[[She's said some things about you too.|Sol 1-3]]",
      "links": [
        {
          "name": "Really?|Sol 1-2",
          "link": "Really?|Sol 1-2",
          "broken": true
        },
        {
          "name": "She's said some things about you too.|Sol 1-3",
          "link": "She's said some things about you too.|Sol 1-3",
          "broken": true
        }
      ],
      "name": "Sol 1-1",
      "pid": "38",
      "position": {
        "x": "1300",
        "y": "300"
      },
      "tags": [
        "Works",
        "English"
      ]
    },
    {
      "text": "Suit yourself. \n\nBut remember. When I want a piece of information, I get it. ALWAYS.\n\n[[You're crazy...|Sol 1-44]]",
      "links": [
        {
          "name": "You're crazy...|Sol 1-44",
          "link": "You're crazy...|Sol 1-44",
          "broken": true
        }
      ],
      "name": "Sol 1-41",
      "pid": "39",
      "position": {
        "x": "1299",
        "y": "3697"
      },
      "tags": [
        "English",
        "Works"
      ]
    },
    {
      "text": "OK. I respect that.\n\nJust know that I'll figure it out eventually, you know?\nWhen I want a piece of information, I get it. ALWAYS.\n\n@insertMedia:gao_gao_the_spy\n\n[[You're crazy...|Sol 1-44]]",
      "links": [
        {
          "name": "You're crazy...|Sol 1-44",
          "link": "You're crazy...|Sol 1-44",
          "broken": true
        }
      ],
      "name": "Sol 1-43",
      "pid": "40",
      "position": {
        "x": "1564",
        "y": "3469"
      },
      "tags": [
        "Works",
        "English"
      ]
    }
  ],
  "name": "Sol",
  "startnode": "1",
  "creator": "Twine",
  "creator-version": "2.3.15",
  "ifid": "34CEAD63-F2CC-47EA-AD9B-30CDB88C6ED1"
}
