{
  "passages": [
    {
      "text": "@showIfGameHasBeenPlayed TheFilekeeper\n@wait 15\n@init\nBuenas.\n\n[[Hola.|Amin 1-1]]",
      "links": [
        {
          "name": "Hola.|Amin 1-1",
          "link": "Hola.|Amin 1-1",
          "broken": true
        }
      ],
      "name": "Amin-1",
      "pid": "1",
      "position": {
        "x": "516",
        "y": "132"
      },
      "tags": [
        "Works",
        "Español"
      ]
    },
    {
      "text": "¿Todo bien por acá?\n\n[[Sí.|Amin 1-3]]\n[[¿Alguien me va a escribir cada vez que empiece un juego nuevo?|Amin 1-2]]",
      "links": [
        {
          "name": "Sí.|Amin 1-3",
          "link": "Sí.|Amin 1-3",
          "broken": true
        },
        {
          "name": "¿Alguien me va a escribir cada vez que empiece un juego nuevo?|Amin 1-2",
          "link": "¿Alguien me va a escribir cada vez que empiece un juego nuevo?|Amin 1-2",
          "broken": true
        }
      ],
      "name": "Amin 1-1",
      "pid": "2",
      "position": {
        "x": "518",
        "y": "284"
      },
      "tags": [
        "Works",
        "Español"
      ]
    },
    {
      "text": "Me encanta. ¿Necesitas algo?\n\n[[No... Aunque la verdad pero me sorprende lo que gastan recibiéndonos en esta comunidad. ¡Parecen empleados de tiempo completo!|Amin 1-4]]\n[[No... pero siento que es como raro que todo el mundo me salude.|Amin 1-5]]",
      "links": [
        {
          "name": "No... Aunque la verdad pero me sorprende lo que gastan recibiéndonos en esta comunidad. ¡Parecen empleados de tiempo completo!|Amin 1-4",
          "link": "No... Aunque la verdad pero me sorprende lo que gastan recibiéndonos en esta comunidad. ¡Parecen empleados de tiempo completo!|Amin 1-4",
          "broken": true
        },
        {
          "name": "No... pero siento que es como raro que todo el mundo me salude.|Amin 1-5",
          "link": "No... pero siento que es como raro que todo el mundo me salude.|Amin 1-5",
          "broken": true
        }
      ],
      "name": "Amin 1-3",
      "pid": "3",
      "position": {
        "x": "726",
        "y": "450"
      },
      "tags": [
        "Works",
        "Español"
      ]
    },
    {
      "text": ":S Es posible. ¿Te molesta?\n\n[[No, pero me sorprende lo que gastan recibiéndonos. ¡Parecen empleados de tiempo completo!|Amin 1-4]]\n[[La verdad empieza a ser algo incómodo.|Amin 1-5]]",
      "links": [
        {
          "name": "No, pero me sorprende lo que gastan recibiéndonos. ¡Parecen empleados de tiempo completo!|Amin 1-4",
          "link": "No, pero me sorprende lo que gastan recibiéndonos. ¡Parecen empleados de tiempo completo!|Amin 1-4",
          "broken": true
        },
        {
          "name": "La verdad empieza a ser algo incómodo.|Amin 1-5",
          "link": "La verdad empieza a ser algo incómodo.|Amin 1-5",
          "broken": true
        }
      ],
      "name": "Amin 1-2",
      "pid": "4",
      "position": {
        "x": "403",
        "y": "433"
      },
      "tags": [
        "Works",
        "Español"
      ]
    },
    {
      "text": "Ja. Nadie nos obliga. :) Yo al menos lo hago por que quiero, y por retribuir de cierta manera todo lo que Gao y la comunidad han hecho por mí.\n\n[[¡¿Retribuir?!|Amin 1-6]]\n[[¿Qué \"ha hecho\" Gao por tí? o_O|Amin 1-7]]",
      "links": [
        {
          "name": "¡¿Retribuir?!|Amin 1-6",
          "link": "¡¿Retribuir?!|Amin 1-6",
          "broken": true
        },
        {
          "name": "¿Qué \"ha hecho\" Gao por tí? o_O|Amin 1-7",
          "link": "¿Qué \"ha hecho\" Gao por tí? o_O|Amin 1-7",
          "broken": true
        }
      ],
      "name": "Amin 1-4",
      "pid": "5",
      "position": {
        "x": "400",
        "y": "621"
      },
      "tags": [
        "Works",
        "Español"
      ]
    },
    {
      "text": "¡Perdón! Créeme que nadie quiso incomodarte.\n@if(choiceHasBeenMade \"Masako 1-2\")\nYo es que me tomo mi rol de \"Guía\" muy en serio... (mentiras, la verdad es que Masako me habló de ti y me dio curiosidad).\n\n[[¡Masako es súper cool!|Amin 1-8]]\n\n@else\nYo es que me tomo mi rol de \"Guía\" muy en serio... E intento retribuirle un poco a Gao y a Blaze todo lo que me han dado.\n\n[[¿Lo que te han dado?|Amin 1-9]] \n@endif",
      "links": [
        {
          "name": "¡Masako es súper cool!|Amin 1-8",
          "link": "¡Masako es súper cool!|Amin 1-8",
          "broken": true
        },
        {
          "name": "¿Lo que te han dado?|Amin 1-9",
          "link": "¿Lo que te han dado?|Amin 1-9",
          "broken": true
        }
      ],
      "name": "Amin 1-5",
      "pid": "6",
      "position": {
        "x": "800",
        "y": "625"
      },
      "tags": [
        "if",
        "Works",
        "Español"
      ]
    },
    {
      "text": "¡Es mi esposa. :)\nNos conocimos jugando a través de Gao. Y compartimos una pasión por Gao (en todas sus formas), con decirte que en nuestro matrimonio lo tuvimos en forma de peluche gigante. <3<3<3\n\n\n[[Wash.|Amin 1-10]]\n[[Ok... Está claro que lo quieren demasiado... ^^'|Amin 1-10]]",
      "links": [
        {
          "name": "Wash.|Amin 1-10",
          "link": "Wash.|Amin 1-10",
          "broken": true
        },
        {
          "name": "Ok... Está claro que lo quieren demasiado... ^^'|Amin 1-10",
          "link": "Ok... Está claro que lo quieren demasiado... ^^'|Amin 1-10",
          "broken": true
        }
      ],
      "name": "Amin 1-8",
      "pid": "7",
      "position": {
        "x": "800",
        "y": "775"
      },
      "tags": [
        "Works",
        "Español"
      ]
    },
    {
      "text": "Gracias a ellos conocí a mi esposa. (Por eso en la boda estuvimos de acuerdo con tener un peluche gigante de Gao. :D:D:D)\n\nY pues Blaze... Blaze ha logrado construir para todos nosotros una comunidad muy unida y generosa.\n\n[[He conocido gente que opina distinto...|Amin 1-11]]\n[[<3 <3 <3|Amin 1-10]]",
      "links": [
        {
          "name": "He conocido gente que opina distinto...|Amin 1-11",
          "link": "He conocido gente que opina distinto...|Amin 1-11",
          "broken": true
        },
        {
          "name": "<3 <3 <3|Amin 1-10",
          "link": "<3 <3 <3|Amin 1-10",
          "broken": true
        }
      ],
      "name": "Amin 1-9",
      "pid": "8",
      "position": {
        "x": "1000",
        "y": "773"
      },
      "tags": [
        "Works",
        "Español"
      ]
    },
    {
      "text": "Fue en Gao que conocí a mi esposa. :) Estaba jugando El Atleta y le mandé un reto... y perdí. :-p\n\n(Por eso tuvimos un peluche gigante de Gao en nuestro matrimonio xD)\n\nNo somos los únicos que nos encontramos así sabes. Todo es gracias a Blaze. Su compromiso con Gao terminó formando una comunidad muy unida y generosa.\n\n[[He conocido gente que opina distinto...|Amin 1-11]]",
      "links": [
        {
          "name": "He conocido gente que opina distinto...|Amin 1-11",
          "link": "He conocido gente que opina distinto...|Amin 1-11",
          "broken": true
        }
      ],
      "name": "Amin 1-6",
      "pid": "9",
      "position": {
        "x": "260",
        "y": "846"
      },
      "tags": [
        "Works",
        "Español"
      ]
    },
    {
      "text": "Muchas cosas. :) Pero sobre todo me presentó a Masako, mi esposa. <3<3<3 (Con decirte que en nuestra boda teníamos un peluche enorme de Gao. ^^)\n\nY es que aún hoy, Gao es una pasión que no se agota. Me gustan la comunidad, los memes, los juegos (Sobre todo El Archivista).\n\nY amo a Blaze.\n\n[[¿El Archivista?|Amin 1-20]]\n[[¿AMAS a Blaze? o_O|Amin 1-20]]",
      "links": [
        {
          "name": "¿El Archivista?|Amin 1-20",
          "link": "¿El Archivista?|Amin 1-20",
          "broken": true
        },
        {
          "name": "¿AMAS a Blaze? o_O|Amin 1-20",
          "link": "¿AMAS a Blaze? o_O|Amin 1-20",
          "broken": true
        }
      ],
      "name": "Amin 1-7",
      "pid": "10",
      "position": {
        "x": "592",
        "y": "691"
      },
      "tags": [
        "Works",
        "Español"
      ]
    },
    {
      "text": "Blaze hizo Gao el Archivista para Masako y para mí. Como regalo de bodas... Ese juego me ayudó muchísimo.\n\n¿Alguna vez te ha pasado que redescubres fotos que habías olvidado y te llenas de alegría? :)\n\n[[Nunca.|Amin 1-21]]\n[[¡Me pasa todo el tiempo!|Amin 1-22]]\n[[Sí. Aunque no mucho...|Amin 1-23]]",
      "links": [
        {
          "name": "Nunca.|Amin 1-21",
          "link": "Nunca.|Amin 1-21",
          "broken": true
        },
        {
          "name": "¡Me pasa todo el tiempo!|Amin 1-22",
          "link": "¡Me pasa todo el tiempo!|Amin 1-22",
          "broken": true
        },
        {
          "name": "Sí. Aunque no mucho...|Amin 1-23",
          "link": "Sí. Aunque no mucho...|Amin 1-23",
          "broken": true
        }
      ],
      "name": "Amin 1-20",
      "pid": "11",
      "position": {
        "x": "549",
        "y": "1096"
      },
      "tags": [
        "Works",
        "Español"
      ]
    },
    {
      "text": "Yo juraba que no me iba a pasar nunca... Y luego El Archivista me sorprendió. \n\nDe pronto es que no has tomado suficientes fotos.  ^^\n\n[[¡He tomado muchísimas!|Amin 1-24]]\n[[Debe ser eso...|Amin 1-25]]",
      "links": [
        {
          "name": "¡He tomado muchísimas!|Amin 1-24",
          "link": "¡He tomado muchísimas!|Amin 1-24",
          "broken": true
        },
        {
          "name": "Debe ser eso...|Amin 1-25",
          "link": "Debe ser eso...|Amin 1-25",
          "broken": true
        }
      ],
      "name": "Amin 1-21",
      "pid": "12",
      "position": {
        "x": "433",
        "y": "1302"
      },
      "tags": [
        "Works",
        "Español"
      ]
    },
    {
      "text": "Me pregunto qué nos lleva a olvidar tanto (y sobre todo lo bueno... *?*)\n\n... Tengo entendido que el cerebro está diseñado para recordar mejor los momentos malos o peligrosos porque lo necesita para evitar-o sobrevivir- situaciones similares más adelante.\n\nPor ejemplo yo no dejo de pensar en que mi hijita está enferma :(\n\n[[Hm. No sé qué decirte... :(|Amin 1-27]]\n",
      "links": [
        {
          "name": "Hm. No sé qué decirte... :(|Amin 1-27",
          "link": "Hm. No sé qué decirte... :(|Amin 1-27",
          "broken": true
        }
      ],
      "name": "Amin 1-22",
      "pid": "13",
      "position": {
        "x": "600",
        "y": "1300"
      },
      "tags": [
        "Works",
        "Español"
      ]
    },
    {
      "text": "Una vez es suficiente para poder afirmar que tienes buenos recuerdos—y que no tienes que dejarte asfixiar por la tristeza. \n¿Sabías que el cerebro está diseñado para recordar mejor los momentos malos o peligrosos,  porque lo necesita para evitar-o sobrevivir—situaciones similares más adelante? :(\n\nY eso quiere decir que los recuerdos malos generalmente opacan a los buenos. :/\n\nEn mi caso, por ejemplo, no puedo soltar el recuerdo de cuando hospitalizaron a mi hija por primera vez. :(\n\n[[Uff... No sé qué decirte... :(|Amin 1-27]]\n",
      "links": [
        {
          "name": "Uff... No sé qué decirte... :(|Amin 1-27",
          "link": "Uff... No sé qué decirte... :(|Amin 1-27",
          "broken": true
        }
      ],
      "name": "Amin 1-23",
      "pid": "14",
      "position": {
        "x": "775",
        "y": "1300"
      },
      "tags": [
        "Works",
        "Español"
      ]
    },
    {
      "text": "No hay mucho que decir. Igual lo peor ya pasó. Los doctores estaban equivocados y se va a recuperar. :)\n\n[[:) ... Aún no entiendo bien cómo te ayudó Gao El Archivista.|Amin 1-28]]",
      "links": [
        {
          "name": ":) ... Aún no entiendo bien cómo te ayudó Gao El Archivista.|Amin 1-28",
          "link": ":) ... Aún no entiendo bien cómo te ayudó Gao El Archivista.|Amin 1-28",
          "broken": true
        }
      ],
      "name": "Amin 1-27",
      "pid": "15",
      "position": {
        "x": "648",
        "y": "1726"
      },
      "tags": [
        "Works",
        "Español"
      ]
    },
    {
      "text": "Pues es que hubo un momento en el que lo único que había era la enfermedad de Alma. \nY lo invadía todo.\nHasta que Blaze nos regaló El Archivista. Jugándolo redescubrí mis fotos, mis viajes, mis recuerdos... Y la sonrisa de Masako.\nMe dije que si tuvimos tantas cosas buenas podíamos tener nuevas, y redescubrí mi pasión por viajar.\n:)\n\n[[¡Ya entiendo por qué Blaze es tan importante para ti! :)|Amin 1-29]]\n[[Espero que Alma se recupere del todo pronto.|Amin 1-32]]",
      "links": [
        {
          "name": "¡Ya entiendo por qué Blaze es tan importante para ti! :)|Amin 1-29",
          "link": "¡Ya entiendo por qué Blaze es tan importante para ti! :)|Amin 1-29",
          "broken": true
        },
        {
          "name": "Espero que Alma se recupere del todo pronto.|Amin 1-32",
          "link": "Espero que Alma se recupere del todo pronto.|Amin 1-32",
          "broken": true
        }
      ],
      "name": "Amin 1-28",
      "pid": "16",
      "position": {
        "x": "650",
        "y": "1875"
      },
      "tags": [
        "Works",
        "Español"
      ]
    },
    {
      "text": "Llegó el momento de cambiar eso. Uno no se acuerda lo suficiente de lo bueno... :)\n\n[[Suenas como si tu vida estuviera llena de momentos tristes. :S|Amin 1-26]]",
      "links": [
        {
          "name": "Suenas como si tu vida estuviera llena de momentos tristes. :S|Amin 1-26",
          "link": "Suenas como si tu vida estuviera llena de momentos tristes. :S|Amin 1-26",
          "broken": true
        }
      ],
      "name": "Amin 1-25",
      "pid": "17",
      "position": {
        "x": "503",
        "y": "1450"
      },
      "tags": [
        "Works",
        "Español"
      ]
    },
    {
      "text": "... Mi hija está enferma... :(\n\n[[Uff... No sé qué decir. :(|Amin 1-27]]",
      "links": [
        {
          "name": "Uff... No sé qué decir. :(|Amin 1-27",
          "link": "Uff... No sé qué decir. :(|Amin 1-27",
          "broken": true
        }
      ],
      "name": "Amin 1-26",
      "pid": "18",
      "position": {
        "x": "426",
        "y": "1601"
      },
      "tags": [
        "Works",
        "Español"
      ]
    },
    {
      "text": "Aún hoy, Gao y su comunidad son importantísimos para Masako y para mí. \n\nY Blaze también.\n\n[[¿Blaze?|Amin 1-20]]",
      "links": [
        {
          "name": "¿Blaze?|Amin 1-20",
          "link": "¿Blaze?|Amin 1-20",
          "broken": true
        }
      ],
      "name": "Amin 1-10",
      "pid": "19",
      "position": {
        "x": "798",
        "y": "951"
      },
      "tags": [
        "Works",
        "Español"
      ]
    },
    {
      "text": "¿Quiénes?\n\n[[No pues... gente por ahí...|Amin 1-14]]\n[[...Nikki.|Amin 1-12]]",
      "links": [
        {
          "name": "No pues... gente por ahí...|Amin 1-14",
          "link": "No pues... gente por ahí...|Amin 1-14",
          "broken": true
        },
        {
          "name": "...Nikki.|Amin 1-12",
          "link": "...Nikki.|Amin 1-12",
          "broken": true
        }
      ],
      "name": "Amin 1-11",
      "pid": "20",
      "position": {
        "x": "1093",
        "y": "991"
      },
      "tags": [
        "Works",
        "Español"
      ]
    },
    {
      "text": "Ok...\nYo te invito a experimentar Gao sin influencias externas. :)\nNo todo el mundo entiende la importancia y la fuerza de nuestra comunidad. :)",
      "name": "Amin 1-14",
      "pid": "21",
      "position": {
        "x": "1501",
        "y": "2175"
      },
      "tags": [
        "Works",
        "Español"
      ]
    },
    {
      "text": "Ay, Nikki... Perro que ladra no muerde. (Además tengo que entendido que es muy joven.)\n\nLa verdad es que Nikki no es la mejor persona con quien hablar acá... Siempre habrá gente mal intencionada tratando de destruir lo que otros construyen. \"-_-\n\n[[Es verdad que es innecesariamente agresiva...|Amin 1-13]]\n[[No creo que su intención sea destruir...|Amin 1-13]]",
      "links": [
        {
          "name": "Es verdad que es innecesariamente agresiva...|Amin 1-13",
          "link": "Es verdad que es innecesariamente agresiva...|Amin 1-13",
          "broken": true
        },
        {
          "name": "No creo que su intención sea destruir...|Amin 1-13",
          "link": "No creo que su intención sea destruir...|Amin 1-13",
          "broken": true
        }
      ],
      "name": "Amin 1-12",
      "pid": "22",
      "position": {
        "x": "1000",
        "y": "1168"
      },
      "tags": [
        "Works",
        "Español"
      ]
    },
    {
      "text": "La gente se juzga es por sus actos... Y la juventud no excusa todo. :)\nEspero que no sigas sus pasos y que construyas con nosotros. :)",
      "name": "Amin 1-13",
      "pid": "23",
      "position": {
        "x": "1175",
        "y": "2175"
      },
      "tags": [
        "Works",
        "Español"
      ]
    },
    {
      "text": ":) Blaze es alguien muy especial...\nPor eso intento, junto con muchos otros en la comunidad, seguir su ejemplo. \n\n[[Creo que entiendo... Pero no todos tenemos tanto tiempo para invertir en un juego...|Amin 1-30]]\n[[¡Me encantaría conocerlo!|Amin 1-31]]",
      "links": [
        {
          "name": "Creo que entiendo... Pero no todos tenemos tanto tiempo para invertir en un juego...|Amin 1-30",
          "link": "Creo que entiendo... Pero no todos tenemos tanto tiempo para invertir en un juego...|Amin 1-30",
          "broken": true
        },
        {
          "name": "¡Me encantaría conocerlo!|Amin 1-31",
          "link": "¡Me encantaría conocerlo!|Amin 1-31",
          "broken": true
        }
      ],
      "name": "Amin 1-29",
      "pid": "24",
      "position": {
        "x": "576",
        "y": "2026"
      },
      "tags": [
        "Works",
        "Español"
      ]
    },
    {
      "text": "Lo hará! Y mientras contemos con el apoyo de la comunidad Gao, estoy seguro que nos mantendremos en pie, Masako y yo. :)\n\n... Si tan solo pudiéramos viajar para completar la recuperación...",
      "name": "Amin 1-32",
      "pid": "25",
      "position": {
        "x": "898",
        "y": "2175"
      },
      "tags": [
        "Works",
        "Español"
      ]
    },
    {
      "text": "Yo empecé a hacerlo. Porque uno no se acuerda lo suficiente de los momentos buenos... :/\n\n[[Suenas como si tu vida estuviera llena de momentos tristes. :S|Amin 1-26]]",
      "links": [
        {
          "name": "Suenas como si tu vida estuviera llena de momentos tristes. :S|Amin 1-26",
          "link": "Suenas como si tu vida estuviera llena de momentos tristes. :S|Amin 1-26",
          "broken": true
        }
      ],
      "name": "Amin 1-24",
      "pid": "26",
      "position": {
        "x": "325",
        "y": "1450"
      },
      "tags": [
        "Works",
        "Español"
      ]
    },
    {
      "text": "Lo sé. Igual lo importante es que, hagas lo que hagas, contribuyas a la comunidad. :)",
      "name": "Amin 1-30",
      "pid": "27",
      "position": {
        "x": "500",
        "y": "2175"
      },
      "tags": [
        "Works",
        "Español"
      ]
    },
    {
      "text": "¡Seguro lo harás muy pronto! ¡Y bienvenida! :) :) :)",
      "name": "Amin 1-31",
      "pid": "28",
      "position": {
        "x": "650",
        "y": "2175"
      },
      "tags": [
        "Works",
        "Español"
      ]
    }
  ],
  "name": "Amin",
  "startnode": "1",
  "creator": "Twine",
  "creator-version": "2.3.15",
  "ifid": "1ED8740F-EAC1-4E3E-9209-D9DB5D30EBA5"
}