{
  "namespace": "kmjava:redstone",

  "dispenser_container_bg": {
    "type": "image",
    "texture": "assets/minecraft/textures/gui/container/dispenser",
    "size": [176, 166],
    "uv": [0, 0],
    "uv_size": [176, 166]
  },

  "hopper_container_bg@kmjava:redstone.dispenser_container_bg": {
    "texture": "assets/minecraft/textures/gui/container/hopper",
    "size": [176, 133],
    "uv_size": [176, 133]
  },

  "dispenser_grid": {
    "type": "grid",
    "anchor_from": "top_left",
    "anchor_to": "top_left",
    "offset": ["50% - 50%x", 16],
    "grid_dimensions": [3, 3],
    "collection_name": "container_items",
    "grid_item_template": "kmjava:common.container_slot",
    "$item_collection_name": "container_items"
  },

  "hopper_grid@kmjava:redstone.dispenser_grid": {
    "offset": [43, 19],
    "grid_dimensions": [5, 1]
  },

  "dispenser_screen@kmjava:config.config": {
    "type": "panel",
    "$container_title_offset|default": ["50% - 50%x", 5],
    "$container_size|default": [176, 166],
    "$container_title|default": "container.dispenser",
    "$container_bg|default": "kmjava:redstone.dispenser_container_bg",
    "$container_inventory|default": "kmjava:redstone.dispenser_grid",
    "controls": [
      { "bg@kmjava:common.screen_background": { "layer": -1 } },
      { "gamepad_helpers@kmjava:gamepad_helper.container_gamepad_helpers": {} },
      {
        "content@common.root_panel": {
          "size": "$container_size",
          "controls": [
            {
              "title@kmjava:common.base_title": {
                "color": [0.2509, 0.2509, 0.2509],
                "shadow": false,
                "text": "$container_title",
                "offset": "$container_title_offset"
              }
            },
            { "container_bg@$container_bg": {} },
            { "container_inventory@$container_inventory": {} },
            { "player_inventory@kmjava:common.player_inventory_and_hotbar": {} },
            { "take_progress_icon@common.inventory_take_progress_icon_button": {} },
            { "selected_icon@kmjava:common.inventory_selected_icon_button": {} }
          ]
        }
      }
    ]
  },

  "dropper_screen@kmjava:redstone.dispenser_screen": {
    "$container_title": "container.dropper"
  },

  "hopper_screen@kmjava:redstone.dispenser_screen": {
    "$container_title_offset": [8, 5],
    "$container_title": "container.hopper",
    "$container_bg": "kmjava:redstone.hopper_container_bg",
    "$container_inventory": "kmjava:redstone.hopper_grid",
    "$container_size": [176, 133]
  }
}