{
  "namespace": "kmjava:sleeping",

  "sleeping_screen@kmjava:config.config": {
    "type": "panel",
    "controls": [
      { "bg@kmjava:common.screen_background": {} },
      {
        "wake_up@kmjava:button.button": {
          "offset": ["50% - 100px", "100% - 40px"],
          "$button_text": "multiplayer.stopSleeping",
          "$button_action_name": "button.wake_up_button"
        }
      },
      {
        "gamepad_helpers": {
          "type": "panel",
          "controls": [
            {
              "a@kmjava:gamepad_helper.gamepad_helper_a": {
                "anchor_from": "bottom_middle",
                "anchor_to": "bottom_middle",
                "offset": [0, -3],
                "$icon_description_bind": "controller.buttonTip.select"
              }
            }
          ]
        }
      }
    ]
  }
}