<?xml version="1.0" encoding="UTF-8" standalone="no"?><svg xmlns="http://www.w3.org/2000/svg" xmlns:xlink="http://www.w3.org/1999/xlink" contentScriptType="application/ecmascript" contentStyleType="text/css" height="547px" preserveAspectRatio="none" style="width:1389px;height:547px;background:#FFFFFF;" version="1.1" viewBox="0 0 1389 547" width="1389px" zoomAndPan="magnify"><defs><filter height="300%" id="f4y0yf1pu444i" width="300%" x="-1" y="-1"><feGaussianBlur result="blurOut" stdDeviation="2.0"/><feColorMatrix in="blurOut" result="blurOut2" type="matrix" values="0 0 0 0 0 0 0 0 0 0 0 0 0 0 0 0 0 0 .4 0"/><feOffset dx="4.0" dy="4.0" in="blurOut2" result="blurOut3"/><feBlend in="SourceGraphic" in2="blurOut3" mode="normal"/></filter></defs><g><rect fill="#FFFFFF" filter="url(#f4y0yf1pu444i)" height="87.9316" style="stroke:#A80036;stroke-width:1.0;" width="10" x="39.5" y="146.9082"/><rect fill="#FFFFFF" filter="url(#f4y0yf1pu444i)" height="87.9316" style="stroke:#A80036;stroke-width:1.0;" width="10" x="39.5" y="322.7715"/><rect fill="#FFFFFF" filter="url(#f4y0yf1pu444i)" height="402.3477" style="stroke:#A80036;stroke-width:1.0;" width="10" x="269.5" y="66.9766"/><rect fill="#FFFFFF" filter="url(#f4y0yf1pu444i)" height="29.3105" style="stroke:#A80036;stroke-width:1.0;" width="10" x="400.5" y="176.2188"/><rect fill="#FFFFFF" filter="url(#f4y0yf1pu444i)" height="29.3105" style="stroke:#A80036;stroke-width:1.0;" width="10" x="562" y="352.082"/><rect fill="#FFFFFF" filter="url(#f4y0yf1pu444i)" height="29.3105" style="stroke:#A80036;stroke-width:1.0;" width="10" x="707" y="88.2871"/><rect fill="#FFFFFF" filter="url(#f4y0yf1pu444i)" height="29.3105" style="stroke:#A80036;stroke-width:1.0;" width="10" x="1128.5" y="264.1504"/><rect fill="#FFFFFF" filter="url(#f4y0yf1pu444i)" height="29.3105" style="stroke:#A80036;stroke-width:1.0;" width="10" x="1290" y="440.0137"/><line style="stroke:#A80036;stroke-width:1.0;stroke-dasharray:5.0,5.0;" x1="44" x2="44" y1="56.9766" y2="487.3242"/><line style="stroke:#A80036;stroke-width:1.0;stroke-dasharray:5.0,5.0;" x1="274" x2="274" y1="56.9766" y2="487.3242"/><line style="stroke:#A80036;stroke-width:1.0;stroke-dasharray:5.0,5.0;" x1="405" x2="405" y1="56.9766" y2="487.3242"/><line style="stroke:#A80036;stroke-width:1.0;stroke-dasharray:5.0,5.0;" x1="567" x2="567" y1="56.9766" y2="487.3242"/><line style="stroke:#A80036;stroke-width:1.0;stroke-dasharray:5.0,5.0;" x1="712" x2="712" y1="56.9766" y2="487.3242"/><line style="stroke:#A80036;stroke-width:1.0;stroke-dasharray:5.0,5.0;" x1="1133" x2="1133" y1="56.9766" y2="487.3242"/><line style="stroke:#A80036;stroke-width:1.0;stroke-dasharray:5.0,5.0;" x1="1295" x2="1295" y1="56.9766" y2="487.3242"/><rect fill="#FEFECE" filter="url(#f4y0yf1pu444i)" height="30.4883" style="stroke:#A80036;stroke-width:1.5;" width="75" x="5" y="21.4883"/><text fill="#000000" font-family="sans-serif" font-size="14" lengthAdjust="spacing" textLength="61" x="12" y="42.0234">End User</text><rect fill="#FEFECE" filter="url(#f4y0yf1pu444i)" height="30.4883" style="stroke:#A80036;stroke-width:1.5;" width="75" x="5" y="486.3242"/><text fill="#000000" font-family="sans-serif" font-size="14" lengthAdjust="spacing" textLength="61" x="12" y="506.8594">End User</text><rect fill="#FEFECE" filter="url(#f4y0yf1pu444i)" height="46.9766" style="stroke:#A80036;stroke-width:1.5;" width="65" x="240" y="5"/><text fill="#000000" font-family="sans-serif" font-size="14" lengthAdjust="spacing" textLength="51" x="247" y="25.5352">K8s API</text><text fill="#000000" font-family="sans-serif" font-size="14" lengthAdjust="spacing" textLength="43" x="253" y="42.0234">Server</text><rect fill="#FEFECE" filter="url(#f4y0yf1pu444i)" height="46.9766" style="stroke:#A80036;stroke-width:1.5;" width="65" x="240" y="486.3242"/><text fill="#000000" font-family="sans-serif" font-size="14" lengthAdjust="spacing" textLength="51" x="247" y="506.8594">K8s API</text><text fill="#000000" font-family="sans-serif" font-size="14" lengthAdjust="spacing" textLength="43" x="253" y="523.3477">Server</text><rect fill="#FEFECE" filter="url(#f4y0yf1pu444i)" height="46.9766" style="stroke:#A80036;stroke-width:1.5;" width="131" x="338" y="5"/><text fill="#000000" font-family="sans-serif" font-size="14" lengthAdjust="spacing" textLength="117" x="345" y="25.5352">MachineLearning</text><text fill="#000000" font-family="sans-serif" font-size="14" lengthAdjust="spacing" textLength="63" x="374" y="42.0234">webhook</text><rect fill="#FEFECE" filter="url(#f4y0yf1pu444i)" height="46.9766" style="stroke:#A80036;stroke-width:1.5;" width="131" x="338" y="486.3242"/><text fill="#000000" font-family="sans-serif" font-size="14" lengthAdjust="spacing" textLength="117" x="345" y="506.8594">MachineLearning</text><text fill="#000000" font-family="sans-serif" font-size="14" lengthAdjust="spacing" textLength="63" x="374" y="523.3477">webhook</text><rect fill="#FEFECE" filter="url(#f4y0yf1pu444i)" height="46.9766" style="stroke:#A80036;stroke-width:1.5;" width="164" x="483" y="5"/><text fill="#000000" font-family="sans-serif" font-size="14" lengthAdjust="spacing" textLength="150" x="490" y="25.5352">AutoMachineLearning</text><text fill="#000000" font-family="sans-serif" font-size="14" lengthAdjust="spacing" textLength="63" x="535.5" y="42.0234">webhook</text><rect fill="#FEFECE" filter="url(#f4y0yf1pu444i)" height="46.9766" style="stroke:#A80036;stroke-width:1.5;" width="164" x="483" y="486.3242"/><text fill="#000000" font-family="sans-serif" font-size="14" lengthAdjust="spacing" textLength="150" x="490" y="506.8594">AutoMachineLearning</text><text fill="#000000" font-family="sans-serif" font-size="14" lengthAdjust="spacing" textLength="63" x="535.5" y="523.3477">webhook</text><rect fill="#FEFECE" filter="url(#f4y0yf1pu444i)" height="46.9766" style="stroke:#A80036;stroke-width:1.5;" width="98" x="661" y="5"/><text fill="#000000" font-family="sans-serif" font-size="14" lengthAdjust="spacing" textLength="84" x="668" y="25.5352">ImageCache</text><text fill="#000000" font-family="sans-serif" font-size="14" lengthAdjust="spacing" textLength="67" x="678.5" y="42.0234">controller</text><rect fill="#FEFECE" filter="url(#f4y0yf1pu444i)" height="46.9766" style="stroke:#A80036;stroke-width:1.5;" width="98" x="661" y="486.3242"/><text fill="#000000" font-family="sans-serif" font-size="14" lengthAdjust="spacing" textLength="84" x="668" y="506.8594">ImageCache</text><text fill="#000000" font-family="sans-serif" font-size="14" lengthAdjust="spacing" textLength="67" x="678.5" y="523.3477">controller</text><rect fill="#FEFECE" filter="url(#f4y0yf1pu444i)" height="46.9766" style="stroke:#A80036;stroke-width:1.5;" width="131" x="1066" y="5"/><text fill="#000000" font-family="sans-serif" font-size="14" lengthAdjust="spacing" textLength="117" x="1073" y="25.5352">MachineLearning</text><text fill="#000000" font-family="sans-serif" font-size="14" lengthAdjust="spacing" textLength="67" x="1100" y="42.0234">controller</text><rect fill="#FEFECE" filter="url(#f4y0yf1pu444i)" height="46.9766" style="stroke:#A80036;stroke-width:1.5;" width="131" x="1066" y="486.3242"/><text fill="#000000" font-family="sans-serif" font-size="14" lengthAdjust="spacing" textLength="117" x="1073" y="506.8594">MachineLearning</text><text fill="#000000" font-family="sans-serif" font-size="14" lengthAdjust="spacing" textLength="67" x="1100" y="523.3477">controller</text><rect fill="#FEFECE" filter="url(#f4y0yf1pu444i)" height="46.9766" style="stroke:#A80036;stroke-width:1.5;" width="164" x="1211" y="5"/><text fill="#000000" font-family="sans-serif" font-size="14" lengthAdjust="spacing" textLength="150" x="1218" y="25.5352">AutoMachineLearning</text><text fill="#000000" font-family="sans-serif" font-size="14" lengthAdjust="spacing" textLength="67" x="1261.5" y="42.0234">controller</text><rect fill="#FEFECE" filter="url(#f4y0yf1pu444i)" height="46.9766" style="stroke:#A80036;stroke-width:1.5;" width="164" x="1211" y="486.3242"/><text fill="#000000" font-family="sans-serif" font-size="14" lengthAdjust="spacing" textLength="150" x="1218" y="506.8594">AutoMachineLearning</text><text fill="#000000" font-family="sans-serif" font-size="14" lengthAdjust="spacing" textLength="67" x="1261.5" y="523.3477">controller</text><rect fill="#FFFFFF" filter="url(#f4y0yf1pu444i)" height="87.9316" style="stroke:#A80036;stroke-width:1.0;" width="10" x="39.5" y="146.9082"/><rect fill="#FFFFFF" filter="url(#f4y0yf1pu444i)" height="87.9316" style="stroke:#A80036;stroke-width:1.0;" width="10" x="39.5" y="322.7715"/><rect fill="#FFFFFF" filter="url(#f4y0yf1pu444i)" height="402.3477" style="stroke:#A80036;stroke-width:1.0;" width="10" x="269.5" y="66.9766"/><rect fill="#FFFFFF" filter="url(#f4y0yf1pu444i)" height="29.3105" style="stroke:#A80036;stroke-width:1.0;" width="10" x="400.5" y="176.2188"/><rect fill="#FFFFFF" filter="url(#f4y0yf1pu444i)" height="29.3105" style="stroke:#A80036;stroke-width:1.0;" width="10" x="562" y="352.082"/><rect fill="#FFFFFF" filter="url(#f4y0yf1pu444i)" height="29.3105" style="stroke:#A80036;stroke-width:1.0;" width="10" x="707" y="88.2871"/><rect fill="#FFFFFF" filter="url(#f4y0yf1pu444i)" height="29.3105" style="stroke:#A80036;stroke-width:1.0;" width="10" x="1128.5" y="264.1504"/><rect fill="#FFFFFF" filter="url(#f4y0yf1pu444i)" height="29.3105" style="stroke:#A80036;stroke-width:1.0;" width="10" x="1290" y="440.0137"/><polygon fill="#A80036" points="695,84.2871,705,88.2871,695,92.2871,699,88.2871" style="stroke:#A80036;stroke-width:1.0;"/><line style="stroke:#A80036;stroke-width:1.0;stroke-dasharray:2.0,2.0;" x1="279.5" x2="701" y1="88.2871" y2="88.2871"/><text fill="#000000" font-family="sans-serif" font-size="13" lengthAdjust="spacing" textLength="128" x="286.5" y="83.5449">New ImageCache CR</text><polygon fill="#A80036" points="290.5,113.5977,280.5,117.5977,290.5,121.5977,286.5,117.5977" style="stroke:#A80036;stroke-width:1.0;"/><line style="stroke:#A80036;stroke-width:1.0;stroke-dasharray:2.0,2.0;" x1="284.5" x2="711" y1="117.5977" y2="117.5977"/><text fill="#000000" font-family="sans-serif" font-size="13" lengthAdjust="spacing" textLength="281" x="296.5" y="112.8555">Create CronJob to download container image</text><polygon fill="#A80036" points="257.5,142.9082,267.5,146.9082,257.5,150.9082,261.5,146.9082" style="stroke:#A80036;stroke-width:1.0;"/><line style="stroke:#A80036;stroke-width:1.0;" x1="49.5" x2="263.5" y1="146.9082" y2="146.9082"/><text fill="#000000" font-family="sans-serif" font-size="13" lengthAdjust="spacing" textLength="171" x="56.5" y="142.166">Create MachineLearning CR</text><polygon fill="#A80036" points="388.5,172.2188,398.5,176.2188,388.5,180.2188,392.5,176.2188" style="stroke:#A80036;stroke-width:1.0;"/><line style="stroke:#A80036;stroke-width:1.0;stroke-dasharray:2.0,2.0;" x1="279.5" x2="394.5" y1="176.2188" y2="176.2188"/><text fill="#000000" font-family="sans-serif" font-size="13" lengthAdjust="spacing" textLength="48" x="286.5" y="171.4766">New CR</text><polygon fill="#A80036" points="290.5,201.5293,280.5,205.5293,290.5,209.5293,286.5,205.5293" style="stroke:#A80036;stroke-width:1.0;"/><line style="stroke:#A80036;stroke-width:1.0;stroke-dasharray:2.0,2.0;" x1="284.5" x2="404.5" y1="205.5293" y2="205.5293"/><text fill="#000000" font-family="sans-serif" font-size="13" lengthAdjust="spacing" textLength="97" x="296.5" y="200.7871">webhook result</text><polygon fill="#A80036" points="55.5,230.8398,45.5,234.8398,55.5,238.8398,51.5,234.8398" style="stroke:#A80036;stroke-width:1.0;"/><line style="stroke:#A80036;stroke-width:1.0;" x1="49.5" x2="268.5" y1="234.8398" y2="234.8398"/><text fill="#000000" font-family="sans-serif" font-size="13" lengthAdjust="spacing" textLength="36" x="61.5" y="230.0977">result</text><polygon fill="#A80036" points="1116.5,260.1504,1126.5,264.1504,1116.5,268.1504,1120.5,264.1504" style="stroke:#A80036;stroke-width:1.0;"/><line style="stroke:#A80036;stroke-width:1.0;stroke-dasharray:2.0,2.0;" x1="279.5" x2="1122.5" y1="264.1504" y2="264.1504"/><text fill="#000000" font-family="sans-serif" font-size="13" lengthAdjust="spacing" textLength="158" x="286.5" y="259.4082">New MachineLearning CR</text><polygon fill="#A80036" points="290.5,289.4609,280.5,293.4609,290.5,297.4609,286.5,293.4609" style="stroke:#A80036;stroke-width:1.0;"/><line style="stroke:#A80036;stroke-width:1.0;stroke-dasharray:2.0,2.0;" x1="284.5" x2="1132.5" y1="293.4609" y2="293.4609"/><text fill="#000000" font-family="sans-serif" font-size="13" lengthAdjust="spacing" textLength="825" x="296.5" y="288.7188">Create IDE(Deployment &amp; Service &amp; Secret &amp; ConfigMap &amp; Ingress &amp; CronJob) or Job(Job &amp; Service &amp; ConfigMap) or Job(Job &amp; Service)</text><polygon fill="#A80036" points="257.5,318.7715,267.5,322.7715,257.5,326.7715,261.5,322.7715" style="stroke:#A80036;stroke-width:1.0;"/><line style="stroke:#A80036;stroke-width:1.0;" x1="49.5" x2="263.5" y1="322.7715" y2="322.7715"/><text fill="#000000" font-family="sans-serif" font-size="13" lengthAdjust="spacing" textLength="201" x="56.5" y="318.0293">Create AutoMachineLearning CR</text><polygon fill="#A80036" points="550,348.082,560,352.082,550,356.082,554,352.082" style="stroke:#A80036;stroke-width:1.0;"/><line style="stroke:#A80036;stroke-width:1.0;stroke-dasharray:2.0,2.0;" x1="279.5" x2="556" y1="352.082" y2="352.082"/><text fill="#000000" font-family="sans-serif" font-size="13" lengthAdjust="spacing" textLength="48" x="286.5" y="347.3398">New CR</text><polygon fill="#A80036" points="290.5,377.3926,280.5,381.3926,290.5,385.3926,286.5,381.3926" style="stroke:#A80036;stroke-width:1.0;"/><line style="stroke:#A80036;stroke-width:1.0;stroke-dasharray:2.0,2.0;" x1="284.5" x2="566" y1="381.3926" y2="381.3926"/><text fill="#000000" font-family="sans-serif" font-size="13" lengthAdjust="spacing" textLength="253" x="296.5" y="376.6504">webhook result &amp; mutate machine name</text><polygon fill="#A80036" points="55.5,406.7031,45.5,410.7031,55.5,414.7031,51.5,410.7031" style="stroke:#A80036;stroke-width:1.0;"/><line style="stroke:#A80036;stroke-width:1.0;stroke-dasharray:2.0,2.0;" x1="49.5" x2="268.5" y1="410.7031" y2="410.7031"/><text fill="#000000" font-family="sans-serif" font-size="13" lengthAdjust="spacing" textLength="36" x="61.5" y="405.9609">result</text><polygon fill="#A80036" points="1278,436.0137,1288,440.0137,1278,444.0137,1282,440.0137" style="stroke:#A80036;stroke-width:1.0;"/><line style="stroke:#A80036;stroke-width:1.0;stroke-dasharray:2.0,2.0;" x1="279.5" x2="1284" y1="440.0137" y2="440.0137"/><text fill="#000000" font-family="sans-serif" font-size="13" lengthAdjust="spacing" textLength="188" x="286.5" y="435.2715">New AutoMachineLearning CR</text><polygon fill="#A80036" points="285.5,465.3242,275.5,469.3242,285.5,473.3242,281.5,469.3242" style="stroke:#A80036;stroke-width:1.0;"/><line style="stroke:#A80036;stroke-width:1.0;stroke-dasharray:2.0,2.0;" x1="279.5" x2="1294" y1="469.3242" y2="469.3242"/><text fill="#000000" font-family="sans-serif" font-size="13" lengthAdjust="spacing" textLength="149" x="291.5" y="464.582">create Katib experiment</text><!--MD5=[cca810850409a6eb325ad09ca0d882d4]
@startuml
'https://plantuml.com/sequence-diagram

participant "End User" as User order 1
participant "K8s API\n Server" as APIServer order 2
participant "MachineLearning\n webhook" as MachineLearningWebhook order 4
participant "AutoMachineLearning\n webhook" as AutoMachineLearningWebhook order 5
participant "ImageCache\n controller" as ImageCacheController order 7
participant "MachineLearning\n controller" as MachineLearningController order 9
participant "AutoMachineLearning\n controller" as AutoMachineLearningController order 10

activate APIServer

APIServer - -> ImageCacheController: New ImageCache CR
activate ImageCacheController

ImageCacheController - -> APIServer: Create CronJob to download container image
deactivate ImageCacheController

User -> APIServer: Create MachineLearning CR
activate User

APIServer - -> MachineLearningWebhook: New CR
activate MachineLearningWebhook

MachineLearningWebhook - -> APIServer: webhook result
deactivate MachineLearningWebhook

APIServer -> User: result
deactivate User

APIServer - -> MachineLearningController: New MachineLearning CR
activate MachineLearningController

MachineLearningController - -> APIServer: Create IDE(Deployment & Service & Secret & ConfigMap & Ingress & CronJob) or Job(Job & Service & ConfigMap) or Job(Job & Service)
deactivate MachineLearningController

User -> APIServer: Create AutoMachineLearning CR
activate User

APIServer - -> AutoMachineLearningWebhook: New CR
activate AutoMachineLearningWebhook

AutoMachineLearningWebhook - -> APIServer: webhook result & mutate machine name
deactivate AutoMachineLearningWebhook

APIServer - -> User: result
deactivate User

APIServer - -> AutoMachineLearningController: New AutoMachineLearning CR
activate AutoMachineLearningController

AutoMachineLearningController - -> APIServer: create Katib experiment
deactivate AutoMachineLearningController

deactivate APIServer

@enduml

@startuml

participant "End User" as User order 1
participant "K8s API\n Server" as APIServer order 2
participant "MachineLearning\n webhook" as MachineLearningWebhook order 4
participant "AutoMachineLearning\n webhook" as AutoMachineLearningWebhook order 5
participant "ImageCache\n controller" as ImageCacheController order 7
participant "MachineLearning\n controller" as MachineLearningController order 9
participant "AutoMachineLearning\n controller" as AutoMachineLearningController order 10

activate APIServer

APIServer - -> ImageCacheController: New ImageCache CR
activate ImageCacheController

ImageCacheController - -> APIServer: Create CronJob to download container image
deactivate ImageCacheController

User -> APIServer: Create MachineLearning CR
activate User

APIServer - -> MachineLearningWebhook: New CR
activate MachineLearningWebhook

MachineLearningWebhook - -> APIServer: webhook result
deactivate MachineLearningWebhook

APIServer -> User: result
deactivate User

APIServer - -> MachineLearningController: New MachineLearning CR
activate MachineLearningController

MachineLearningController - -> APIServer: Create IDE(Deployment & Service & Secret & ConfigMap & Ingress & CronJob) or Job(Job & Service & ConfigMap) or Job(Job & Service)
deactivate MachineLearningController

User -> APIServer: Create AutoMachineLearning CR
activate User

APIServer - -> AutoMachineLearningWebhook: New CR
activate AutoMachineLearningWebhook

AutoMachineLearningWebhook - -> APIServer: webhook result & mutate machine name
deactivate AutoMachineLearningWebhook

APIServer - -> User: result
deactivate User

APIServer - -> AutoMachineLearningController: New AutoMachineLearning CR
activate AutoMachineLearningController

AutoMachineLearningController - -> APIServer: create Katib experiment
deactivate AutoMachineLearningController

deactivate APIServer

@enduml

PlantUML version 1.2021.15(Wed Dec 01 01:45:34 JST 2021)
(GPL source distribution)
Java Runtime: OpenJDK Runtime Environment
JVM: OpenJDK 64-Bit Server VM
Default Encoding: UTF-8
Language: ja
Country: JP
--></g></svg>