<?xml version="1.0" encoding="utf-8"?>
<!-- Generator: Adobe Illustrator 24.2.0, SVG Export Plug-In . SVG Version: 6.00 Build 0)  -->
<svg version="1.1" id="Layer_1" xmlns="http://www.w3.org/2000/svg" xmlns:xlink="http://www.w3.org/1999/xlink" x="0px" y="0px"
	 viewBox="0 0 379.4 96" enable-background="new 0 0 379.4 96" xml:space="preserve">
<g id="runaround">
	<rect fill="none" width="379.4" height="96"/>
</g>
<g id="logo">
	<g>
		<g>
			<path fill="currentColor" d="M108.2,32.6c3.8,0,7,1.2,9.5,3.7c2.5,2.4,3.7,5.6,3.7,9.4v5.2c0,3.8-1.2,7-3.7,9.4s-5.6,3.6-9.5,3.6H94.1
				v-3.8l3.3-0.6V37l-3.3-0.6v-3.8h3.3L108.2,32.6L108.2,32.6z M103.8,37.5v21.6h4.1c2.2,0,4-0.8,5.3-2.3s1.9-3.5,1.9-6v-5.2
				c0-2.4-0.6-4.4-1.9-5.9s-3-2.3-5.3-2.3L103.8,37.5L103.8,37.5z"/>
			<path fill="currentColor" d="M135.7,64.4c-3.4,0-6-1.1-8-3.2s-3-4.9-3-8.2v-0.9c0-3.5,0.9-6.3,2.8-8.5s4.4-3.3,7.6-3.3
				c3.1,0,5.6,0.9,7.3,2.8c1.7,1.9,2.6,4.4,2.6,7.7v3.4h-13.9v0.1c0.1,1.5,0.6,2.8,1.5,3.8s2.1,1.5,3.7,1.5c1.4,0,2.5-0.1,3.5-0.4
				c0.9-0.3,1.9-0.7,3-1.3l1.7,3.9c-1,0.8-2.2,1.4-3.7,1.9S137.6,64.4,135.7,64.4z M135.2,45.1c-1.2,0-2.1,0.4-2.8,1.3
				c-0.7,0.9-1.1,2.1-1.2,3.5l0.1,0.1h7.7v-0.6c0-1.3-0.3-2.4-0.9-3.2S136.4,45.1,135.2,45.1z"/>
			<path fill="currentColor" d="M157.6,44.4l-2.2,0.4l3.1,10.4l0.4,2.2h0.1l0.5-2.2l3-10.4l-2.2-0.4v-3.8h10.5v3.8l-2,0.3l-6.9,19.1h-6
				L149,44.7l-2-0.3v-3.8h10.5L157.6,44.4L157.6,44.4z"/>
			<path fill="currentColor" d="M201.3,48.5c0,4.6-1.3,8.4-3.9,11.4s-6.1,4.5-10.3,4.5c-4.2,0-7.6-1.5-10.2-4.5s-3.9-6.8-3.9-11.4V48
				c0-4.6,1.3-8.3,3.9-11.3s6-4.5,10.2-4.5s7.7,1.5,10.3,4.5s3.9,6.8,3.9,11.3V48.5z M195,48c0-3.2-0.7-5.9-2-7.9s-3.3-3-6-3
				c-2.6,0-4.6,1-5.9,3s-1.9,4.6-1.9,7.9v0.5c0,3.3,0.7,5.9,2,8c1.3,2,3.3,3,5.9,3s4.6-1,6-3c1.3-2,2-4.7,2-8V48H195z"/>
			<path fill="currentColor" d="M203.5,44.4v-3.8h9.1l0.3,2.7c0.7-1,1.5-1.8,2.5-2.3s2.1-0.8,3.4-0.8c2.9,0,5.1,1.1,6.7,3.4
				c1.6,2.2,2.4,5.2,2.4,8.9V53c0,3.4-0.8,6.2-2.4,8.3c-1.6,2.1-3.8,3.1-6.7,3.1c-1.2,0-2.3-0.2-3.2-0.7s-1.8-1.1-2.4-2v6.7l3,0.6
				v3.8h-12.4V69l3-0.6V45.1L203.5,44.4z M221.5,52.5c0-2.2-0.4-4-1.1-5.3c-0.7-1.4-1.8-2-3.4-2c-0.9,0-1.8,0.2-2.4,0.6
				s-1.2,0.9-1.6,1.7v10.2c0.4,0.7,0.9,1.2,1.6,1.5s1.5,0.5,2.5,0.5c1.5,0,2.6-0.6,3.3-1.8c0.7-1.2,1.1-2.8,1.1-4.8V52.5z"/>
			<path fill="currentColor" d="M249.6,48.6h-4.2l-0.7-2.9c-0.4-0.3-1-0.6-1.6-0.9c-0.7-0.2-1.4-0.3-2.2-0.3c-1.1,0-2,0.2-2.6,0.7
				s-1,1.1-1,1.9c0,0.7,0.3,1.3,0.9,1.8s1.8,0.9,3.7,1.2c2.9,0.6,5,1.4,6.4,2.5s2.1,2.6,2.1,4.6c0,2.1-0.9,3.8-2.7,5.1
				c-1.8,1.3-4.2,2-7.1,2c-1.8,0-3.4-0.3-4.9-0.8s-2.8-1.3-4-2.2l-0.1-5.2h4.4l0.9,3c0.4,0.3,0.9,0.5,1.5,0.7s1.3,0.2,2,0.2
				c1.3,0,2.2-0.2,2.9-0.7c0.7-0.5,1-1.1,1-1.9c0-0.7-0.3-1.3-1-1.8s-1.9-0.9-3.7-1.3c-2.7-0.6-4.8-1.4-6.2-2.5s-2.1-2.6-2.1-4.5
				s0.8-3.6,2.4-5s3.9-2.1,6.9-2.1c1.8,0,3.5,0.2,5.1,0.7s2.9,1.1,3.8,1.9L249.6,48.6z"/>
			<path fill="currentColor" d="M256.8,63.9H255v-2.8h1.8V63.9z"/>
			<path fill="currentColor" d="M273.2,63.2c2,0,3.7-0.5,5.2-1.6s2.3-2.7,2.3-4.8h1v0.1c0.1,2.3-0.8,4.1-2.5,5.4s-3.7,2-6,2
				c-3,0-5.3-1.1-7-3.2s-2.5-4.9-2.5-8.4v-0.9c0-3.5,0.8-6.3,2.5-8.4s4-3.2,6.9-3.2c1.7,0,3.4,0.4,4.9,1.1s2.7,1.7,3.6,2.9v5h-1.2
				v-4.6c-0.8-1-1.8-1.8-3.1-2.4c-1.2-0.6-2.6-0.9-4.2-0.9c-2.7,0-4.8,1-6.2,2.9s-2.1,4.5-2.1,7.5v0.9c0,3.1,0.7,5.6,2.1,7.6
				S270.4,63.2,273.2,63.2z"/>
			<path fill="currentColor" d="M287,51.8c0-3.4,0.9-6.2,2.8-8.4c1.9-2.2,4.3-3.2,7.3-3.2s5.5,1.1,7.4,3.2c1.9,2.2,2.8,4.9,2.8,8.4v0.9
				c0,3.4-0.9,6.2-2.8,8.4c-1.9,2.2-4.3,3.2-7.3,3.2s-5.5-1.1-7.4-3.2c-1.9-2.2-2.8-5-2.8-8.4L287,51.8L287,51.8z M288.2,52.7
				c0,2.9,0.8,5.4,2.4,7.4c1.6,2,3.8,3,6.6,3c2.7,0,4.9-1,6.5-3.1c1.6-2,2.4-4.5,2.4-7.4v-0.9c0-2.9-0.8-5.3-2.5-7.4
				c-1.6-2.1-3.8-3.1-6.6-3.1c-2.7,0-4.9,1-6.6,3.1c-1.6,2.1-2.4,4.5-2.4,7.4v1H288.2z"/>
			<path fill="currentColor" d="M311.5,62.7h3.5V41.8h-3.5v-1.2h4.5l0.2,4.8c0.7-1.6,1.7-2.9,3-3.8s2.9-1.4,4.8-1.4c2,0,3.6,0.5,4.9,1.5
				c1.3,1,2.1,2.6,2.6,4.7c0.6-2,1.6-3.5,3-4.6s3.1-1.7,5.2-1.7c2.6,0,4.5,0.8,5.8,2.5s2,4.3,2,7.9v12.1h3.5v1.2h-8.2v-1.2h3.5V50.5
				c0-3.4-0.6-5.7-1.8-7.1s-2.8-2.1-4.8-2.1c-2.5,0-4.3,0.7-5.6,2.2s-2,3.4-2.4,5.7c0,0.3,0,0.5,0,0.7s0,0.4,0,0.6v12.1h3.5v1.2H327
				v-1.2h3.5V50.5c0-3.4-0.6-5.8-1.8-7.1c-1.2-1.4-2.8-2.1-4.8-2.1c-2.4,0-4.2,0.7-5.5,2.1c-1.2,1.4-2,3.2-2.4,5.5v13.8h3.5v1.2
				h-8.2v-1.2H311.5z"/>
		</g>
		<g>
			<g>
				<path fill="currentColor" d="M58.4,17.8c-10.6,0-20,5.6-25.3,13.9h9.4c3.1,0,5.7,0.8,7.9,2.4c0.4,0.3,0.8,0.6,1.2,1l0,0
					c0.4,0.4,0.8,0.7,1.1,1.1l0,0c0.3,0.3,0.5,0.6,0.7,0.9s0.4,0.5,0.5,0.8c1.8,2.7,2.7,5.9,2.7,9.7v0.5c0,3.8-0.4,6.2-2.2,8.8
					c-0.6-0.5-1.5-1.4-2.1-2.1c-0.6-0.8-1.4-2.3-1.8-4.3c0,0.1,0,0.2,0,0.2c-0.2-0.8-0.3-1.6-0.3-2.7v-0.5c0-3.2-0.7-5.9-2-7.9l0,0
					c-0.2-0.3-0.5-0.6-0.7-0.9l-0.1-0.1c-0.2-0.3-0.5-0.5-0.8-0.7l0,0l0,0c-1.2-0.9-2.6-1.3-4.3-1.3H30.4c-1.4,3.5-2.2,7.2-2.2,11.2
					s0.8,7.8,2.2,11.3L42.3,59l0,0c1.3,0,2.5-0.3,3.5-0.8l0.5,0.9c0.2,0.3,0.5,0.7,0.8,1c0.4,0.5,0.9,0.9,1.4,1.4l0.9,0.7
					c-2,1.2-4.4,1.8-7.1,1.8l0,0h-9.4l0,0l0,0c5.3,8.4,14.7,13.9,25.3,13.9c16.6,0,30-13.4,30-30S75,17.8,58.4,17.8z M46.9,57.7
					L46.9,57.7L46.9,57.7L46.9,57.7z M50.5,61.5L50.5,61.5L50.5,61.5L50.5,61.5z M46.9,57.8c-1.3-2.1-2.7-6-2.7-9.8v-0.5
					c0-3.3,0.7-6.3,2.1-8.8c0.2,0.2,0.4,0.3,0.6,0.5l0.1,0.1c0.2,0.3,0.4,0.5,0.6,0.8c1.2,1.8,1.9,4.3,1.9,7.3v0.5
					c0,3.5,0.6,6.7,4.5,9.6l0,0c1.2,0.9,2.6,1.4,4.4,1.4c2.6,0,4.6-1,5.9-3s2-4.7,2-8v-0.5c0-3.2-0.7-5.9-2-7.9s-3.3-3-5.9-3
					c-1.3,0-2.5,0.3-3.5,0.8c0,0,0,0,0-0.1c-0.2-0.3-0.4-0.5-0.6-0.8c-0.3-0.3-0.5-0.7-0.8-1l0,0l0,0c-0.4-0.4-0.8-0.8-1.2-1.2l0,0
					l0,0c-0.3-0.3-0.6-0.5-0.9-0.8c2-1.2,4.3-1.8,7-1.8l0,0l0,0c4.2,0,7.7,1.5,10.3,4.5s3.9,6.8,3.9,11.3v0.5
					c0,4.6-1.3,8.4-3.9,11.4s-6.1,4.5-10.3,4.5l0,0l0,0c-3.1,0-5.8-0.7-8-2.4C48.6,60,48,59.5,46.9,57.8z"/>
			</g>
		</g>
	</g>
</g>
</svg>
