<?xml version="1.0" encoding="UTF-8"?>
<!-- Do not edit this file with editors other than draw.io -->
<!DOCTYPE svg PUBLIC "-//W3C//DTD SVG 1.1//EN" "http://www.w3.org/Graphics/SVG/1.1/DTD/svg11.dtd">
<svg xmlns="http://www.w3.org/2000/svg" xmlns:xlink="http://www.w3.org/1999/xlink" version="1.1" width="851px" height="1291px" viewBox="-0.5 -0.5 851 1291" content="&lt;mxfile host=&quot;Electron&quot; modified=&quot;2024-04-11T12:53:31.663Z&quot; agent=&quot;Mozilla/5.0 (X11; Linux x86_64) AppleWebKit/537.36 (KHTML, like Gecko) draw.io/24.1.0 Chrome/120.0.6099.109 Electron/28.1.0 Safari/537.36&quot; etag=&quot;Ftb-CWcfqcclS9sL8mu_&quot; version=&quot;24.1.0&quot; type=&quot;device&quot; pages=&quot;2&quot; scale=&quot;1&quot; border=&quot;0&quot;&gt;&#10;  &lt;diagram name=&quot;Seite-1&quot; id=&quot;XCLLBhDQ27IIz1-YJPkK&quot;&gt;&#10;    &lt;mxGraphModel dx=&quot;1434&quot; dy=&quot;2003&quot; grid=&quot;1&quot; gridSize=&quot;10&quot; guides=&quot;1&quot; tooltips=&quot;1&quot; connect=&quot;1&quot; arrows=&quot;1&quot; fold=&quot;1&quot; page=&quot;1&quot; pageScale=&quot;1&quot; pageWidth=&quot;827&quot; pageHeight=&quot;1169&quot; math=&quot;0&quot; shadow=&quot;0&quot;&gt;&#10;      &lt;root&gt;&#10;        &lt;mxCell id=&quot;0&quot; /&gt;&#10;        &lt;mxCell id=&quot;1&quot; parent=&quot;0&quot; /&gt;&#10;        &lt;mxCell id=&quot;iyXbQO3ZuoiaZDNUdpCI-2&quot; value=&quot;Versionsabschluss&amp;lt;div&amp;gt;0.0.14&amp;lt;/div&amp;gt;&quot; style=&quot;rounded=1;whiteSpace=wrap;html=1;&quot; parent=&quot;1&quot; vertex=&quot;1&quot;&gt;&#10;          &lt;mxGeometry x=&quot;275&quot; y=&quot;280&quot; width=&quot;120&quot; height=&quot;60&quot; as=&quot;geometry&quot; /&gt;&#10;        &lt;/mxCell&gt;&#10;        &lt;mxCell id=&quot;iyXbQO3ZuoiaZDNUdpCI-3&quot; value=&quot;Versionsabschluss&amp;lt;div&amp;gt;0.1.0&amp;lt;/div&amp;gt;&quot; style=&quot;rounded=1;whiteSpace=wrap;html=1;&quot; parent=&quot;1&quot; vertex=&quot;1&quot;&gt;&#10;          &lt;mxGeometry x=&quot;85&quot; y=&quot;160&quot; width=&quot;120&quot; height=&quot;60&quot; as=&quot;geometry&quot; /&gt;&#10;        &lt;/mxCell&gt;&#10;        &lt;mxCell id=&quot;iyXbQO3ZuoiaZDNUdpCI-4&quot; value=&quot;&quot; style=&quot;shape=flexArrow;endArrow=classic;html=1;rounded=0;endSize=9;startSize=30;fillColor=#008a00;strokeColor=#005700;&quot; parent=&quot;1&quot; edge=&quot;1&quot;&gt;&#10;          &lt;mxGeometry width=&quot;50&quot; height=&quot;50&quot; relative=&quot;1&quot; as=&quot;geometry&quot;&gt;&#10;            &lt;mxPoint x=&quot;55&quot; y=&quot;650&quot; as=&quot;sourcePoint&quot; /&gt;&#10;            &lt;mxPoint x=&quot;55&quot; y=&quot;-1120&quot; as=&quot;targetPoint&quot; /&gt;&#10;          &lt;/mxGeometry&gt;&#10;        &lt;/mxCell&gt;&#10;        &lt;mxCell id=&quot;iyXbQO3ZuoiaZDNUdpCI-6&quot; value=&quot;Versionsabschluss&amp;lt;div&amp;gt;0.0.13&amp;lt;/div&amp;gt;&quot; style=&quot;rounded=1;whiteSpace=wrap;html=1;&quot; parent=&quot;1&quot; vertex=&quot;1&quot;&gt;&#10;          &lt;mxGeometry x=&quot;275&quot; y=&quot;370&quot; width=&quot;120&quot; height=&quot;60&quot; as=&quot;geometry&quot; /&gt;&#10;        &lt;/mxCell&gt;&#10;        &lt;mxCell id=&quot;iyXbQO3ZuoiaZDNUdpCI-11&quot; value=&quot;Master&quot; style=&quot;rounded=1;whiteSpace=wrap;html=1;fontStyle=1&quot; parent=&quot;1&quot; vertex=&quot;1&quot;&gt;&#10;          &lt;mxGeometry x=&quot;10&quot; y=&quot;660&quot; width=&quot;90&quot; height=&quot;40&quot; as=&quot;geometry&quot; /&gt;&#10;        &lt;/mxCell&gt;&#10;        &lt;mxCell id=&quot;iyXbQO3ZuoiaZDNUdpCI-12&quot; value=&quot;Develop&quot; style=&quot;rounded=1;whiteSpace=wrap;html=1;fontStyle=1&quot; parent=&quot;1&quot; vertex=&quot;1&quot;&gt;&#10;          &lt;mxGeometry x=&quot;215&quot; y=&quot;660&quot; width=&quot;90&quot; height=&quot;40&quot; as=&quot;geometry&quot; /&gt;&#10;        &lt;/mxCell&gt;&#10;        &lt;mxCell id=&quot;iyXbQO3ZuoiaZDNUdpCI-14&quot; value=&quot;Versionsabschluss&amp;lt;div&amp;gt;0.1.1&amp;lt;/div&amp;gt;&quot; style=&quot;rounded=1;whiteSpace=wrap;html=1;&quot; parent=&quot;1&quot; vertex=&quot;1&quot;&gt;&#10;          &lt;mxGeometry x=&quot;265&quot; y=&quot;-278&quot; width=&quot;120&quot; height=&quot;60&quot; as=&quot;geometry&quot; /&gt;&#10;        &lt;/mxCell&gt;&#10;        &lt;mxCell id=&quot;iyXbQO3ZuoiaZDNUdpCI-15&quot; value=&quot;&quot; style=&quot;endArrow=classic;html=1;rounded=0;&quot; parent=&quot;1&quot; edge=&quot;1&quot;&gt;&#10;          &lt;mxGeometry width=&quot;50&quot; height=&quot;50&quot; relative=&quot;1&quot; as=&quot;geometry&quot;&gt;&#10;            &lt;mxPoint x=&quot;260&quot; y=&quot;230&quot; as=&quot;sourcePoint&quot; /&gt;&#10;            &lt;mxPoint x=&quot;60&quot; y=&quot;230&quot; as=&quot;targetPoint&quot; /&gt;&#10;          &lt;/mxGeometry&gt;&#10;        &lt;/mxCell&gt;&#10;        &lt;mxCell id=&quot;iyXbQO3ZuoiaZDNUdpCI-16&quot; value=&quot;&quot; style=&quot;endArrow=classic;html=1;rounded=0;&quot; parent=&quot;1&quot; edge=&quot;1&quot;&gt;&#10;          &lt;mxGeometry width=&quot;50&quot; height=&quot;50&quot; relative=&quot;1&quot; as=&quot;geometry&quot;&gt;&#10;            &lt;mxPoint x=&quot;55&quot; y=&quot;40&quot; as=&quot;sourcePoint&quot; /&gt;&#10;            &lt;mxPoint x=&quot;495&quot; y=&quot;40&quot; as=&quot;targetPoint&quot; /&gt;&#10;          &lt;/mxGeometry&gt;&#10;        &lt;/mxCell&gt;&#10;        &lt;mxCell id=&quot;iyXbQO3ZuoiaZDNUdpCI-18&quot; value=&quot;&quot; style=&quot;endArrow=classic;html=1;rounded=0;exitX=1;exitY=0.5;exitDx=0;exitDy=0;&quot; parent=&quot;1&quot; source=&quot;iyXbQO3ZuoiaZDNUdpCI-3&quot; edge=&quot;1&quot;&gt;&#10;          &lt;mxGeometry width=&quot;50&quot; height=&quot;50&quot; relative=&quot;1&quot; as=&quot;geometry&quot;&gt;&#10;            &lt;mxPoint x=&quot;455&quot; y=&quot;250&quot; as=&quot;sourcePoint&quot; /&gt;&#10;            &lt;mxPoint x=&quot;250&quot; y=&quot;190&quot; as=&quot;targetPoint&quot; /&gt;&#10;          &lt;/mxGeometry&gt;&#10;        &lt;/mxCell&gt;&#10;        &lt;mxCell id=&quot;iyXbQO3ZuoiaZDNUdpCI-20&quot; value=&quot;Feature Branch&amp;lt;div&amp;gt;&amp;amp;nbsp;für Issue &amp;lt;b&amp;gt;#a&amp;lt;/b&amp;gt;&amp;lt;/div&amp;gt;&quot; style=&quot;rounded=1;whiteSpace=wrap;html=1;&quot; parent=&quot;1&quot; vertex=&quot;1&quot;&gt;&#10;          &lt;mxGeometry x=&quot;435&quot; y=&quot;50&quot; width=&quot;120&quot; height=&quot;40&quot; as=&quot;geometry&quot; /&gt;&#10;        &lt;/mxCell&gt;&#10;        &lt;mxCell id=&quot;iyXbQO3ZuoiaZDNUdpCI-21&quot; value=&quot;Merge Feature &amp;lt;b&amp;gt;#a&amp;lt;/b&amp;gt; in Develop&quot; style=&quot;endArrow=classic;html=1;rounded=0;&quot; parent=&quot;1&quot; edge=&quot;1&quot;&gt;&#10;          &lt;mxGeometry x=&quot;0.175&quot; width=&quot;50&quot; height=&quot;50&quot; relative=&quot;1&quot; as=&quot;geometry&quot;&gt;&#10;            &lt;mxPoint x=&quot;496&quot; y=&quot;-120&quot; as=&quot;sourcePoint&quot; /&gt;&#10;            &lt;mxPoint x=&quot;256&quot; y=&quot;-120&quot; as=&quot;targetPoint&quot; /&gt;&#10;            &lt;mxPoint as=&quot;offset&quot; /&gt;&#10;          &lt;/mxGeometry&gt;&#10;        &lt;/mxCell&gt;&#10;        &lt;mxCell id=&quot;iyXbQO3ZuoiaZDNUdpCI-22&quot; value=&quot;&quot; style=&quot;endArrow=classic;html=1;rounded=0;&quot; parent=&quot;1&quot; edge=&quot;1&quot;&gt;&#10;          &lt;mxGeometry width=&quot;50&quot; height=&quot;50&quot; relative=&quot;1&quot; as=&quot;geometry&quot;&gt;&#10;            &lt;mxPoint x=&quot;55&quot; y=&quot;-40&quot; as=&quot;sourcePoint&quot; /&gt;&#10;            &lt;mxPoint x=&quot;575&quot; y=&quot;-40&quot; as=&quot;targetPoint&quot; /&gt;&#10;          &lt;/mxGeometry&gt;&#10;        &lt;/mxCell&gt;&#10;        &lt;mxCell id=&quot;iyXbQO3ZuoiaZDNUdpCI-24&quot; value=&quot;Feature Branch&amp;lt;div&amp;gt;&amp;amp;nbsp;für Issue &amp;lt;b&amp;gt;#b&amp;lt;/b&amp;gt;&amp;lt;/div&amp;gt;&quot; style=&quot;rounded=1;whiteSpace=wrap;html=1;&quot; parent=&quot;1&quot; vertex=&quot;1&quot;&gt;&#10;          &lt;mxGeometry x=&quot;525&quot; y=&quot;-20&quot; width=&quot;120&quot; height=&quot;40&quot; as=&quot;geometry&quot; /&gt;&#10;        &lt;/mxCell&gt;&#10;        &lt;mxCell id=&quot;iyXbQO3ZuoiaZDNUdpCI-25&quot; value=&quot;&quot; style=&quot;endArrow=classic;html=1;rounded=0;&quot; parent=&quot;1&quot; edge=&quot;1&quot;&gt;&#10;          &lt;mxGeometry width=&quot;50&quot; height=&quot;50&quot; relative=&quot;1&quot; as=&quot;geometry&quot;&gt;&#10;            &lt;mxPoint x=&quot;575&quot; y=&quot;-79&quot; as=&quot;sourcePoint&quot; /&gt;&#10;            &lt;mxPoint x=&quot;255&quot; y=&quot;-79&quot; as=&quot;targetPoint&quot; /&gt;&#10;          &lt;/mxGeometry&gt;&#10;        &lt;/mxCell&gt;&#10;        &lt;mxCell id=&quot;iyXbQO3ZuoiaZDNUdpCI-37&quot; value=&quot;Merge Feature &amp;lt;b&amp;gt;#b&amp;lt;/b&amp;gt; in Develop&quot; style=&quot;edgeLabel;html=1;align=center;verticalAlign=middle;resizable=0;points=[];&quot; parent=&quot;iyXbQO3ZuoiaZDNUdpCI-25&quot; vertex=&quot;1&quot; connectable=&quot;0&quot;&gt;&#10;          &lt;mxGeometry x=&quot;0.6563&quot; y=&quot;1&quot; relative=&quot;1&quot; as=&quot;geometry&quot;&gt;&#10;            &lt;mxPoint x=&quot;46&quot; as=&quot;offset&quot; /&gt;&#10;          &lt;/mxGeometry&gt;&#10;        &lt;/mxCell&gt;&#10;        &lt;mxCell id=&quot;iyXbQO3ZuoiaZDNUdpCI-26&quot; value=&quot;&quot; style=&quot;endArrow=classic;html=1;rounded=0;&quot; parent=&quot;1&quot; edge=&quot;1&quot;&gt;&#10;          &lt;mxGeometry width=&quot;50&quot; height=&quot;50&quot; relative=&quot;1&quot; as=&quot;geometry&quot;&gt;&#10;            &lt;mxPoint x=&quot;575&quot; y=&quot;-294&quot; as=&quot;sourcePoint&quot; /&gt;&#10;            &lt;mxPoint x=&quot;55&quot; y=&quot;-294&quot; as=&quot;targetPoint&quot; /&gt;&#10;          &lt;/mxGeometry&gt;&#10;        &lt;/mxCell&gt;&#10;        &lt;mxCell id=&quot;iyXbQO3ZuoiaZDNUdpCI-39&quot; value=&quot;Merge Feature b in Master&quot; style=&quot;edgeLabel;html=1;align=center;verticalAlign=middle;resizable=0;points=[];&quot; parent=&quot;iyXbQO3ZuoiaZDNUdpCI-26&quot; vertex=&quot;1&quot; connectable=&quot;0&quot;&gt;&#10;          &lt;mxGeometry x=&quot;-0.2192&quot; y=&quot;1&quot; relative=&quot;1&quot; as=&quot;geometry&quot;&gt;&#10;            &lt;mxPoint x=&quot;-217&quot; as=&quot;offset&quot; /&gt;&#10;          &lt;/mxGeometry&gt;&#10;        &lt;/mxCell&gt;&#10;        &lt;mxCell id=&quot;iyXbQO3ZuoiaZDNUdpCI-29&quot; value=&quot;Testphase&amp;lt;div&amp;gt;für Issue &amp;lt;b&amp;gt;#b&amp;lt;/b&amp;gt;&amp;lt;/div&amp;gt;&quot; style=&quot;shape=flexArrow;endArrow=classic;startArrow=classic;html=1;rounded=0;fillColor=#f0a30a;strokeColor=#BD7000;&quot; parent=&quot;1&quot; edge=&quot;1&quot;&gt;&#10;          &lt;mxGeometry width=&quot;100&quot; height=&quot;100&quot; relative=&quot;1&quot; as=&quot;geometry&quot;&gt;&#10;            &lt;mxPoint x=&quot;530&quot; y=&quot;-80&quot; as=&quot;sourcePoint&quot; /&gt;&#10;            &lt;mxPoint x=&quot;535&quot; y=&quot;-290&quot; as=&quot;targetPoint&quot; /&gt;&#10;          &lt;/mxGeometry&gt;&#10;        &lt;/mxCell&gt;&#10;        &lt;mxCell id=&quot;iyXbQO3ZuoiaZDNUdpCI-19&quot; value=&quot;&quot; style=&quot;shape=flexArrow;endArrow=classic;html=1;rounded=0;endSize=9;startSize=30;fillColor=#1ba1e2;strokeColor=#006EAF;&quot; parent=&quot;1&quot; edge=&quot;1&quot;&gt;&#10;          &lt;mxGeometry width=&quot;50&quot; height=&quot;50&quot; relative=&quot;1&quot; as=&quot;geometry&quot;&gt;&#10;            &lt;mxPoint x=&quot;495&quot; y=&quot;40&quot; as=&quot;sourcePoint&quot; /&gt;&#10;            &lt;mxPoint x=&quot;495&quot; y=&quot;-370&quot; as=&quot;targetPoint&quot; /&gt;&#10;          &lt;/mxGeometry&gt;&#10;        &lt;/mxCell&gt;&#10;        &lt;mxCell id=&quot;iyXbQO3ZuoiaZDNUdpCI-30&quot; value=&quot;Testphase&amp;lt;div&amp;gt;für Issue &amp;lt;b&amp;gt;#a&amp;lt;/b&amp;gt;&amp;lt;/div&amp;gt;&quot; style=&quot;shape=flexArrow;endArrow=classic;startArrow=classic;html=1;rounded=0;fillColor=#f0a30a;strokeColor=#BD7000;&quot; parent=&quot;1&quot; edge=&quot;1&quot;&gt;&#10;          &lt;mxGeometry width=&quot;100&quot; height=&quot;100&quot; relative=&quot;1&quot; as=&quot;geometry&quot;&gt;&#10;            &lt;mxPoint x=&quot;445&quot; y=&quot;-120&quot; as=&quot;sourcePoint&quot; /&gt;&#10;            &lt;mxPoint x=&quot;445&quot; y=&quot;-370&quot; as=&quot;targetPoint&quot; /&gt;&#10;          &lt;/mxGeometry&gt;&#10;        &lt;/mxCell&gt;&#10;        &lt;mxCell id=&quot;iyXbQO3ZuoiaZDNUdpCI-31&quot; value=&quot;&quot; style=&quot;endArrow=classic;html=1;rounded=0;&quot; parent=&quot;1&quot; edge=&quot;1&quot;&gt;&#10;          &lt;mxGeometry width=&quot;50&quot; height=&quot;50&quot; relative=&quot;1&quot; as=&quot;geometry&quot;&gt;&#10;            &lt;mxPoint x=&quot;495&quot; y=&quot;-370&quot; as=&quot;sourcePoint&quot; /&gt;&#10;            &lt;mxPoint x=&quot;55&quot; y=&quot;-370&quot; as=&quot;targetPoint&quot; /&gt;&#10;          &lt;/mxGeometry&gt;&#10;        &lt;/mxCell&gt;&#10;        &lt;mxCell id=&quot;iyXbQO3ZuoiaZDNUdpCI-41&quot; value=&quot;Merge Feature a in Master&quot; style=&quot;edgeLabel;html=1;align=center;verticalAlign=middle;resizable=0;points=[];&quot; parent=&quot;iyXbQO3ZuoiaZDNUdpCI-31&quot; vertex=&quot;1&quot; connectable=&quot;0&quot;&gt;&#10;          &lt;mxGeometry x=&quot;0.5864&quot; y=&quot;3&quot; relative=&quot;1&quot; as=&quot;geometry&quot;&gt;&#10;            &lt;mxPoint x=&quot;9&quot; y=&quot;-3&quot; as=&quot;offset&quot; /&gt;&#10;          &lt;/mxGeometry&gt;&#10;        &lt;/mxCell&gt;&#10;        &lt;mxCell id=&quot;iyXbQO3ZuoiaZDNUdpCI-23&quot; value=&quot;&quot; style=&quot;shape=flexArrow;endArrow=classic;html=1;rounded=0;endSize=9;startSize=30;fillColor=#1ba1e2;strokeColor=#006EAF;&quot; parent=&quot;1&quot; edge=&quot;1&quot;&gt;&#10;          &lt;mxGeometry width=&quot;50&quot; height=&quot;50&quot; relative=&quot;1&quot; as=&quot;geometry&quot;&gt;&#10;            &lt;mxPoint x=&quot;575&quot; y=&quot;-40&quot; as=&quot;sourcePoint&quot; /&gt;&#10;            &lt;mxPoint x=&quot;575&quot; y=&quot;-300&quot; as=&quot;targetPoint&quot; /&gt;&#10;          &lt;/mxGeometry&gt;&#10;        &lt;/mxCell&gt;&#10;        &lt;mxCell id=&quot;iyXbQO3ZuoiaZDNUdpCI-33&quot; value=&quot;&quot; style=&quot;endArrow=classic;html=1;rounded=0;&quot; parent=&quot;1&quot; edge=&quot;1&quot;&gt;&#10;          &lt;mxGeometry width=&quot;50&quot; height=&quot;50&quot; relative=&quot;1&quot; as=&quot;geometry&quot;&gt;&#10;            &lt;mxPoint x=&quot;255&quot; y=&quot;-320&quot; as=&quot;sourcePoint&quot; /&gt;&#10;            &lt;mxPoint x=&quot;675&quot; y=&quot;-320&quot; as=&quot;targetPoint&quot; /&gt;&#10;          &lt;/mxGeometry&gt;&#10;        &lt;/mxCell&gt;&#10;        &lt;mxCell id=&quot;iyXbQO3ZuoiaZDNUdpCI-34&quot; value=&quot;Feature Branch&amp;lt;div&amp;gt;&amp;amp;nbsp;für Issue &amp;lt;b&amp;gt;#c&amp;lt;/b&amp;gt;&amp;lt;/div&amp;gt;&amp;lt;div&amp;gt;(baut auf Issue &amp;lt;b&amp;gt;#a&amp;lt;/b&amp;gt; auf)&amp;lt;/div&amp;gt;&quot; style=&quot;rounded=1;whiteSpace=wrap;html=1;&quot; parent=&quot;1&quot; vertex=&quot;1&quot;&gt;&#10;          &lt;mxGeometry x=&quot;615&quot; y=&quot;-310&quot; width=&quot;120&quot; height=&quot;70&quot; as=&quot;geometry&quot; /&gt;&#10;        &lt;/mxCell&gt;&#10;        &lt;mxCell id=&quot;iyXbQO3ZuoiaZDNUdpCI-35&quot; value=&quot;Merge Feature &amp;lt;b&amp;gt;#c&amp;lt;/b&amp;gt; in Develop&quot; style=&quot;endArrow=classic;html=1;rounded=0;&quot; parent=&quot;1&quot; edge=&quot;1&quot;&gt;&#10;          &lt;mxGeometry x=&quot;0.4286&quot; width=&quot;50&quot; height=&quot;50&quot; relative=&quot;1&quot; as=&quot;geometry&quot;&gt;&#10;            &lt;mxPoint x=&quot;675&quot; y=&quot;-500&quot; as=&quot;sourcePoint&quot; /&gt;&#10;            &lt;mxPoint x=&quot;255&quot; y=&quot;-500&quot; as=&quot;targetPoint&quot; /&gt;&#10;            &lt;mxPoint as=&quot;offset&quot; /&gt;&#10;          &lt;/mxGeometry&gt;&#10;        &lt;/mxCell&gt;&#10;        &lt;mxCell id=&quot;iyXbQO3ZuoiaZDNUdpCI-32&quot; value=&quot;&quot; style=&quot;shape=flexArrow;endArrow=classic;html=1;rounded=0;endSize=9;startSize=30;fillColor=#1ba1e2;strokeColor=#006EAF;&quot; parent=&quot;1&quot; edge=&quot;1&quot;&gt;&#10;          &lt;mxGeometry width=&quot;50&quot; height=&quot;50&quot; relative=&quot;1&quot; as=&quot;geometry&quot;&gt;&#10;            &lt;mxPoint x=&quot;675&quot; y=&quot;-320&quot; as=&quot;sourcePoint&quot; /&gt;&#10;            &lt;mxPoint x=&quot;675&quot; y=&quot;-730&quot; as=&quot;targetPoint&quot; /&gt;&#10;          &lt;/mxGeometry&gt;&#10;        &lt;/mxCell&gt;&#10;        &lt;mxCell id=&quot;iyXbQO3ZuoiaZDNUdpCI-40&quot; value=&quot;Merge Feature &amp;lt;b&amp;gt;#c&amp;lt;/b&amp;gt; in Develop&quot; style=&quot;endArrow=classic;html=1;rounded=0;&quot; parent=&quot;1&quot; edge=&quot;1&quot;&gt;&#10;          &lt;mxGeometry x=&quot;0.6774&quot; width=&quot;50&quot; height=&quot;50&quot; relative=&quot;1&quot; as=&quot;geometry&quot;&gt;&#10;            &lt;mxPoint x=&quot;675&quot; y=&quot;-730&quot; as=&quot;sourcePoint&quot; /&gt;&#10;            &lt;mxPoint x=&quot;55&quot; y=&quot;-730&quot; as=&quot;targetPoint&quot; /&gt;&#10;            &lt;mxPoint as=&quot;offset&quot; /&gt;&#10;          &lt;/mxGeometry&gt;&#10;        &lt;/mxCell&gt;&#10;        &lt;mxCell id=&quot;iyXbQO3ZuoiaZDNUdpCI-42&quot; value=&quot;Testphase&amp;lt;div&amp;gt;für Issue &amp;lt;b&amp;gt;#c&amp;lt;/b&amp;gt;&amp;lt;/div&amp;gt;&quot; style=&quot;shape=flexArrow;endArrow=classic;startArrow=classic;html=1;rounded=0;fillColor=#f0a30a;strokeColor=#BD7000;&quot; parent=&quot;1&quot; edge=&quot;1&quot;&gt;&#10;          &lt;mxGeometry x=&quot;0.3913&quot; width=&quot;100&quot; height=&quot;100&quot; relative=&quot;1&quot; as=&quot;geometry&quot;&gt;&#10;            &lt;mxPoint x=&quot;625&quot; y=&quot;-500&quot; as=&quot;sourcePoint&quot; /&gt;&#10;            &lt;mxPoint x=&quot;625&quot; y=&quot;-730&quot; as=&quot;targetPoint&quot; /&gt;&#10;            &lt;mxPoint as=&quot;offset&quot; /&gt;&#10;          &lt;/mxGeometry&gt;&#10;        &lt;/mxCell&gt;&#10;        &lt;mxCell id=&quot;iyXbQO3ZuoiaZDNUdpCI-43&quot; value=&quot;&quot; style=&quot;endArrow=classic;html=1;rounded=0;&quot; parent=&quot;1&quot; edge=&quot;1&quot;&gt;&#10;          &lt;mxGeometry width=&quot;50&quot; height=&quot;50&quot; relative=&quot;1&quot; as=&quot;geometry&quot;&gt;&#10;            &lt;mxPoint x=&quot;55&quot; y=&quot;-440&quot; as=&quot;sourcePoint&quot; /&gt;&#10;            &lt;mxPoint x=&quot;795&quot; y=&quot;-440&quot; as=&quot;targetPoint&quot; /&gt;&#10;          &lt;/mxGeometry&gt;&#10;        &lt;/mxCell&gt;&#10;        &lt;mxCell id=&quot;iyXbQO3ZuoiaZDNUdpCI-44&quot; value=&quot;&quot; style=&quot;shape=flexArrow;endArrow=classic;html=1;rounded=0;endSize=9;startSize=30;fillColor=#1ba1e2;strokeColor=#006EAF;&quot; parent=&quot;1&quot; edge=&quot;1&quot;&gt;&#10;          &lt;mxGeometry width=&quot;50&quot; height=&quot;50&quot; relative=&quot;1&quot; as=&quot;geometry&quot;&gt;&#10;            &lt;mxPoint x=&quot;795&quot; y=&quot;-440&quot; as=&quot;sourcePoint&quot; /&gt;&#10;            &lt;mxPoint x=&quot;795&quot; y=&quot;-850&quot; as=&quot;targetPoint&quot; /&gt;&#10;          &lt;/mxGeometry&gt;&#10;        &lt;/mxCell&gt;&#10;        &lt;mxCell id=&quot;iyXbQO3ZuoiaZDNUdpCI-45&quot; value=&quot;Feature Branch&amp;lt;div&amp;gt;&amp;amp;nbsp;für Issue &amp;lt;b&amp;gt;#d&amp;lt;/b&amp;gt;&amp;lt;/div&amp;gt;&quot; style=&quot;rounded=1;whiteSpace=wrap;html=1;&quot; parent=&quot;1&quot; vertex=&quot;1&quot;&gt;&#10;          &lt;mxGeometry x=&quot;740&quot; y=&quot;-430&quot; width=&quot;120&quot; height=&quot;40&quot; as=&quot;geometry&quot; /&gt;&#10;        &lt;/mxCell&gt;&#10;        &lt;mxCell id=&quot;iyXbQO3ZuoiaZDNUdpCI-46&quot; value=&quot;Versionsabschluss&amp;lt;div&amp;gt;0.1.2&amp;lt;/div&amp;gt;&quot; style=&quot;rounded=1;whiteSpace=wrap;html=1;&quot; parent=&quot;1&quot; vertex=&quot;1&quot;&gt;&#10;          &lt;mxGeometry x=&quot;265&quot; y=&quot;-699&quot; width=&quot;120&quot; height=&quot;60&quot; as=&quot;geometry&quot; /&gt;&#10;        &lt;/mxCell&gt;&#10;        &lt;mxCell id=&quot;iyXbQO3ZuoiaZDNUdpCI-47&quot; value=&quot;Merge Feature &amp;lt;b&amp;gt;#d&amp;lt;/b&amp;gt;&amp;amp;nbsp;in Develop&quot; style=&quot;endArrow=classic;html=1;rounded=0;&quot; parent=&quot;1&quot; edge=&quot;1&quot;&gt;&#10;          &lt;mxGeometry x=&quot;0.5926&quot; width=&quot;50&quot; height=&quot;50&quot; relative=&quot;1&quot; as=&quot;geometry&quot;&gt;&#10;            &lt;mxPoint x=&quot;795&quot; y=&quot;-620&quot; as=&quot;sourcePoint&quot; /&gt;&#10;            &lt;mxPoint x=&quot;255&quot; y=&quot;-620&quot; as=&quot;targetPoint&quot; /&gt;&#10;            &lt;mxPoint as=&quot;offset&quot; /&gt;&#10;          &lt;/mxGeometry&gt;&#10;        &lt;/mxCell&gt;&#10;        &lt;mxCell id=&quot;iyXbQO3ZuoiaZDNUdpCI-48&quot; value=&quot;Merge Feature &amp;lt;b&amp;gt;#d&amp;lt;/b&amp;gt; in Develop&quot; style=&quot;endArrow=classic;html=1;rounded=0;&quot; parent=&quot;1&quot; edge=&quot;1&quot;&gt;&#10;          &lt;mxGeometry x=&quot;0.7297&quot; width=&quot;50&quot; height=&quot;50&quot; relative=&quot;1&quot; as=&quot;geometry&quot;&gt;&#10;            &lt;mxPoint x=&quot;795&quot; y=&quot;-848&quot; as=&quot;sourcePoint&quot; /&gt;&#10;            &lt;mxPoint x=&quot;55&quot; y=&quot;-848&quot; as=&quot;targetPoint&quot; /&gt;&#10;            &lt;mxPoint as=&quot;offset&quot; /&gt;&#10;          &lt;/mxGeometry&gt;&#10;        &lt;/mxCell&gt;&#10;        &lt;mxCell id=&quot;iyXbQO3ZuoiaZDNUdpCI-49&quot; value=&quot;Testphase&amp;lt;div&amp;gt;für Issue &amp;lt;b&amp;gt;#d&amp;lt;/b&amp;gt;&amp;lt;/div&amp;gt;&quot; style=&quot;shape=flexArrow;endArrow=classic;startArrow=classic;html=1;rounded=0;fillColor=#f0a30a;strokeColor=#BD7000;&quot; parent=&quot;1&quot; edge=&quot;1&quot;&gt;&#10;          &lt;mxGeometry x=&quot;0.3913&quot; width=&quot;100&quot; height=&quot;100&quot; relative=&quot;1&quot; as=&quot;geometry&quot;&gt;&#10;            &lt;mxPoint x=&quot;735&quot; y=&quot;-620&quot; as=&quot;sourcePoint&quot; /&gt;&#10;            &lt;mxPoint x=&quot;735&quot; y=&quot;-850&quot; as=&quot;targetPoint&quot; /&gt;&#10;            &lt;mxPoint as=&quot;offset&quot; /&gt;&#10;          &lt;/mxGeometry&gt;&#10;        &lt;/mxCell&gt;&#10;        &lt;mxCell id=&quot;iyXbQO3ZuoiaZDNUdpCI-51&quot; value=&quot;Master&quot; style=&quot;rounded=1;whiteSpace=wrap;html=1;fontStyle=1&quot; parent=&quot;1&quot; vertex=&quot;1&quot;&gt;&#10;          &lt;mxGeometry x=&quot;10&quot; y=&quot;-1160&quot; width=&quot;90&quot; height=&quot;40&quot; as=&quot;geometry&quot; /&gt;&#10;        &lt;/mxCell&gt;&#10;        &lt;mxCell id=&quot;iyXbQO3ZuoiaZDNUdpCI-52&quot; value=&quot;Develop&quot; style=&quot;rounded=1;whiteSpace=wrap;html=1;fontStyle=1&quot; parent=&quot;1&quot; vertex=&quot;1&quot;&gt;&#10;          &lt;mxGeometry x=&quot;210&quot; y=&quot;-1160&quot; width=&quot;90&quot; height=&quot;40&quot; as=&quot;geometry&quot; /&gt;&#10;        &lt;/mxCell&gt;&#10;        &lt;mxCell id=&quot;iyXbQO3ZuoiaZDNUdpCI-53&quot; value=&quot;Versionsabschluss&amp;lt;div&amp;gt;0.2.0&amp;lt;/div&amp;gt;&quot; style=&quot;rounded=1;whiteSpace=wrap;html=1;&quot; parent=&quot;1&quot; vertex=&quot;1&quot;&gt;&#10;          &lt;mxGeometry x=&quot;90&quot; y=&quot;-1040&quot; width=&quot;120&quot; height=&quot;60&quot; as=&quot;geometry&quot; /&gt;&#10;        &lt;/mxCell&gt;&#10;        &lt;mxCell id=&quot;iyXbQO3ZuoiaZDNUdpCI-54&quot; value=&quot;&quot; style=&quot;endArrow=classic;html=1;rounded=0;&quot; parent=&quot;1&quot; edge=&quot;1&quot;&gt;&#10;          &lt;mxGeometry width=&quot;50&quot; height=&quot;50&quot; relative=&quot;1&quot; as=&quot;geometry&quot;&gt;&#10;            &lt;mxPoint x=&quot;60&quot; y=&quot;630&quot; as=&quot;sourcePoint&quot; /&gt;&#10;            &lt;mxPoint x=&quot;450&quot; y=&quot;630&quot; as=&quot;targetPoint&quot; /&gt;&#10;          &lt;/mxGeometry&gt;&#10;        &lt;/mxCell&gt;&#10;        &lt;mxCell id=&quot;iyXbQO3ZuoiaZDNUdpCI-55&quot; value=&quot;Feature Branch&amp;lt;div&amp;gt;&amp;amp;nbsp;für Issue &amp;lt;b&amp;gt;#94&amp;lt;/b&amp;gt;&amp;lt;/div&amp;gt;&quot; style=&quot;rounded=1;whiteSpace=wrap;html=1;&quot; parent=&quot;1&quot; vertex=&quot;1&quot;&gt;&#10;          &lt;mxGeometry x=&quot;385&quot; y=&quot;640&quot; width=&quot;120&quot; height=&quot;40&quot; as=&quot;geometry&quot; /&gt;&#10;        &lt;/mxCell&gt;&#10;        &lt;mxCell id=&quot;iyXbQO3ZuoiaZDNUdpCI-56&quot; value=&quot;&quot; style=&quot;shape=flexArrow;endArrow=classic;html=1;rounded=0;endSize=9;startSize=30;fillColor=#1ba1e2;strokeColor=#006EAF;&quot; parent=&quot;1&quot; edge=&quot;1&quot;&gt;&#10;          &lt;mxGeometry width=&quot;50&quot; height=&quot;50&quot; relative=&quot;1&quot; as=&quot;geometry&quot;&gt;&#10;            &lt;mxPoint x=&quot;445&quot; y=&quot;630&quot; as=&quot;sourcePoint&quot; /&gt;&#10;            &lt;mxPoint x=&quot;445&quot; y=&quot;490&quot; as=&quot;targetPoint&quot; /&gt;&#10;          &lt;/mxGeometry&gt;&#10;        &lt;/mxCell&gt;&#10;        &lt;mxCell id=&quot;iyXbQO3ZuoiaZDNUdpCI-59&quot; value=&quot;Feature Branch&amp;lt;div&amp;gt;&amp;amp;nbsp;für Issue &amp;lt;b&amp;gt;#97&amp;lt;/b&amp;gt;&amp;lt;/div&amp;gt;&quot; style=&quot;rounded=1;whiteSpace=wrap;html=1;&quot; parent=&quot;1&quot; vertex=&quot;1&quot;&gt;&#10;          &lt;mxGeometry x=&quot;470&quot; y=&quot;540&quot; width=&quot;120&quot; height=&quot;40&quot; as=&quot;geometry&quot; /&gt;&#10;        &lt;/mxCell&gt;&#10;        &lt;mxCell id=&quot;iyXbQO3ZuoiaZDNUdpCI-60&quot; value=&quot;&quot; style=&quot;shape=flexArrow;endArrow=classic;html=1;rounded=0;endSize=9;startSize=30;fillColor=#1ba1e2;strokeColor=#006EAF;&quot; parent=&quot;1&quot; edge=&quot;1&quot;&gt;&#10;          &lt;mxGeometry width=&quot;50&quot; height=&quot;50&quot; relative=&quot;1&quot; as=&quot;geometry&quot;&gt;&#10;            &lt;mxPoint x=&quot;530&quot; y=&quot;530&quot; as=&quot;sourcePoint&quot; /&gt;&#10;            &lt;mxPoint x=&quot;530&quot; y=&quot;250&quot; as=&quot;targetPoint&quot; /&gt;&#10;            &lt;Array as=&quot;points&quot;&gt;&#10;              &lt;mxPoint x=&quot;530&quot; y=&quot;500&quot; /&gt;&#10;            &lt;/Array&gt;&#10;          &lt;/mxGeometry&gt;&#10;        &lt;/mxCell&gt;&#10;        &lt;mxCell id=&quot;iyXbQO3ZuoiaZDNUdpCI-61&quot; value=&quot;&quot; style=&quot;endArrow=classic;html=1;rounded=0;&quot; parent=&quot;1&quot; edge=&quot;1&quot;&gt;&#10;          &lt;mxGeometry width=&quot;50&quot; height=&quot;50&quot; relative=&quot;1&quot; as=&quot;geometry&quot;&gt;&#10;            &lt;mxPoint x=&quot;60&quot; y=&quot;530&quot; as=&quot;sourcePoint&quot; /&gt;&#10;            &lt;mxPoint x=&quot;530&quot; y=&quot;530&quot; as=&quot;targetPoint&quot; /&gt;&#10;          &lt;/mxGeometry&gt;&#10;        &lt;/mxCell&gt;&#10;        &lt;mxCell id=&quot;iyXbQO3ZuoiaZDNUdpCI-62&quot; value=&quot;&quot; style=&quot;endArrow=classic;html=1;rounded=0;&quot; parent=&quot;1&quot; edge=&quot;1&quot;&gt;&#10;          &lt;mxGeometry width=&quot;50&quot; height=&quot;50&quot; relative=&quot;1&quot; as=&quot;geometry&quot;&gt;&#10;            &lt;mxPoint x=&quot;530&quot; y=&quot;470&quot; as=&quot;sourcePoint&quot; /&gt;&#10;            &lt;mxPoint x=&quot;260&quot; y=&quot;470&quot; as=&quot;targetPoint&quot; /&gt;&#10;          &lt;/mxGeometry&gt;&#10;        &lt;/mxCell&gt;&#10;        &lt;mxCell id=&quot;iyXbQO3ZuoiaZDNUdpCI-7&quot; value=&quot;&quot; style=&quot;shape=flexArrow;endArrow=classic;html=1;rounded=0;endSize=9;startSize=30;fillColor=#60a917;strokeColor=#2D7600;entryX=0.5;entryY=1;entryDx=0;entryDy=0;&quot; parent=&quot;1&quot; target=&quot;iyXbQO3ZuoiaZDNUdpCI-52&quot; edge=&quot;1&quot;&gt;&#10;          &lt;mxGeometry width=&quot;50&quot; height=&quot;50&quot; relative=&quot;1&quot; as=&quot;geometry&quot;&gt;&#10;            &lt;mxPoint x=&quot;255&quot; y=&quot;650&quot; as=&quot;sourcePoint&quot; /&gt;&#10;            &lt;mxPoint x=&quot;255&quot; y=&quot;-1110&quot; as=&quot;targetPoint&quot; /&gt;&#10;          &lt;/mxGeometry&gt;&#10;        &lt;/mxCell&gt;&#10;        &lt;mxCell id=&quot;iyXbQO3ZuoiaZDNUdpCI-63&quot; value=&quot;Feature Branch&amp;lt;div&amp;gt;&amp;amp;nbsp;für Issue &amp;lt;b&amp;gt;#150&amp;lt;/b&amp;gt;&amp;lt;/div&amp;gt;&quot; style=&quot;rounded=1;whiteSpace=wrap;html=1;&quot; parent=&quot;1&quot; vertex=&quot;1&quot;&gt;&#10;          &lt;mxGeometry x=&quot;645&quot; y=&quot;605&quot; width=&quot;120&quot; height=&quot;40&quot; as=&quot;geometry&quot; /&gt;&#10;        &lt;/mxCell&gt;&#10;        &lt;mxCell id=&quot;iyXbQO3ZuoiaZDNUdpCI-64&quot; value=&quot;&quot; style=&quot;shape=flexArrow;endArrow=classic;html=1;rounded=0;endSize=9;startSize=30;fillColor=#1ba1e2;strokeColor=#006EAF;&quot; parent=&quot;1&quot; edge=&quot;1&quot;&gt;&#10;          &lt;mxGeometry width=&quot;50&quot; height=&quot;50&quot; relative=&quot;1&quot; as=&quot;geometry&quot;&gt;&#10;            &lt;mxPoint x=&quot;705&quot; y=&quot;590&quot; as=&quot;sourcePoint&quot; /&gt;&#10;            &lt;mxPoint x=&quot;705&quot; y=&quot;450&quot; as=&quot;targetPoint&quot; /&gt;&#10;            &lt;Array as=&quot;points&quot;&gt;&#10;              &lt;mxPoint x=&quot;704.5&quot; y=&quot;570&quot; /&gt;&#10;            &lt;/Array&gt;&#10;          &lt;/mxGeometry&gt;&#10;        &lt;/mxCell&gt;&#10;        &lt;mxCell id=&quot;iyXbQO3ZuoiaZDNUdpCI-66&quot; value=&quot;&quot; style=&quot;endArrow=classic;html=1;rounded=0;&quot; parent=&quot;1&quot; edge=&quot;1&quot;&gt;&#10;          &lt;mxGeometry width=&quot;50&quot; height=&quot;50&quot; relative=&quot;1&quot; as=&quot;geometry&quot;&gt;&#10;            &lt;mxPoint x=&quot;530&quot; y=&quot;250&quot; as=&quot;sourcePoint&quot; /&gt;&#10;            &lt;mxPoint x=&quot;60&quot; y=&quot;250&quot; as=&quot;targetPoint&quot; /&gt;&#10;          &lt;/mxGeometry&gt;&#10;        &lt;/mxCell&gt;&#10;        &lt;mxCell id=&quot;iyXbQO3ZuoiaZDNUdpCI-68&quot; value=&quot;Testphase&amp;lt;div&amp;gt;für Issue &amp;lt;b&amp;gt;#97&amp;lt;/b&amp;gt;&amp;lt;/div&amp;gt;&quot; style=&quot;shape=flexArrow;endArrow=classic;startArrow=classic;html=1;rounded=0;fillColor=#f0a30a;strokeColor=#BD7000;&quot; parent=&quot;1&quot; edge=&quot;1&quot;&gt;&#10;          &lt;mxGeometry width=&quot;100&quot; height=&quot;100&quot; relative=&quot;1&quot; as=&quot;geometry&quot;&gt;&#10;            &lt;mxPoint x=&quot;370&quot; y=&quot;630&quot; as=&quot;sourcePoint&quot; /&gt;&#10;            &lt;mxPoint x=&quot;370&quot; y=&quot;500&quot; as=&quot;targetPoint&quot; /&gt;&#10;          &lt;/mxGeometry&gt;&#10;        &lt;/mxCell&gt;&#10;        &lt;mxCell id=&quot;iyXbQO3ZuoiaZDNUdpCI-69&quot; value=&quot;&quot; style=&quot;endArrow=classic;html=1;rounded=0;&quot; parent=&quot;1&quot; edge=&quot;1&quot;&gt;&#10;          &lt;mxGeometry width=&quot;50&quot; height=&quot;50&quot; relative=&quot;1&quot; as=&quot;geometry&quot;&gt;&#10;            &lt;mxPoint x=&quot;440&quot; y=&quot;490&quot; as=&quot;sourcePoint&quot; /&gt;&#10;            &lt;mxPoint x=&quot;530&quot; y=&quot;490&quot; as=&quot;targetPoint&quot; /&gt;&#10;          &lt;/mxGeometry&gt;&#10;        &lt;/mxCell&gt;&#10;        &lt;mxCell id=&quot;iyXbQO3ZuoiaZDNUdpCI-70&quot; value=&quot;&quot; style=&quot;endArrow=classic;html=1;rounded=0;&quot; parent=&quot;1&quot; edge=&quot;1&quot;&gt;&#10;          &lt;mxGeometry width=&quot;50&quot; height=&quot;50&quot; relative=&quot;1&quot; as=&quot;geometry&quot;&gt;&#10;            &lt;mxPoint x=&quot;700&quot; y=&quot;450&quot; as=&quot;sourcePoint&quot; /&gt;&#10;            &lt;mxPoint x=&quot;260&quot; y=&quot;450&quot; as=&quot;targetPoint&quot; /&gt;&#10;          &lt;/mxGeometry&gt;&#10;        &lt;/mxCell&gt;&#10;        &lt;mxCell id=&quot;iyXbQO3ZuoiaZDNUdpCI-67&quot; value=&quot;Testphase&amp;lt;div&amp;gt;für Issue &amp;lt;b&amp;gt;#97&amp;lt;/b&amp;gt;&amp;lt;/div&amp;gt;&quot; style=&quot;shape=flexArrow;endArrow=classic;startArrow=classic;html=1;rounded=0;fillColor=#f0a30a;strokeColor=#BD7000;&quot; parent=&quot;1&quot; edge=&quot;1&quot;&gt;&#10;          &lt;mxGeometry width=&quot;100&quot; height=&quot;100&quot; relative=&quot;1&quot; as=&quot;geometry&quot;&gt;&#10;            &lt;mxPoint x=&quot;470&quot; y=&quot;470&quot; as=&quot;sourcePoint&quot; /&gt;&#10;            &lt;mxPoint x=&quot;470&quot; y=&quot;250&quot; as=&quot;targetPoint&quot; /&gt;&#10;          &lt;/mxGeometry&gt;&#10;        &lt;/mxCell&gt;&#10;        &lt;mxCell id=&quot;iyXbQO3ZuoiaZDNUdpCI-71&quot; value=&quot;&quot; style=&quot;endArrow=classic;html=1;rounded=0;&quot; parent=&quot;1&quot; edge=&quot;1&quot;&gt;&#10;          &lt;mxGeometry width=&quot;50&quot; height=&quot;50&quot; relative=&quot;1&quot; as=&quot;geometry&quot;&gt;&#10;            &lt;mxPoint x=&quot;60&quot; y=&quot;590&quot; as=&quot;sourcePoint&quot; /&gt;&#10;            &lt;mxPoint x=&quot;710&quot; y=&quot;590&quot; as=&quot;targetPoint&quot; /&gt;&#10;          &lt;/mxGeometry&gt;&#10;        &lt;/mxCell&gt;&#10;        &lt;mxCell id=&quot;SfLDqQ7Xirak3wIcjPFZ-1&quot; value=&quot;&quot; style=&quot;endArrow=none;dashed=1;html=1;dashPattern=1 3;strokeWidth=2;rounded=0;&quot; parent=&quot;1&quot; edge=&quot;1&quot;&gt;&#10;          &lt;mxGeometry width=&quot;50&quot; height=&quot;50&quot; relative=&quot;1&quot; as=&quot;geometry&quot;&gt;&#10;            &lt;mxPoint x=&quot;20&quot; y=&quot;150&quot; as=&quot;sourcePoint&quot; /&gt;&#10;            &lt;mxPoint x=&quot;820&quot; y=&quot;150&quot; as=&quot;targetPoint&quot; /&gt;&#10;          &lt;/mxGeometry&gt;&#10;        &lt;/mxCell&gt;&#10;      &lt;/root&gt;&#10;    &lt;/mxGraphModel&gt;&#10;  &lt;/diagram&gt;&#10;  &lt;diagram name=&quot;Kopie von Seite-1&quot; id=&quot;kiM0XPEMjBj1IRyTZY8A&quot;&gt;&#10;    &lt;mxGraphModel dx=&quot;1434&quot; dy=&quot;2003&quot; grid=&quot;1&quot; gridSize=&quot;10&quot; guides=&quot;1&quot; tooltips=&quot;1&quot; connect=&quot;1&quot; arrows=&quot;1&quot; fold=&quot;1&quot; page=&quot;1&quot; pageScale=&quot;1&quot; pageWidth=&quot;827&quot; pageHeight=&quot;1169&quot; math=&quot;0&quot; shadow=&quot;0&quot;&gt;&#10;      &lt;root&gt;&#10;        &lt;mxCell id=&quot;3oscUyqNs-xWXIR_WFqv-0&quot; /&gt;&#10;        &lt;mxCell id=&quot;3oscUyqNs-xWXIR_WFqv-1&quot; parent=&quot;3oscUyqNs-xWXIR_WFqv-0&quot; /&gt;&#10;        &lt;mxCell id=&quot;3oscUyqNs-xWXIR_WFqv-4&quot; value=&quot;&quot; style=&quot;shape=flexArrow;endArrow=classic;html=1;rounded=0;endSize=9;startSize=30;fillColor=#008a00;strokeColor=#005700;&quot; edge=&quot;1&quot; parent=&quot;3oscUyqNs-xWXIR_WFqv-1&quot;&gt;&#10;          &lt;mxGeometry width=&quot;50&quot; height=&quot;50&quot; relative=&quot;1&quot; as=&quot;geometry&quot;&gt;&#10;            &lt;mxPoint x=&quot;55&quot; y=&quot;80&quot; as=&quot;sourcePoint&quot; /&gt;&#10;            &lt;mxPoint x=&quot;55&quot; y=&quot;-1120&quot; as=&quot;targetPoint&quot; /&gt;&#10;          &lt;/mxGeometry&gt;&#10;        &lt;/mxCell&gt;&#10;        &lt;mxCell id=&quot;3oscUyqNs-xWXIR_WFqv-6&quot; value=&quot;Master&quot; style=&quot;rounded=1;whiteSpace=wrap;html=1;fontStyle=1&quot; vertex=&quot;1&quot; parent=&quot;3oscUyqNs-xWXIR_WFqv-1&quot;&gt;&#10;          &lt;mxGeometry x=&quot;10&quot; y=&quot;90&quot; width=&quot;90&quot; height=&quot;40&quot; as=&quot;geometry&quot; /&gt;&#10;        &lt;/mxCell&gt;&#10;        &lt;mxCell id=&quot;3oscUyqNs-xWXIR_WFqv-7&quot; value=&quot;Develop&quot; style=&quot;rounded=1;whiteSpace=wrap;html=1;fontStyle=1&quot; vertex=&quot;1&quot; parent=&quot;3oscUyqNs-xWXIR_WFqv-1&quot;&gt;&#10;          &lt;mxGeometry x=&quot;215&quot; y=&quot;90&quot; width=&quot;90&quot; height=&quot;40&quot; as=&quot;geometry&quot; /&gt;&#10;        &lt;/mxCell&gt;&#10;        &lt;mxCell id=&quot;3oscUyqNs-xWXIR_WFqv-8&quot; value=&quot;Versionsabschluss&amp;lt;div&amp;gt;0.1.1&amp;lt;/div&amp;gt;&quot; style=&quot;rounded=1;whiteSpace=wrap;html=1;&quot; vertex=&quot;1&quot; parent=&quot;3oscUyqNs-xWXIR_WFqv-1&quot;&gt;&#10;          &lt;mxGeometry x=&quot;265&quot; y=&quot;-278&quot; width=&quot;120&quot; height=&quot;60&quot; as=&quot;geometry&quot; /&gt;&#10;        &lt;/mxCell&gt;&#10;        &lt;mxCell id=&quot;3oscUyqNs-xWXIR_WFqv-10&quot; value=&quot;&quot; style=&quot;endArrow=classic;html=1;rounded=0;&quot; edge=&quot;1&quot; parent=&quot;3oscUyqNs-xWXIR_WFqv-1&quot;&gt;&#10;          &lt;mxGeometry width=&quot;50&quot; height=&quot;50&quot; relative=&quot;1&quot; as=&quot;geometry&quot;&gt;&#10;            &lt;mxPoint x=&quot;55&quot; y=&quot;40&quot; as=&quot;sourcePoint&quot; /&gt;&#10;            &lt;mxPoint x=&quot;495&quot; y=&quot;40&quot; as=&quot;targetPoint&quot; /&gt;&#10;          &lt;/mxGeometry&gt;&#10;        &lt;/mxCell&gt;&#10;        &lt;mxCell id=&quot;3oscUyqNs-xWXIR_WFqv-12&quot; value=&quot;Feature Branch&amp;lt;div&amp;gt;&amp;amp;nbsp;für Issue &amp;lt;b&amp;gt;#a&amp;lt;/b&amp;gt;&amp;lt;/div&amp;gt;&quot; style=&quot;rounded=1;whiteSpace=wrap;html=1;&quot; vertex=&quot;1&quot; parent=&quot;3oscUyqNs-xWXIR_WFqv-1&quot;&gt;&#10;          &lt;mxGeometry x=&quot;435&quot; y=&quot;50&quot; width=&quot;120&quot; height=&quot;40&quot; as=&quot;geometry&quot; /&gt;&#10;        &lt;/mxCell&gt;&#10;        &lt;mxCell id=&quot;3oscUyqNs-xWXIR_WFqv-13&quot; value=&quot;Merge Feature &amp;lt;b&amp;gt;#a&amp;lt;/b&amp;gt; in Develop&quot; style=&quot;endArrow=classic;html=1;rounded=0;&quot; edge=&quot;1&quot; parent=&quot;3oscUyqNs-xWXIR_WFqv-1&quot;&gt;&#10;          &lt;mxGeometry x=&quot;0.175&quot; width=&quot;50&quot; height=&quot;50&quot; relative=&quot;1&quot; as=&quot;geometry&quot;&gt;&#10;            &lt;mxPoint x=&quot;496&quot; y=&quot;-120&quot; as=&quot;sourcePoint&quot; /&gt;&#10;            &lt;mxPoint x=&quot;256&quot; y=&quot;-120&quot; as=&quot;targetPoint&quot; /&gt;&#10;            &lt;mxPoint as=&quot;offset&quot; /&gt;&#10;          &lt;/mxGeometry&gt;&#10;        &lt;/mxCell&gt;&#10;        &lt;mxCell id=&quot;3oscUyqNs-xWXIR_WFqv-14&quot; value=&quot;&quot; style=&quot;endArrow=classic;html=1;rounded=0;&quot; edge=&quot;1&quot; parent=&quot;3oscUyqNs-xWXIR_WFqv-1&quot;&gt;&#10;          &lt;mxGeometry width=&quot;50&quot; height=&quot;50&quot; relative=&quot;1&quot; as=&quot;geometry&quot;&gt;&#10;            &lt;mxPoint x=&quot;55&quot; y=&quot;-40&quot; as=&quot;sourcePoint&quot; /&gt;&#10;            &lt;mxPoint x=&quot;575&quot; y=&quot;-40&quot; as=&quot;targetPoint&quot; /&gt;&#10;          &lt;/mxGeometry&gt;&#10;        &lt;/mxCell&gt;&#10;        &lt;mxCell id=&quot;3oscUyqNs-xWXIR_WFqv-15&quot; value=&quot;Feature Branch&amp;lt;div&amp;gt;&amp;amp;nbsp;für Issue &amp;lt;b&amp;gt;#b&amp;lt;/b&amp;gt;&amp;lt;/div&amp;gt;&quot; style=&quot;rounded=1;whiteSpace=wrap;html=1;&quot; vertex=&quot;1&quot; parent=&quot;3oscUyqNs-xWXIR_WFqv-1&quot;&gt;&#10;          &lt;mxGeometry x=&quot;525&quot; y=&quot;-20&quot; width=&quot;120&quot; height=&quot;40&quot; as=&quot;geometry&quot; /&gt;&#10;        &lt;/mxCell&gt;&#10;        &lt;mxCell id=&quot;3oscUyqNs-xWXIR_WFqv-16&quot; value=&quot;&quot; style=&quot;endArrow=classic;html=1;rounded=0;&quot; edge=&quot;1&quot; parent=&quot;3oscUyqNs-xWXIR_WFqv-1&quot;&gt;&#10;          &lt;mxGeometry width=&quot;50&quot; height=&quot;50&quot; relative=&quot;1&quot; as=&quot;geometry&quot;&gt;&#10;            &lt;mxPoint x=&quot;575&quot; y=&quot;-79&quot; as=&quot;sourcePoint&quot; /&gt;&#10;            &lt;mxPoint x=&quot;255&quot; y=&quot;-79&quot; as=&quot;targetPoint&quot; /&gt;&#10;          &lt;/mxGeometry&gt;&#10;        &lt;/mxCell&gt;&#10;        &lt;mxCell id=&quot;3oscUyqNs-xWXIR_WFqv-17&quot; value=&quot;Merge Feature &amp;lt;b&amp;gt;#b&amp;lt;/b&amp;gt; in Develop&quot; style=&quot;edgeLabel;html=1;align=center;verticalAlign=middle;resizable=0;points=[];&quot; vertex=&quot;1&quot; connectable=&quot;0&quot; parent=&quot;3oscUyqNs-xWXIR_WFqv-16&quot;&gt;&#10;          &lt;mxGeometry x=&quot;0.6563&quot; y=&quot;1&quot; relative=&quot;1&quot; as=&quot;geometry&quot;&gt;&#10;            &lt;mxPoint x=&quot;46&quot; as=&quot;offset&quot; /&gt;&#10;          &lt;/mxGeometry&gt;&#10;        &lt;/mxCell&gt;&#10;        &lt;mxCell id=&quot;3oscUyqNs-xWXIR_WFqv-18&quot; value=&quot;&quot; style=&quot;endArrow=classic;html=1;rounded=0;&quot; edge=&quot;1&quot; parent=&quot;3oscUyqNs-xWXIR_WFqv-1&quot;&gt;&#10;          &lt;mxGeometry width=&quot;50&quot; height=&quot;50&quot; relative=&quot;1&quot; as=&quot;geometry&quot;&gt;&#10;            &lt;mxPoint x=&quot;575&quot; y=&quot;-294&quot; as=&quot;sourcePoint&quot; /&gt;&#10;            &lt;mxPoint x=&quot;55&quot; y=&quot;-294&quot; as=&quot;targetPoint&quot; /&gt;&#10;          &lt;/mxGeometry&gt;&#10;        &lt;/mxCell&gt;&#10;        &lt;mxCell id=&quot;3oscUyqNs-xWXIR_WFqv-19&quot; value=&quot;Merge Feature b in Master&quot; style=&quot;edgeLabel;html=1;align=center;verticalAlign=middle;resizable=0;points=[];&quot; vertex=&quot;1&quot; connectable=&quot;0&quot; parent=&quot;3oscUyqNs-xWXIR_WFqv-18&quot;&gt;&#10;          &lt;mxGeometry x=&quot;-0.2192&quot; y=&quot;1&quot; relative=&quot;1&quot; as=&quot;geometry&quot;&gt;&#10;            &lt;mxPoint x=&quot;-217&quot; as=&quot;offset&quot; /&gt;&#10;          &lt;/mxGeometry&gt;&#10;        &lt;/mxCell&gt;&#10;        &lt;mxCell id=&quot;3oscUyqNs-xWXIR_WFqv-20&quot; value=&quot;Testphase&amp;lt;div&amp;gt;für Issue &amp;lt;b&amp;gt;#b&amp;lt;/b&amp;gt;&amp;lt;/div&amp;gt;&quot; style=&quot;shape=flexArrow;endArrow=classic;startArrow=classic;html=1;rounded=0;fillColor=#f0a30a;strokeColor=#BD7000;&quot; edge=&quot;1&quot; parent=&quot;3oscUyqNs-xWXIR_WFqv-1&quot;&gt;&#10;          &lt;mxGeometry width=&quot;100&quot; height=&quot;100&quot; relative=&quot;1&quot; as=&quot;geometry&quot;&gt;&#10;            &lt;mxPoint x=&quot;530&quot; y=&quot;-80&quot; as=&quot;sourcePoint&quot; /&gt;&#10;            &lt;mxPoint x=&quot;535&quot; y=&quot;-290&quot; as=&quot;targetPoint&quot; /&gt;&#10;          &lt;/mxGeometry&gt;&#10;        &lt;/mxCell&gt;&#10;        &lt;mxCell id=&quot;3oscUyqNs-xWXIR_WFqv-21&quot; value=&quot;&quot; style=&quot;shape=flexArrow;endArrow=classic;html=1;rounded=0;endSize=9;startSize=30;fillColor=#1ba1e2;strokeColor=#006EAF;&quot; edge=&quot;1&quot; parent=&quot;3oscUyqNs-xWXIR_WFqv-1&quot;&gt;&#10;          &lt;mxGeometry width=&quot;50&quot; height=&quot;50&quot; relative=&quot;1&quot; as=&quot;geometry&quot;&gt;&#10;            &lt;mxPoint x=&quot;495&quot; y=&quot;40&quot; as=&quot;sourcePoint&quot; /&gt;&#10;            &lt;mxPoint x=&quot;495&quot; y=&quot;-370&quot; as=&quot;targetPoint&quot; /&gt;&#10;          &lt;/mxGeometry&gt;&#10;        &lt;/mxCell&gt;&#10;        &lt;mxCell id=&quot;3oscUyqNs-xWXIR_WFqv-22&quot; value=&quot;Testphase&amp;lt;div&amp;gt;für Issue &amp;lt;b&amp;gt;#a&amp;lt;/b&amp;gt;&amp;lt;/div&amp;gt;&quot; style=&quot;shape=flexArrow;endArrow=classic;startArrow=classic;html=1;rounded=0;fillColor=#f0a30a;strokeColor=#BD7000;&quot; edge=&quot;1&quot; parent=&quot;3oscUyqNs-xWXIR_WFqv-1&quot;&gt;&#10;          &lt;mxGeometry width=&quot;100&quot; height=&quot;100&quot; relative=&quot;1&quot; as=&quot;geometry&quot;&gt;&#10;            &lt;mxPoint x=&quot;445&quot; y=&quot;-120&quot; as=&quot;sourcePoint&quot; /&gt;&#10;            &lt;mxPoint x=&quot;445&quot; y=&quot;-370&quot; as=&quot;targetPoint&quot; /&gt;&#10;          &lt;/mxGeometry&gt;&#10;        &lt;/mxCell&gt;&#10;        &lt;mxCell id=&quot;3oscUyqNs-xWXIR_WFqv-23&quot; value=&quot;&quot; style=&quot;endArrow=classic;html=1;rounded=0;&quot; edge=&quot;1&quot; parent=&quot;3oscUyqNs-xWXIR_WFqv-1&quot;&gt;&#10;          &lt;mxGeometry width=&quot;50&quot; height=&quot;50&quot; relative=&quot;1&quot; as=&quot;geometry&quot;&gt;&#10;            &lt;mxPoint x=&quot;495&quot; y=&quot;-370&quot; as=&quot;sourcePoint&quot; /&gt;&#10;            &lt;mxPoint x=&quot;55&quot; y=&quot;-370&quot; as=&quot;targetPoint&quot; /&gt;&#10;          &lt;/mxGeometry&gt;&#10;        &lt;/mxCell&gt;&#10;        &lt;mxCell id=&quot;3oscUyqNs-xWXIR_WFqv-24&quot; value=&quot;Merge Feature a in Master&quot; style=&quot;edgeLabel;html=1;align=center;verticalAlign=middle;resizable=0;points=[];&quot; vertex=&quot;1&quot; connectable=&quot;0&quot; parent=&quot;3oscUyqNs-xWXIR_WFqv-23&quot;&gt;&#10;          &lt;mxGeometry x=&quot;0.5864&quot; y=&quot;3&quot; relative=&quot;1&quot; as=&quot;geometry&quot;&gt;&#10;            &lt;mxPoint x=&quot;9&quot; y=&quot;-3&quot; as=&quot;offset&quot; /&gt;&#10;          &lt;/mxGeometry&gt;&#10;        &lt;/mxCell&gt;&#10;        &lt;mxCell id=&quot;3oscUyqNs-xWXIR_WFqv-25&quot; value=&quot;&quot; style=&quot;shape=flexArrow;endArrow=classic;html=1;rounded=0;endSize=9;startSize=30;fillColor=#1ba1e2;strokeColor=#006EAF;&quot; edge=&quot;1&quot; parent=&quot;3oscUyqNs-xWXIR_WFqv-1&quot;&gt;&#10;          &lt;mxGeometry width=&quot;50&quot; height=&quot;50&quot; relative=&quot;1&quot; as=&quot;geometry&quot;&gt;&#10;            &lt;mxPoint x=&quot;575&quot; y=&quot;-40&quot; as=&quot;sourcePoint&quot; /&gt;&#10;            &lt;mxPoint x=&quot;575&quot; y=&quot;-300&quot; as=&quot;targetPoint&quot; /&gt;&#10;          &lt;/mxGeometry&gt;&#10;        &lt;/mxCell&gt;&#10;        &lt;mxCell id=&quot;3oscUyqNs-xWXIR_WFqv-26&quot; value=&quot;&quot; style=&quot;endArrow=classic;html=1;rounded=0;&quot; edge=&quot;1&quot; parent=&quot;3oscUyqNs-xWXIR_WFqv-1&quot;&gt;&#10;          &lt;mxGeometry width=&quot;50&quot; height=&quot;50&quot; relative=&quot;1&quot; as=&quot;geometry&quot;&gt;&#10;            &lt;mxPoint x=&quot;255&quot; y=&quot;-320&quot; as=&quot;sourcePoint&quot; /&gt;&#10;            &lt;mxPoint x=&quot;675&quot; y=&quot;-320&quot; as=&quot;targetPoint&quot; /&gt;&#10;          &lt;/mxGeometry&gt;&#10;        &lt;/mxCell&gt;&#10;        &lt;mxCell id=&quot;3oscUyqNs-xWXIR_WFqv-27&quot; value=&quot;Feature Branch&amp;lt;div&amp;gt;&amp;amp;nbsp;für Issue &amp;lt;b&amp;gt;#c&amp;lt;/b&amp;gt;&amp;lt;/div&amp;gt;&amp;lt;div&amp;gt;(baut auf Issue &amp;lt;b&amp;gt;#a&amp;lt;/b&amp;gt; auf)&amp;lt;/div&amp;gt;&quot; style=&quot;rounded=1;whiteSpace=wrap;html=1;&quot; vertex=&quot;1&quot; parent=&quot;3oscUyqNs-xWXIR_WFqv-1&quot;&gt;&#10;          &lt;mxGeometry x=&quot;615&quot; y=&quot;-310&quot; width=&quot;120&quot; height=&quot;70&quot; as=&quot;geometry&quot; /&gt;&#10;        &lt;/mxCell&gt;&#10;        &lt;mxCell id=&quot;3oscUyqNs-xWXIR_WFqv-28&quot; value=&quot;Merge Feature &amp;lt;b&amp;gt;#c&amp;lt;/b&amp;gt; in Develop&quot; style=&quot;endArrow=classic;html=1;rounded=0;&quot; edge=&quot;1&quot; parent=&quot;3oscUyqNs-xWXIR_WFqv-1&quot;&gt;&#10;          &lt;mxGeometry x=&quot;0.4286&quot; width=&quot;50&quot; height=&quot;50&quot; relative=&quot;1&quot; as=&quot;geometry&quot;&gt;&#10;            &lt;mxPoint x=&quot;675&quot; y=&quot;-500&quot; as=&quot;sourcePoint&quot; /&gt;&#10;            &lt;mxPoint x=&quot;255&quot; y=&quot;-500&quot; as=&quot;targetPoint&quot; /&gt;&#10;            &lt;mxPoint as=&quot;offset&quot; /&gt;&#10;          &lt;/mxGeometry&gt;&#10;        &lt;/mxCell&gt;&#10;        &lt;mxCell id=&quot;3oscUyqNs-xWXIR_WFqv-29&quot; value=&quot;&quot; style=&quot;shape=flexArrow;endArrow=classic;html=1;rounded=0;endSize=9;startSize=30;fillColor=#1ba1e2;strokeColor=#006EAF;&quot; edge=&quot;1&quot; parent=&quot;3oscUyqNs-xWXIR_WFqv-1&quot;&gt;&#10;          &lt;mxGeometry width=&quot;50&quot; height=&quot;50&quot; relative=&quot;1&quot; as=&quot;geometry&quot;&gt;&#10;            &lt;mxPoint x=&quot;675&quot; y=&quot;-320&quot; as=&quot;sourcePoint&quot; /&gt;&#10;            &lt;mxPoint x=&quot;675&quot; y=&quot;-730&quot; as=&quot;targetPoint&quot; /&gt;&#10;          &lt;/mxGeometry&gt;&#10;        &lt;/mxCell&gt;&#10;        &lt;mxCell id=&quot;3oscUyqNs-xWXIR_WFqv-30&quot; value=&quot;Merge Feature &amp;lt;b&amp;gt;#c&amp;lt;/b&amp;gt; in Develop&quot; style=&quot;endArrow=classic;html=1;rounded=0;&quot; edge=&quot;1&quot; parent=&quot;3oscUyqNs-xWXIR_WFqv-1&quot;&gt;&#10;          &lt;mxGeometry x=&quot;0.6774&quot; width=&quot;50&quot; height=&quot;50&quot; relative=&quot;1&quot; as=&quot;geometry&quot;&gt;&#10;            &lt;mxPoint x=&quot;675&quot; y=&quot;-730&quot; as=&quot;sourcePoint&quot; /&gt;&#10;            &lt;mxPoint x=&quot;55&quot; y=&quot;-730&quot; as=&quot;targetPoint&quot; /&gt;&#10;            &lt;mxPoint as=&quot;offset&quot; /&gt;&#10;          &lt;/mxGeometry&gt;&#10;        &lt;/mxCell&gt;&#10;        &lt;mxCell id=&quot;3oscUyqNs-xWXIR_WFqv-31&quot; value=&quot;Testphase&amp;lt;div&amp;gt;für Issue &amp;lt;b&amp;gt;#c&amp;lt;/b&amp;gt;&amp;lt;/div&amp;gt;&quot; style=&quot;shape=flexArrow;endArrow=classic;startArrow=classic;html=1;rounded=0;fillColor=#f0a30a;strokeColor=#BD7000;&quot; edge=&quot;1&quot; parent=&quot;3oscUyqNs-xWXIR_WFqv-1&quot;&gt;&#10;          &lt;mxGeometry x=&quot;0.3913&quot; width=&quot;100&quot; height=&quot;100&quot; relative=&quot;1&quot; as=&quot;geometry&quot;&gt;&#10;            &lt;mxPoint x=&quot;625&quot; y=&quot;-500&quot; as=&quot;sourcePoint&quot; /&gt;&#10;            &lt;mxPoint x=&quot;625&quot; y=&quot;-730&quot; as=&quot;targetPoint&quot; /&gt;&#10;            &lt;mxPoint as=&quot;offset&quot; /&gt;&#10;          &lt;/mxGeometry&gt;&#10;        &lt;/mxCell&gt;&#10;        &lt;mxCell id=&quot;3oscUyqNs-xWXIR_WFqv-32&quot; value=&quot;&quot; style=&quot;endArrow=classic;html=1;rounded=0;&quot; edge=&quot;1&quot; parent=&quot;3oscUyqNs-xWXIR_WFqv-1&quot;&gt;&#10;          &lt;mxGeometry width=&quot;50&quot; height=&quot;50&quot; relative=&quot;1&quot; as=&quot;geometry&quot;&gt;&#10;            &lt;mxPoint x=&quot;55&quot; y=&quot;-440&quot; as=&quot;sourcePoint&quot; /&gt;&#10;            &lt;mxPoint x=&quot;795&quot; y=&quot;-440&quot; as=&quot;targetPoint&quot; /&gt;&#10;          &lt;/mxGeometry&gt;&#10;        &lt;/mxCell&gt;&#10;        &lt;mxCell id=&quot;3oscUyqNs-xWXIR_WFqv-33&quot; value=&quot;&quot; style=&quot;shape=flexArrow;endArrow=classic;html=1;rounded=0;endSize=9;startSize=30;fillColor=#1ba1e2;strokeColor=#006EAF;&quot; edge=&quot;1&quot; parent=&quot;3oscUyqNs-xWXIR_WFqv-1&quot;&gt;&#10;          &lt;mxGeometry width=&quot;50&quot; height=&quot;50&quot; relative=&quot;1&quot; as=&quot;geometry&quot;&gt;&#10;            &lt;mxPoint x=&quot;795&quot; y=&quot;-440&quot; as=&quot;sourcePoint&quot; /&gt;&#10;            &lt;mxPoint x=&quot;795&quot; y=&quot;-850&quot; as=&quot;targetPoint&quot; /&gt;&#10;          &lt;/mxGeometry&gt;&#10;        &lt;/mxCell&gt;&#10;        &lt;mxCell id=&quot;3oscUyqNs-xWXIR_WFqv-34&quot; value=&quot;Feature Branch&amp;lt;div&amp;gt;&amp;amp;nbsp;für Issue &amp;lt;b&amp;gt;#d&amp;lt;/b&amp;gt;&amp;lt;/div&amp;gt;&quot; style=&quot;rounded=1;whiteSpace=wrap;html=1;&quot; vertex=&quot;1&quot; parent=&quot;3oscUyqNs-xWXIR_WFqv-1&quot;&gt;&#10;          &lt;mxGeometry x=&quot;740&quot; y=&quot;-430&quot; width=&quot;120&quot; height=&quot;40&quot; as=&quot;geometry&quot; /&gt;&#10;        &lt;/mxCell&gt;&#10;        &lt;mxCell id=&quot;3oscUyqNs-xWXIR_WFqv-35&quot; value=&quot;Versionsabschluss&amp;lt;div&amp;gt;0.1.2&amp;lt;/div&amp;gt;&quot; style=&quot;rounded=1;whiteSpace=wrap;html=1;&quot; vertex=&quot;1&quot; parent=&quot;3oscUyqNs-xWXIR_WFqv-1&quot;&gt;&#10;          &lt;mxGeometry x=&quot;265&quot; y=&quot;-699&quot; width=&quot;120&quot; height=&quot;60&quot; as=&quot;geometry&quot; /&gt;&#10;        &lt;/mxCell&gt;&#10;        &lt;mxCell id=&quot;3oscUyqNs-xWXIR_WFqv-36&quot; value=&quot;Merge Feature &amp;lt;b&amp;gt;#d&amp;lt;/b&amp;gt;&amp;amp;nbsp;in Develop&quot; style=&quot;endArrow=classic;html=1;rounded=0;&quot; edge=&quot;1&quot; parent=&quot;3oscUyqNs-xWXIR_WFqv-1&quot;&gt;&#10;          &lt;mxGeometry x=&quot;0.5926&quot; width=&quot;50&quot; height=&quot;50&quot; relative=&quot;1&quot; as=&quot;geometry&quot;&gt;&#10;            &lt;mxPoint x=&quot;795&quot; y=&quot;-620&quot; as=&quot;sourcePoint&quot; /&gt;&#10;            &lt;mxPoint x=&quot;255&quot; y=&quot;-620&quot; as=&quot;targetPoint&quot; /&gt;&#10;            &lt;mxPoint as=&quot;offset&quot; /&gt;&#10;          &lt;/mxGeometry&gt;&#10;        &lt;/mxCell&gt;&#10;        &lt;mxCell id=&quot;3oscUyqNs-xWXIR_WFqv-37&quot; value=&quot;Merge Feature &amp;lt;b&amp;gt;#d&amp;lt;/b&amp;gt; in Develop&quot; style=&quot;endArrow=classic;html=1;rounded=0;&quot; edge=&quot;1&quot; parent=&quot;3oscUyqNs-xWXIR_WFqv-1&quot;&gt;&#10;          &lt;mxGeometry x=&quot;0.7297&quot; width=&quot;50&quot; height=&quot;50&quot; relative=&quot;1&quot; as=&quot;geometry&quot;&gt;&#10;            &lt;mxPoint x=&quot;795&quot; y=&quot;-848&quot; as=&quot;sourcePoint&quot; /&gt;&#10;            &lt;mxPoint x=&quot;55&quot; y=&quot;-848&quot; as=&quot;targetPoint&quot; /&gt;&#10;            &lt;mxPoint as=&quot;offset&quot; /&gt;&#10;          &lt;/mxGeometry&gt;&#10;        &lt;/mxCell&gt;&#10;        &lt;mxCell id=&quot;3oscUyqNs-xWXIR_WFqv-38&quot; value=&quot;Testphase&amp;lt;div&amp;gt;für Issue &amp;lt;b&amp;gt;#d&amp;lt;/b&amp;gt;&amp;lt;/div&amp;gt;&quot; style=&quot;shape=flexArrow;endArrow=classic;startArrow=classic;html=1;rounded=0;fillColor=#f0a30a;strokeColor=#BD7000;&quot; edge=&quot;1&quot; parent=&quot;3oscUyqNs-xWXIR_WFqv-1&quot;&gt;&#10;          &lt;mxGeometry x=&quot;0.3913&quot; width=&quot;100&quot; height=&quot;100&quot; relative=&quot;1&quot; as=&quot;geometry&quot;&gt;&#10;            &lt;mxPoint x=&quot;735&quot; y=&quot;-620&quot; as=&quot;sourcePoint&quot; /&gt;&#10;            &lt;mxPoint x=&quot;735&quot; y=&quot;-850&quot; as=&quot;targetPoint&quot; /&gt;&#10;            &lt;mxPoint as=&quot;offset&quot; /&gt;&#10;          &lt;/mxGeometry&gt;&#10;        &lt;/mxCell&gt;&#10;        &lt;mxCell id=&quot;3oscUyqNs-xWXIR_WFqv-39&quot; value=&quot;Master&quot; style=&quot;rounded=1;whiteSpace=wrap;html=1;fontStyle=1&quot; vertex=&quot;1&quot; parent=&quot;3oscUyqNs-xWXIR_WFqv-1&quot;&gt;&#10;          &lt;mxGeometry x=&quot;10&quot; y=&quot;-1160&quot; width=&quot;90&quot; height=&quot;40&quot; as=&quot;geometry&quot; /&gt;&#10;        &lt;/mxCell&gt;&#10;        &lt;mxCell id=&quot;3oscUyqNs-xWXIR_WFqv-40&quot; value=&quot;Develop&quot; style=&quot;rounded=1;whiteSpace=wrap;html=1;fontStyle=1&quot; vertex=&quot;1&quot; parent=&quot;3oscUyqNs-xWXIR_WFqv-1&quot;&gt;&#10;          &lt;mxGeometry x=&quot;210&quot; y=&quot;-1160&quot; width=&quot;90&quot; height=&quot;40&quot; as=&quot;geometry&quot; /&gt;&#10;        &lt;/mxCell&gt;&#10;        &lt;mxCell id=&quot;3oscUyqNs-xWXIR_WFqv-41&quot; value=&quot;Versionsabschluss&amp;lt;div&amp;gt;0.2.0&amp;lt;/div&amp;gt;&quot; style=&quot;rounded=1;whiteSpace=wrap;html=1;&quot; vertex=&quot;1&quot; parent=&quot;3oscUyqNs-xWXIR_WFqv-1&quot;&gt;&#10;          &lt;mxGeometry x=&quot;90&quot; y=&quot;-1040&quot; width=&quot;120&quot; height=&quot;60&quot; as=&quot;geometry&quot; /&gt;&#10;        &lt;/mxCell&gt;&#10;        &lt;mxCell id=&quot;3oscUyqNs-xWXIR_WFqv-49&quot; value=&quot;&quot; style=&quot;shape=flexArrow;endArrow=classic;html=1;rounded=0;endSize=9;startSize=30;fillColor=#60a917;strokeColor=#2D7600;entryX=0.5;entryY=1;entryDx=0;entryDy=0;&quot; edge=&quot;1&quot; parent=&quot;3oscUyqNs-xWXIR_WFqv-1&quot; target=&quot;3oscUyqNs-xWXIR_WFqv-40&quot;&gt;&#10;          &lt;mxGeometry width=&quot;50&quot; height=&quot;50&quot; relative=&quot;1&quot; as=&quot;geometry&quot;&gt;&#10;            &lt;mxPoint x=&quot;255&quot; y=&quot;80&quot; as=&quot;sourcePoint&quot; /&gt;&#10;            &lt;mxPoint x=&quot;255&quot; y=&quot;-1110&quot; as=&quot;targetPoint&quot; /&gt;&#10;          &lt;/mxGeometry&gt;&#10;        &lt;/mxCell&gt;&#10;      &lt;/root&gt;&#10;    &lt;/mxGraphModel&gt;&#10;  &lt;/diagram&gt;&#10;&lt;/mxfile&gt;&#10;" style="background-color: rgb(255, 255, 255);"><defs/><rect fill="#ffffff" width="100%" height="100%" x="0" y="0"/><g><g><path d="M 50 1239.5 L 40 1239.5 L 40 68.5 L 29.5 68.5 L 45 40.5 L 60.5 68.5 L 50 68.5 Z" fill="#008a00" stroke="#005700" stroke-miterlimit="10" pointer-events="all"/></g><g><rect x="0" y="1250" width="90" height="40" rx="6" ry="6" fill="rgb(255, 255, 255)" stroke="rgb(0, 0, 0)" pointer-events="all"/></g><g><g transform="translate(-0.5 -0.5)"><switch><foreignObject pointer-events="none" width="100%" height="100%" requiredFeatures="http://www.w3.org/TR/SVG11/feature#Extensibility" style="overflow: visible; text-align: left;"><div xmlns="http://www.w3.org/1999/xhtml" style="display: flex; align-items: unsafe center; justify-content: unsafe center; width: 88px; height: 1px; padding-top: 1270px; margin-left: 1px;"><div data-drawio-colors="color: rgb(0, 0, 0); " style="box-sizing: border-box; font-size: 0px; text-align: center;"><div style="display: inline-block; font-size: 12px; font-family: Helvetica; color: rgb(0, 0, 0); line-height: 1.2; pointer-events: all; font-weight: bold; white-space: normal; overflow-wrap: normal;">Master</div></div></div></foreignObject><text x="45" y="1274" fill="rgb(0, 0, 0)" font-family="Helvetica" font-size="12px" text-anchor="middle" font-weight="bold">Master</text></switch></g></g><g><rect x="205" y="1250" width="90" height="40" rx="6" ry="6" fill="rgb(255, 255, 255)" stroke="rgb(0, 0, 0)" pointer-events="all"/></g><g><g transform="translate(-0.5 -0.5)"><switch><foreignObject pointer-events="none" width="100%" height="100%" requiredFeatures="http://www.w3.org/TR/SVG11/feature#Extensibility" style="overflow: visible; text-align: left;"><div xmlns="http://www.w3.org/1999/xhtml" style="display: flex; align-items: unsafe center; justify-content: unsafe center; width: 88px; height: 1px; padding-top: 1270px; margin-left: 206px;"><div data-drawio-colors="color: rgb(0, 0, 0); " style="box-sizing: border-box; font-size: 0px; text-align: center;"><div style="display: inline-block; font-size: 12px; font-family: Helvetica; color: rgb(0, 0, 0); line-height: 1.2; pointer-events: all; font-weight: bold; white-space: normal; overflow-wrap: normal;">Develop</div></div></div></foreignObject><text x="250" y="1274" fill="rgb(0, 0, 0)" font-family="Helvetica" font-size="12px" text-anchor="middle" font-weight="bold">Develop</text></switch></g></g><g><rect x="255" y="882" width="120" height="60" rx="9" ry="9" fill="rgb(255, 255, 255)" stroke="rgb(0, 0, 0)" pointer-events="all"/></g><g><g transform="translate(-0.5 -0.5)"><switch><foreignObject pointer-events="none" width="100%" height="100%" requiredFeatures="http://www.w3.org/TR/SVG11/feature#Extensibility" style="overflow: visible; text-align: left;"><div xmlns="http://www.w3.org/1999/xhtml" style="display: flex; align-items: unsafe center; justify-content: unsafe center; width: 118px; height: 1px; padding-top: 912px; margin-left: 256px;"><div data-drawio-colors="color: rgb(0, 0, 0); " style="box-sizing: border-box; font-size: 0px; text-align: center;"><div style="display: inline-block; font-size: 12px; font-family: Helvetica; color: rgb(0, 0, 0); line-height: 1.2; pointer-events: all; white-space: normal; overflow-wrap: normal;">Versionsabschluss<div>0.1.1</div></div></div></div></foreignObject><text x="315" y="916" fill="rgb(0, 0, 0)" font-family="Helvetica" font-size="12px" text-anchor="middle">Versionsabschluss...</text></switch></g></g><g><path d="M 45 1200 L 478.63 1200" fill="none" stroke="rgb(0, 0, 0)" stroke-miterlimit="10" pointer-events="stroke"/><path d="M 483.88 1200 L 476.88 1203.5 L 478.63 1200 L 476.88 1196.5 Z" fill="rgb(0, 0, 0)" stroke="rgb(0, 0, 0)" stroke-miterlimit="10" pointer-events="all"/></g><g><rect x="425" y="1210" width="120" height="40" rx="6" ry="6" fill="rgb(255, 255, 255)" stroke="rgb(0, 0, 0)" pointer-events="all"/></g><g><g transform="translate(-0.5 -0.5)"><switch><foreignObject pointer-events="none" width="100%" height="100%" requiredFeatures="http://www.w3.org/TR/SVG11/feature#Extensibility" style="overflow: visible; text-align: left;"><div xmlns="http://www.w3.org/1999/xhtml" style="display: flex; align-items: unsafe center; justify-content: unsafe center; width: 118px; height: 1px; padding-top: 1230px; margin-left: 426px;"><div data-drawio-colors="color: rgb(0, 0, 0); " style="box-sizing: border-box; font-size: 0px; text-align: center;"><div style="display: inline-block; font-size: 12px; font-family: Helvetica; color: rgb(0, 0, 0); line-height: 1.2; pointer-events: all; white-space: normal; overflow-wrap: normal;">Feature Branch<div> für Issue <b>#a</b></div></div></div></div></foreignObject><text x="485" y="1234" fill="rgb(0, 0, 0)" font-family="Helvetica" font-size="12px" text-anchor="middle">Feature Branch...</text></switch></g></g><g><path d="M 486 1040 L 252.37 1040" fill="none" stroke="rgb(0, 0, 0)" stroke-miterlimit="10" pointer-events="stroke"/><path d="M 247.12 1040 L 254.12 1036.5 L 252.37 1040 L 254.12 1043.5 Z" fill="rgb(0, 0, 0)" stroke="rgb(0, 0, 0)" stroke-miterlimit="10" pointer-events="all"/></g><g><g transform="translate(-0.5 -0.5)"><switch><foreignObject pointer-events="none" width="100%" height="100%" requiredFeatures="http://www.w3.org/TR/SVG11/feature#Extensibility" style="overflow: visible; text-align: left;"><div xmlns="http://www.w3.org/1999/xhtml" style="display: flex; align-items: unsafe center; justify-content: unsafe center; width: 1px; height: 1px; padding-top: 1040px; margin-left: 345px;"><div data-drawio-colors="color: rgb(0, 0, 0); background-color: rgb(255, 255, 255); " style="box-sizing: border-box; font-size: 0px; text-align: center;"><div style="display: inline-block; font-size: 11px; font-family: Helvetica; color: rgb(0, 0, 0); line-height: 1.2; pointer-events: all; background-color: rgb(255, 255, 255); white-space: nowrap;">Merge Feature <b>#a</b> in Develop</div></div></div></foreignObject><text x="345" y="1043" fill="rgb(0, 0, 0)" font-family="Helvetica" font-size="11px" text-anchor="middle">Merge Feat...</text></switch></g></g><g><path d="M 45 1120 L 558.63 1120" fill="none" stroke="rgb(0, 0, 0)" stroke-miterlimit="10" pointer-events="stroke"/><path d="M 563.88 1120 L 556.88 1123.5 L 558.63 1120 L 556.88 1116.5 Z" fill="rgb(0, 0, 0)" stroke="rgb(0, 0, 0)" stroke-miterlimit="10" pointer-events="all"/></g><g><rect x="515" y="1140" width="120" height="40" rx="6" ry="6" fill="rgb(255, 255, 255)" stroke="rgb(0, 0, 0)" pointer-events="all"/></g><g><g transform="translate(-0.5 -0.5)"><switch><foreignObject pointer-events="none" width="100%" height="100%" requiredFeatures="http://www.w3.org/TR/SVG11/feature#Extensibility" style="overflow: visible; text-align: left;"><div xmlns="http://www.w3.org/1999/xhtml" style="display: flex; align-items: unsafe center; justify-content: unsafe center; width: 118px; height: 1px; padding-top: 1160px; margin-left: 516px;"><div data-drawio-colors="color: rgb(0, 0, 0); " style="box-sizing: border-box; font-size: 0px; text-align: center;"><div style="display: inline-block; font-size: 12px; font-family: Helvetica; color: rgb(0, 0, 0); line-height: 1.2; pointer-events: all; white-space: normal; overflow-wrap: normal;">Feature Branch<div> für Issue <b>#b</b></div></div></div></div></foreignObject><text x="575" y="1164" fill="rgb(0, 0, 0)" font-family="Helvetica" font-size="12px" text-anchor="middle">Feature Branch...</text></switch></g></g><g><path d="M 565 1081 L 251.37 1081" fill="none" stroke="rgb(0, 0, 0)" stroke-miterlimit="10" pointer-events="stroke"/><path d="M 246.12 1081 L 253.12 1077.5 L 251.37 1081 L 253.12 1084.5 Z" fill="rgb(0, 0, 0)" stroke="rgb(0, 0, 0)" stroke-miterlimit="10" pointer-events="all"/></g><g><g transform="translate(-0.5 -0.5)"><switch><foreignObject pointer-events="none" width="100%" height="100%" requiredFeatures="http://www.w3.org/TR/SVG11/feature#Extensibility" style="overflow: visible; text-align: left;"><div xmlns="http://www.w3.org/1999/xhtml" style="display: flex; align-items: unsafe center; justify-content: unsafe center; width: 1px; height: 1px; padding-top: 1083px; margin-left: 347px;"><div data-drawio-colors="color: rgb(0, 0, 0); background-color: rgb(255, 255, 255); " style="box-sizing: border-box; font-size: 0px; text-align: center;"><div style="display: inline-block; font-size: 11px; font-family: Helvetica; color: rgb(0, 0, 0); line-height: 1.2; pointer-events: all; background-color: rgb(255, 255, 255); white-space: nowrap;">Merge Feature <b>#b</b> in Develop</div></div></div></foreignObject><text x="347" y="1086" fill="rgb(0, 0, 0)" font-family="Helvetica" font-size="11px" text-anchor="middle">Merge Feature #b in Develop</text></switch></g></g><g><path d="M 565 866 L 51.37 866" fill="none" stroke="rgb(0, 0, 0)" stroke-miterlimit="10" pointer-events="stroke"/><path d="M 46.12 866 L 53.12 862.5 L 51.37 866 L 53.12 869.5 Z" fill="rgb(0, 0, 0)" stroke="rgb(0, 0, 0)" stroke-miterlimit="10" pointer-events="all"/></g><g><g transform="translate(-0.5 -0.5)"><switch><foreignObject pointer-events="none" width="100%" height="100%" requiredFeatures="http://www.w3.org/TR/SVG11/feature#Extensibility" style="overflow: visible; text-align: left;"><div xmlns="http://www.w3.org/1999/xhtml" style="display: flex; align-items: unsafe center; justify-content: unsafe center; width: 1px; height: 1px; padding-top: 868px; margin-left: 146px;"><div data-drawio-colors="color: rgb(0, 0, 0); background-color: rgb(255, 255, 255); " style="box-sizing: border-box; font-size: 0px; text-align: center;"><div style="display: inline-block; font-size: 11px; font-family: Helvetica; color: rgb(0, 0, 0); line-height: 1.2; pointer-events: all; background-color: rgb(255, 255, 255); white-space: nowrap;">Merge Feature b in Master</div></div></div></foreignObject><text x="146" y="871" fill="rgb(0, 0, 0)" font-family="Helvetica" font-size="11px" text-anchor="middle">Merge Feature b in Master</text></switch></g></g><g><path d="M 525.46 1060.62 L 535.96 1060.87 L 520.01 1079.5 L 504.97 1060.14 L 515.47 1060.39 L 519.54 889.38 L 509.04 889.13 L 524.99 870.5 L 540.03 889.86 L 529.53 889.61 Z" fill="#f0a30a" stroke="#bd7000" stroke-miterlimit="10" pointer-events="all"/></g><g><g transform="translate(-0.5 -0.5)"><switch><foreignObject pointer-events="none" width="100%" height="100%" requiredFeatures="http://www.w3.org/TR/SVG11/feature#Extensibility" style="overflow: visible; text-align: left;"><div xmlns="http://www.w3.org/1999/xhtml" style="display: flex; align-items: unsafe center; justify-content: unsafe center; width: 1px; height: 1px; padding-top: 975px; margin-left: 522px;"><div data-drawio-colors="color: rgb(0, 0, 0); background-color: rgb(255, 255, 255); " style="box-sizing: border-box; font-size: 0px; text-align: center;"><div style="display: inline-block; font-size: 11px; font-family: Helvetica; color: rgb(0, 0, 0); line-height: 1.2; pointer-events: all; background-color: rgb(255, 255, 255); white-space: nowrap;">Testphase<div>für Issue <b>#b</b></div></div></div></div></foreignObject><text x="522" y="978" fill="rgb(0, 0, 0)" font-family="Helvetica" font-size="11px" text-anchor="middle">Testphase...</text></switch></g></g><g><path d="M 490 1199.5 L 480 1199.5 L 480 818.5 L 469.5 818.5 L 485 790.5 L 500.5 818.5 L 490 818.5 Z" fill="#1ba1e2" stroke="#006eaf" stroke-miterlimit="10" pointer-events="all"/></g><g><path d="M 440 1020.5 L 450.5 1020.5 L 435 1039.5 L 419.5 1020.5 L 430 1020.5 L 430 809.5 L 419.5 809.5 L 435 790.5 L 450.5 809.5 L 440 809.5 Z" fill="#f0a30a" stroke="#bd7000" stroke-miterlimit="10" pointer-events="all"/></g><g><g transform="translate(-0.5 -0.5)"><switch><foreignObject pointer-events="none" width="100%" height="100%" requiredFeatures="http://www.w3.org/TR/SVG11/feature#Extensibility" style="overflow: visible; text-align: left;"><div xmlns="http://www.w3.org/1999/xhtml" style="display: flex; align-items: unsafe center; justify-content: unsafe center; width: 1px; height: 1px; padding-top: 915px; margin-left: 435px;"><div data-drawio-colors="color: rgb(0, 0, 0); background-color: rgb(255, 255, 255); " style="box-sizing: border-box; font-size: 0px; text-align: center;"><div style="display: inline-block; font-size: 11px; font-family: Helvetica; color: rgb(0, 0, 0); line-height: 1.2; pointer-events: all; background-color: rgb(255, 255, 255); white-space: nowrap;">Testphase<div>für Issue <b>#a</b></div></div></div></div></foreignObject><text x="435" y="918" fill="rgb(0, 0, 0)" font-family="Helvetica" font-size="11px" text-anchor="middle">Testphase...</text></switch></g></g><g><path d="M 485 790 L 51.37 790" fill="none" stroke="rgb(0, 0, 0)" stroke-miterlimit="10" pointer-events="stroke"/><path d="M 46.12 790 L 53.12 786.5 L 51.37 790 L 53.12 793.5 Z" fill="rgb(0, 0, 0)" stroke="rgb(0, 0, 0)" stroke-miterlimit="10" pointer-events="all"/></g><g><g transform="translate(-0.5 -0.5)"><switch><foreignObject pointer-events="none" width="100%" height="100%" requiredFeatures="http://www.w3.org/TR/SVG11/feature#Extensibility" style="overflow: visible; text-align: left;"><div xmlns="http://www.w3.org/1999/xhtml" style="display: flex; align-items: unsafe center; justify-content: unsafe center; width: 1px; height: 1px; padding-top: 791px; margin-left: 146px;"><div data-drawio-colors="color: rgb(0, 0, 0); background-color: rgb(255, 255, 255); " style="box-sizing: border-box; font-size: 0px; text-align: center;"><div style="display: inline-block; font-size: 11px; font-family: Helvetica; color: rgb(0, 0, 0); line-height: 1.2; pointer-events: all; background-color: rgb(255, 255, 255); white-space: nowrap;">Merge Feature a in Master</div></div></div></foreignObject><text x="146" y="794" fill="rgb(0, 0, 0)" font-family="Helvetica" font-size="11px" text-anchor="middle">Merge Feature a in Master</text></switch></g></g><g><path d="M 570 1119.5 L 560 1119.5 L 560 888.5 L 549.5 888.5 L 565 860.5 L 580.5 888.5 L 570 888.5 Z" fill="#1ba1e2" stroke="#006eaf" stroke-miterlimit="10" pointer-events="all"/></g><g><path d="M 245 840 L 658.63 840" fill="none" stroke="rgb(0, 0, 0)" stroke-miterlimit="10" pointer-events="stroke"/><path d="M 663.88 840 L 656.88 843.5 L 658.63 840 L 656.88 836.5 Z" fill="rgb(0, 0, 0)" stroke="rgb(0, 0, 0)" stroke-miterlimit="10" pointer-events="all"/></g><g><rect x="605" y="850" width="120" height="70" rx="10.5" ry="10.5" fill="rgb(255, 255, 255)" stroke="rgb(0, 0, 0)" pointer-events="all"/></g><g><g transform="translate(-0.5 -0.5)"><switch><foreignObject pointer-events="none" width="100%" height="100%" requiredFeatures="http://www.w3.org/TR/SVG11/feature#Extensibility" style="overflow: visible; text-align: left;"><div xmlns="http://www.w3.org/1999/xhtml" style="display: flex; align-items: unsafe center; justify-content: unsafe center; width: 118px; height: 1px; padding-top: 885px; margin-left: 606px;"><div data-drawio-colors="color: rgb(0, 0, 0); " style="box-sizing: border-box; font-size: 0px; text-align: center;"><div style="display: inline-block; font-size: 12px; font-family: Helvetica; color: rgb(0, 0, 0); line-height: 1.2; pointer-events: all; white-space: normal; overflow-wrap: normal;">Feature Branch<div> für Issue <b>#c</b></div><div>(baut auf Issue <b>#a</b> auf)</div></div></div></div></foreignObject><text x="665" y="889" fill="rgb(0, 0, 0)" font-family="Helvetica" font-size="12px" text-anchor="middle">Feature Branch...</text></switch></g></g><g><path d="M 665 660 L 251.37 660" fill="none" stroke="rgb(0, 0, 0)" stroke-miterlimit="10" pointer-events="stroke"/><path d="M 246.12 660 L 253.12 656.5 L 251.37 660 L 253.12 663.5 Z" fill="rgb(0, 0, 0)" stroke="rgb(0, 0, 0)" stroke-miterlimit="10" pointer-events="all"/></g><g><g transform="translate(-0.5 -0.5)"><switch><foreignObject pointer-events="none" width="100%" height="100%" requiredFeatures="http://www.w3.org/TR/SVG11/feature#Extensibility" style="overflow: visible; text-align: left;"><div xmlns="http://www.w3.org/1999/xhtml" style="display: flex; align-items: unsafe center; justify-content: unsafe center; width: 1px; height: 1px; padding-top: 660px; margin-left: 365px;"><div data-drawio-colors="color: rgb(0, 0, 0); background-color: rgb(255, 255, 255); " style="box-sizing: border-box; font-size: 0px; text-align: center;"><div style="display: inline-block; font-size: 11px; font-family: Helvetica; color: rgb(0, 0, 0); line-height: 1.2; pointer-events: all; background-color: rgb(255, 255, 255); white-space: nowrap;">Merge Feature <b>#c</b> in Develop</div></div></div></foreignObject><text x="365" y="663" fill="rgb(0, 0, 0)" font-family="Helvetica" font-size="11px" text-anchor="middle">Merge Feat...</text></switch></g></g><g><path d="M 670 839.5 L 660 839.5 L 660 458.5 L 649.5 458.5 L 665 430.5 L 680.5 458.5 L 670 458.5 Z" fill="#1ba1e2" stroke="#006eaf" stroke-miterlimit="10" pointer-events="all"/></g><g><path d="M 665 430 L 51.37 430" fill="none" stroke="rgb(0, 0, 0)" stroke-miterlimit="10" pointer-events="stroke"/><path d="M 46.12 430 L 53.12 426.5 L 51.37 430 L 53.12 433.5 Z" fill="rgb(0, 0, 0)" stroke="rgb(0, 0, 0)" stroke-miterlimit="10" pointer-events="all"/></g><g><g transform="translate(-0.5 -0.5)"><switch><foreignObject pointer-events="none" width="100%" height="100%" requiredFeatures="http://www.w3.org/TR/SVG11/feature#Extensibility" style="overflow: visible; text-align: left;"><div xmlns="http://www.w3.org/1999/xhtml" style="display: flex; align-items: unsafe center; justify-content: unsafe center; width: 1px; height: 1px; padding-top: 430px; margin-left: 145px;"><div data-drawio-colors="color: rgb(0, 0, 0); background-color: rgb(255, 255, 255); " style="box-sizing: border-box; font-size: 0px; text-align: center;"><div style="display: inline-block; font-size: 11px; font-family: Helvetica; color: rgb(0, 0, 0); line-height: 1.2; pointer-events: all; background-color: rgb(255, 255, 255); white-space: nowrap;">Merge Feature <b>#c</b> in Develop</div></div></div></foreignObject><text x="145" y="433" fill="rgb(0, 0, 0)" font-family="Helvetica" font-size="11px" text-anchor="middle">Merge Feat...</text></switch></g></g><g><path d="M 620 640.5 L 630.5 640.5 L 615 659.5 L 599.5 640.5 L 610 640.5 L 610 449.5 L 599.5 449.5 L 615 430.5 L 630.5 449.5 L 620 449.5 Z" fill="#f0a30a" stroke="#bd7000" stroke-miterlimit="10" pointer-events="all"/></g><g><g transform="translate(-0.5 -0.5)"><switch><foreignObject pointer-events="none" width="100%" height="100%" requiredFeatures="http://www.w3.org/TR/SVG11/feature#Extensibility" style="overflow: visible; text-align: left;"><div xmlns="http://www.w3.org/1999/xhtml" style="display: flex; align-items: unsafe center; justify-content: unsafe center; width: 1px; height: 1px; padding-top: 500px; margin-left: 615px;"><div data-drawio-colors="color: rgb(0, 0, 0); background-color: rgb(255, 255, 255); " style="box-sizing: border-box; font-size: 0px; text-align: center;"><div style="display: inline-block; font-size: 11px; font-family: Helvetica; color: rgb(0, 0, 0); line-height: 1.2; pointer-events: all; background-color: rgb(255, 255, 255); white-space: nowrap;">Testphase<div>für Issue <b>#c</b></div></div></div></div></foreignObject><text x="615" y="503" fill="rgb(0, 0, 0)" font-family="Helvetica" font-size="11px" text-anchor="middle">Testphase...</text></switch></g></g><g><path d="M 45 720 L 778.63 720" fill="none" stroke="rgb(0, 0, 0)" stroke-miterlimit="10" pointer-events="stroke"/><path d="M 783.88 720 L 776.88 723.5 L 778.63 720 L 776.88 716.5 Z" fill="rgb(0, 0, 0)" stroke="rgb(0, 0, 0)" stroke-miterlimit="10" pointer-events="all"/></g><g><path d="M 790 719.5 L 780 719.5 L 780 338.5 L 769.5 338.5 L 785 310.5 L 800.5 338.5 L 790 338.5 Z" fill="#1ba1e2" stroke="#006eaf" stroke-miterlimit="10" pointer-events="all"/></g><g><rect x="730" y="730" width="120" height="40" rx="6" ry="6" fill="rgb(255, 255, 255)" stroke="rgb(0, 0, 0)" pointer-events="all"/></g><g><g transform="translate(-0.5 -0.5)"><switch><foreignObject pointer-events="none" width="100%" height="100%" requiredFeatures="http://www.w3.org/TR/SVG11/feature#Extensibility" style="overflow: visible; text-align: left;"><div xmlns="http://www.w3.org/1999/xhtml" style="display: flex; align-items: unsafe center; justify-content: unsafe center; width: 118px; height: 1px; padding-top: 750px; margin-left: 731px;"><div data-drawio-colors="color: rgb(0, 0, 0); " style="box-sizing: border-box; font-size: 0px; text-align: center;"><div style="display: inline-block; font-size: 12px; font-family: Helvetica; color: rgb(0, 0, 0); line-height: 1.2; pointer-events: all; white-space: normal; overflow-wrap: normal;">Feature Branch<div> für Issue <b>#d</b></div></div></div></div></foreignObject><text x="790" y="754" fill="rgb(0, 0, 0)" font-family="Helvetica" font-size="12px" text-anchor="middle">Feature Branch...</text></switch></g></g><g><rect x="255" y="461" width="120" height="60" rx="9" ry="9" fill="rgb(255, 255, 255)" stroke="rgb(0, 0, 0)" pointer-events="all"/></g><g><g transform="translate(-0.5 -0.5)"><switch><foreignObject pointer-events="none" width="100%" height="100%" requiredFeatures="http://www.w3.org/TR/SVG11/feature#Extensibility" style="overflow: visible; text-align: left;"><div xmlns="http://www.w3.org/1999/xhtml" style="display: flex; align-items: unsafe center; justify-content: unsafe center; width: 118px; height: 1px; padding-top: 491px; margin-left: 256px;"><div data-drawio-colors="color: rgb(0, 0, 0); " style="box-sizing: border-box; font-size: 0px; text-align: center;"><div style="display: inline-block; font-size: 12px; font-family: Helvetica; color: rgb(0, 0, 0); line-height: 1.2; pointer-events: all; white-space: normal; overflow-wrap: normal;">Versionsabschluss<div>0.1.2</div></div></div></div></foreignObject><text x="315" y="495" fill="rgb(0, 0, 0)" font-family="Helvetica" font-size="12px" text-anchor="middle">Versionsabschluss...</text></switch></g></g><g><path d="M 785 540 L 251.37 540" fill="none" stroke="rgb(0, 0, 0)" stroke-miterlimit="10" pointer-events="stroke"/><path d="M 246.12 540 L 253.12 536.5 L 251.37 540 L 253.12 543.5 Z" fill="rgb(0, 0, 0)" stroke="rgb(0, 0, 0)" stroke-miterlimit="10" pointer-events="all"/></g><g><g transform="translate(-0.5 -0.5)"><switch><foreignObject pointer-events="none" width="100%" height="100%" requiredFeatures="http://www.w3.org/TR/SVG11/feature#Extensibility" style="overflow: visible; text-align: left;"><div xmlns="http://www.w3.org/1999/xhtml" style="display: flex; align-items: unsafe center; justify-content: unsafe center; width: 1px; height: 1px; padding-top: 540px; margin-left: 355px;"><div data-drawio-colors="color: rgb(0, 0, 0); background-color: rgb(255, 255, 255); " style="box-sizing: border-box; font-size: 0px; text-align: center;"><div style="display: inline-block; font-size: 11px; font-family: Helvetica; color: rgb(0, 0, 0); line-height: 1.2; pointer-events: all; background-color: rgb(255, 255, 255); white-space: nowrap;">Merge Feature <b>#d</b> in Develop</div></div></div></foreignObject><text x="355" y="543" fill="rgb(0, 0, 0)" font-family="Helvetica" font-size="11px" text-anchor="middle">Merge Feat...</text></switch></g></g><g><path d="M 785 312 L 51.37 312" fill="none" stroke="rgb(0, 0, 0)" stroke-miterlimit="10" pointer-events="stroke"/><path d="M 46.12 312 L 53.12 308.5 L 51.37 312 L 53.12 315.5 Z" fill="rgb(0, 0, 0)" stroke="rgb(0, 0, 0)" stroke-miterlimit="10" pointer-events="all"/></g><g><g transform="translate(-0.5 -0.5)"><switch><foreignObject pointer-events="none" width="100%" height="100%" requiredFeatures="http://www.w3.org/TR/SVG11/feature#Extensibility" style="overflow: visible; text-align: left;"><div xmlns="http://www.w3.org/1999/xhtml" style="display: flex; align-items: unsafe center; justify-content: unsafe center; width: 1px; height: 1px; padding-top: 312px; margin-left: 145px;"><div data-drawio-colors="color: rgb(0, 0, 0); background-color: rgb(255, 255, 255); " style="box-sizing: border-box; font-size: 0px; text-align: center;"><div style="display: inline-block; font-size: 11px; font-family: Helvetica; color: rgb(0, 0, 0); line-height: 1.2; pointer-events: all; background-color: rgb(255, 255, 255); white-space: nowrap;">Merge Feature <b>#d</b> in Develop</div></div></div></foreignObject><text x="145" y="315" fill="rgb(0, 0, 0)" font-family="Helvetica" font-size="11px" text-anchor="middle">Merge Feat...</text></switch></g></g><g><path d="M 730 520.5 L 740.5 520.5 L 725 539.5 L 709.5 520.5 L 720 520.5 L 720 329.5 L 709.5 329.5 L 725 310.5 L 740.5 329.5 L 730 329.5 Z" fill="#f0a30a" stroke="#bd7000" stroke-miterlimit="10" pointer-events="all"/></g><g><g transform="translate(-0.5 -0.5)"><switch><foreignObject pointer-events="none" width="100%" height="100%" requiredFeatures="http://www.w3.org/TR/SVG11/feature#Extensibility" style="overflow: visible; text-align: left;"><div xmlns="http://www.w3.org/1999/xhtml" style="display: flex; align-items: unsafe center; justify-content: unsafe center; width: 1px; height: 1px; padding-top: 380px; margin-left: 725px;"><div data-drawio-colors="color: rgb(0, 0, 0); background-color: rgb(255, 255, 255); " style="box-sizing: border-box; font-size: 0px; text-align: center;"><div style="display: inline-block; font-size: 11px; font-family: Helvetica; color: rgb(0, 0, 0); line-height: 1.2; pointer-events: all; background-color: rgb(255, 255, 255); white-space: nowrap;">Testphase<div>für Issue <b>#d</b></div></div></div></div></foreignObject><text x="725" y="383" fill="rgb(0, 0, 0)" font-family="Helvetica" font-size="11px" text-anchor="middle">Testphase...</text></switch></g></g><g><rect x="0" y="0" width="90" height="40" rx="6" ry="6" fill="rgb(255, 255, 255)" stroke="rgb(0, 0, 0)" pointer-events="all"/></g><g><g transform="translate(-0.5 -0.5)"><switch><foreignObject pointer-events="none" width="100%" height="100%" requiredFeatures="http://www.w3.org/TR/SVG11/feature#Extensibility" style="overflow: visible; text-align: left;"><div xmlns="http://www.w3.org/1999/xhtml" style="display: flex; align-items: unsafe center; justify-content: unsafe center; width: 88px; height: 1px; padding-top: 20px; margin-left: 1px;"><div data-drawio-colors="color: rgb(0, 0, 0); " style="box-sizing: border-box; font-size: 0px; text-align: center;"><div style="display: inline-block; font-size: 12px; font-family: Helvetica; color: rgb(0, 0, 0); line-height: 1.2; pointer-events: all; font-weight: bold; white-space: normal; overflow-wrap: normal;">Master</div></div></div></foreignObject><text x="45" y="24" fill="rgb(0, 0, 0)" font-family="Helvetica" font-size="12px" text-anchor="middle" font-weight="bold">Master</text></switch></g></g><g><rect x="200" y="0" width="90" height="40" rx="6" ry="6" fill="rgb(255, 255, 255)" stroke="rgb(0, 0, 0)" pointer-events="all"/></g><g><g transform="translate(-0.5 -0.5)"><switch><foreignObject pointer-events="none" width="100%" height="100%" requiredFeatures="http://www.w3.org/TR/SVG11/feature#Extensibility" style="overflow: visible; text-align: left;"><div xmlns="http://www.w3.org/1999/xhtml" style="display: flex; align-items: unsafe center; justify-content: unsafe center; width: 88px; height: 1px; padding-top: 20px; margin-left: 201px;"><div data-drawio-colors="color: rgb(0, 0, 0); " style="box-sizing: border-box; font-size: 0px; text-align: center;"><div style="display: inline-block; font-size: 12px; font-family: Helvetica; color: rgb(0, 0, 0); line-height: 1.2; pointer-events: all; font-weight: bold; white-space: normal; overflow-wrap: normal;">Develop</div></div></div></foreignObject><text x="245" y="24" fill="rgb(0, 0, 0)" font-family="Helvetica" font-size="12px" text-anchor="middle" font-weight="bold">Develop</text></switch></g></g><g><rect x="80" y="120" width="120" height="60" rx="9" ry="9" fill="rgb(255, 255, 255)" stroke="rgb(0, 0, 0)" pointer-events="all"/></g><g><g transform="translate(-0.5 -0.5)"><switch><foreignObject pointer-events="none" width="100%" height="100%" requiredFeatures="http://www.w3.org/TR/SVG11/feature#Extensibility" style="overflow: visible; text-align: left;"><div xmlns="http://www.w3.org/1999/xhtml" style="display: flex; align-items: unsafe center; justify-content: unsafe center; width: 118px; height: 1px; padding-top: 150px; margin-left: 81px;"><div data-drawio-colors="color: rgb(0, 0, 0); " style="box-sizing: border-box; font-size: 0px; text-align: center;"><div style="display: inline-block; font-size: 12px; font-family: Helvetica; color: rgb(0, 0, 0); line-height: 1.2; pointer-events: all; white-space: normal; overflow-wrap: normal;">Versionsabschluss<div>0.2.0</div></div></div></div></foreignObject><text x="140" y="154" fill="rgb(0, 0, 0)" font-family="Helvetica" font-size="12px" text-anchor="middle">Versionsabschluss...</text></switch></g></g><g><path d="M 250 1239.5 L 240 1239.5 L 240 68.5 L 229.5 68.5 L 245 40.5 L 260.5 68.5 L 250 68.5 Z" fill="#60a917" stroke="#2d7600" stroke-miterlimit="10" pointer-events="all"/></g></g></svg>