<?xml version="1.0" encoding="UTF-8" standalone="no"?>
<svg
   width="24"
   height="24"
   viewBox="0 0 6.35 6.35"
   version="1.1"
   id="svg3"
   sodipodi:docname="Abgerufen.svg"
   inkscape:version="1.3.2 (091e20e, 2023-11-25, custom)"
   xmlns:inkscape="http://www.inkscape.org/namespaces/inkscape"
   xmlns:sodipodi="http://sodipodi.sourceforge.net/DTD/sodipodi-0.dtd"
   xmlns="http://www.w3.org/2000/svg"
   xmlns:svg="http://www.w3.org/2000/svg">
  <defs
     id="defs3" />
  <sodipodi:namedview
     id="namedview3"
     pagecolor="#ffffff"
     bordercolor="#000000"
     borderopacity="0.25"
     inkscape:showpageshadow="2"
     inkscape:pageopacity="0.0"
     inkscape:pagecheckerboard="0"
     inkscape:deskcolor="#d1d1d1"
     inkscape:zoom="33.75"
     inkscape:cx="12"
     inkscape:cy="11.985185"
     inkscape:window-width="1920"
     inkscape:window-height="1057"
     inkscape:window-x="1912"
     inkscape:window-y="-8"
     inkscape:window-maximized="1"
     inkscape:current-layer="svg3" />
  <path
     d="M63.476 4.494h19.001c.32 0 .592.162.775.396l9.83 9.828a.98.98 0 0 1 .394.776v31a4 4 0 0 1-4 4h-26a4 4 0 0 1-4-4v-38a4 4 0 0 1 4-4"
     style="fill:#fff;fill-opacity:1;stroke:none;stroke-width:7.55906;stroke-linejoin:round;stroke-opacity:1;paint-order:markers fill stroke"
     transform="translate(-5.622 .012)scale(.11503)"
     id="path1" />
  <path
     fill-rule="evenodd"
     d="M89.477 50.494h-26a4 4 0 0 1-4-4v-38a4 4 0 0 1 4-4h19c.32 0 .593.161.776.395l9.829 9.83a.98.98 0 0 1 .395.775v31a4 4 0 0 1-4 4m-6-42.619v6.62h6.619zm8 8.62h-9a1 1 0 0 1-1-1v-9h-18a2 2 0 0 0-2 2v38a2 2 0 0 0 2 2h26a2 2 0 0 0 2-2zm-6 26h-18a1 1 0 1 1 0-2h18a1 1 0 1 1 0 2m0-8h-18a1 1 0 1 1 0-2h18a1 1 0 1 1 0 2m0-8h-18a1 1 0 1 1 0-2h18a1 1 0 1 1 0 2"
     clip-rule="evenodd"
     style="fill:#000;fill-opacity:1;stroke:none;stroke-opacity:1;stroke-width:1.0005542;stroke-dasharray:none"
     transform="translate(-5.622 .012)scale(.11503)"
     id="path2" />
  <path
     fill="#2197f3"
     d="m25.602 11.7-8.9-8.9c-.2-.2-.4-.3-.7-.3s-.5.1-.7.3l-9 9c-.3.3-.4.7-.2 1.1.1.4.5.6.9.6h4v15c0 .5.5 1 1 1h8c.5 0 1-.5 1-1v-15h4c.5 0 1-.4 1-1 0-.3-.2-.6-.4-.8z"
     style="fill:#23c616;fill-opacity:1;stroke:#000;stroke-width:1.90195687;stroke-dasharray:none"
     transform="rotate(90 1.317 2.489)scale(.1252)"
     id="path3" />
</svg>
