{
  "title": "Karaoke Mugen App API Documentation",
  "url": "https://api.karaokes.moe/app/",
  "logo": {
    "light": "/logo-light.svg",
    "dark": "/logo-dark.svg"
  },
  "twitter": "@KaraokeMugen"
}