{
  "header": {
    "description": "Karaoke Mugen Tag File",
    "version": 1
  },
  "tag": {
    "i18n": {
      "eng": "Kana"
    },
    "name": "Kana",
    "repository": "karaokebase-kana",
    "tid": "f2462778-f986-4844-a4b8-e1d3ccdb861b",
    "types": [
      "collections",
      "16"
    ]
  }
}