{
  "header": {
    "description": "Karaoke Mugen Tag File",
    "version": 1
  },
  "tag": {
    "i18n": {
      "eng": "Full",
      "fre": "Complète",
      "ita": "Completa"
    },
    "name": "Full",
    "priority": 3,
    "repository": "karaokebase-kana",
    "tid": "c2143a7f-6970-450e-8a79-0302db9220a9",
    "types": [
      "versions"
    ]
  }
}