{
  "header": {
    "description": "Karaoke Mugen Tag File",
    "version": 1
  },
  "tag": {
    "i18n": {
      "eng": "SUNRISE"
    },
    "name": "SUNRISE",
    "repository": "karaokebase-kana",
    "tid": "ef8f80e1-d244-4aea-b7f0-984d6dd4b82b",
    "types": [
      "creators"
    ]
  }
}