{
  "header": {
    "version": 4,
    "description": "Karaoke Mugen Karaoke Data File"
  },
  "medias": [
    {
      "version": "Default",
      "filename": "JPN - Sousei no Onmyouji - OP3 - sync ~ Kana Vers.mp4",
      "audiogain": -1.77,
      "loudnorm": "-15.96,-6.26,7.00,-26.14,-1.44",
      "filesize": 51178566,
      "duration": 91,
      "default": true,
      "lyrics": [
        {
          "filename": "JPN - Sousei no Onmyouji - OP3 - sync ~ Kana Vers.ass",
          "default": true,
          "version": "Default"
        }
      ]
    }
  ],
  "data": {
    "created_at": "2022-10-19T21:47:46.733Z",
    "ignoreHooks": false,
    "kid": "eea5c0d3-10f3-4805-9372-36d831692cc5",
    "modified_at": "2023-02-25T23:51:21.004Z",
    "parents": [
      "00a153e7-5aff-491f-b905-3b4d31910dda"
    ],
    "repository": "karaokebase-kana",
    "songorder": 3,
    "tags": {
      "authors": [
        "b5116310-e69b-4ed4-9e47-c5c53ee69023"
      ],
      "collections": [
        "f2462778-f986-4844-a4b8-e1d3ccdb861b"
      ],
      "creators": [
        "aaff4ba6-9a12-4bac-9bd0-c0cb783e4177"
      ],
      "families": [
        "0377db02-3af6-43b8-9b08-c759df3d25c3"
      ],
      "genres": [
        "a0aeef4a-6428-45ff-a6e1-468b595930c2"
      ],
      "groups": [
        "ae613721-1fbe-480d-ba6b-d6d0702b184d"
      ],
      "langs": [
        "4dcf9614-7914-42aa-99f4-dbce2e059133"
      ],
      "origins": [
        "938de218-5343-4865-94d3-fb33f2eaa152"
      ],
      "series": [
        "cd8fd82d-3497-451a-a6c4-977f17041a88"
      ],
      "singers": [
        "e7a562a7-10d8-46d2-929b-177a39466d39"
      ],
      "songtypes": [
        "f02ad9b3-0bd9-4aad-85b3-9976739ba0e4"
      ],
      "songwriters": [
        "54516d2a-2536-4a13-ac5f-fe0a1a37f1cf",
        "5cc674a2-f136-4df2-b35c-53c4dcef7d11"
      ],
      "versions": [
        "12d21e9c-3427-4677-a5bd-1301a0f7358a"
      ]
    },
    "titles": {
      "eng": "sync"
    },
    "titles_default_language": "eng",
    "year": 2016
  }
}