{
  "header": {
    "description": "Karaoke Mugen Tag File",
    "version": 1
  },
  "tag": {
    "aliases": [
      "(K)NoW_NAME:NIKIIE",
      "(K)NoW_NAME"
    ],
    "description": null,
    "i18n": {
      "eng": "NIKIIE"
    },
    "name": "NIKIIE",
    "repository": "karaokebase-kana",
    "tid": "8e441486-caa4-4627-9232-ddc4ee01d518",
    "types": [
      "singers",
      "songwriters"
    ]
  }
}