{
  "header": {
    "description": "Karaoke Mugen Tag File",
    "version": 1
  },
  "tag": {
    "i18n": {
      "eng": "Studio Blanc"
    },
    "name": "Studio Blanc",
    "repository": "karaokebase-kana",
    "tid": "788ab0fe-f876-4c9c-a4c4-c438f6275fae",
    "types": [
      "creators",
      "4"
    ]
  }
}