{
  "header": {
    "description": "Karaoke Mugen Tag File",
    "version": 1
  },
  "tag": {
    "aliases": [
      "Shokugeki no Souma 2",
      "Shokugeki no Souma 2nd Season",
      "Shokugeki no Souma S2",
      "Shokugeki no Souma: Ni no Sara",
      "Shokugeki no Sôma 2",
      "Shokugeki no Sôma 2nd Season",
      "Shokugeki no Sôma S2",
      "souma"
    ],
    "description": null,
    "i18n": {
      "eng": "Food Wars! The Second Plate",
      "fre": "Food Wars! Second Service",
      "jpn": "食戟のソーマ 弐ノ皿",
      "qjr": "Shokugeki no Sôma: Ni no Sara"
    },
    "name": "Shokugeki no Sôma: Ni no Sara",
    "repository": "karaokebase-kana",
    "tid": "34ea0292-d56d-49da-b21f-4d326a4ccf75",
    "types": [
      "series"
    ]
  }
}