{
  "header": {
    "description": "Karaoke Mugen Tag File",
    "version": 1
  },
  "tag": {
    "i18n": {
      "eng": "baker"
    },
    "name": "baker",
    "repository": "karaokebase-kana",
    "tid": "9a371a86-2aeb-4500-90ee-8ec31fa0011c",
    "types": [
      "songwriters"
    ]
  }
}