{
  "header": {
    "description": "Karaoke Mugen Tag File",
    "version": 1
  },
  "tag": {
    "i18n": {
      "eng": "cAnON."
    },
    "name": "cAnON.",
    "repository": "karaokebase-kana",
    "tid": "e0e8293e-4c3a-4a64-91cc-f47f687c5d08",
    "types": [
      "songwriters"
    ]
  }
}