{
  "header": {
    "description": "Karaoke Mugen Tag File",
    "version": 1
  },
  "tag": {
    "description": {
      "eng": "Anime/Video Games/Internet culture",
      "fre": "Culture internet, animé et jeu vidéo"
    },
    "i18n": {
      "eng": "Geek / Otaku"
    },
    "name": "Geek / Otaku",
    "repository": "karaokebase-kana",
    "tid": "c7db86a0-ff64-4044-9be4-66dd1ef1d1c1",
    "types": [
      "collections"
    ]
  }
}