{
  "header": {
    "description": "Karaoke Mugen Tag File",
    "version": 1
  },
  "tag": {
    "i18n": {
      "eng": "AragornFr"
    },
    "name": "AragornFr",
    "repository": "karaokebase-kana",
    "tid": "b2676ab6-a04c-40c3-a49a-404b458edae9",
    "types": [
      "authors"
    ]
  }
}