{
  "header": {
    "version": 4,
    "description": "Karaoke Mugen Karaoke Data File"
  },
  "medias": [
    {
      "version": "Default",
      "filename": "ENG - Om, Sagi - MV - Dead End ~ Cover Kana Vers.mp4",
      "audiogain": -10.67,
      "loudnorm": "-6.53,1.52,3.90,-16.58,-0.37",
      "filesize": 88447968,
      "duration": 234,
      "default": true,
      "lyrics": [
        {
          "filename": "ENG - Om, Sagi - MV - Dead End ~ Cover Kana Vers.ass",
          "default": true,
          "version": "Default"
        }
      ]
    }
  ],
  "data": {
    "created_at": "2022-01-27T17:03:25.893Z",
    "ignoreHooks": false,
    "kid": "98fa813c-0ab2-4007-ba78-aadbeaf0cb58",
    "modified_at": "2023-02-25T23:51:20.138Z",
    "parents": [
      "0b3ebab4-41ad-4ad2-8166-e261e57c1dc6",
      "dcd75fba-4dde-40ca-a9fc-f2290b3358b6"
    ],
    "repository": "karaokebase-kana",
    "tags": {
      "authors": [
        "9cdf3b70-3550-457c-bdb9-038f3253c6ad"
      ],
      "collections": [
        "f2462778-f986-4844-a4b8-e1d3ccdb861b"
      ],
      "creators": [
        "dc290d71-a955-462d-adfd-534d44f2dd0f"
      ],
      "families": [
        "0377db02-3af6-43b8-9b08-c759df3d25c3"
      ],
      "groups": [
        "ae613721-1fbe-480d-ba6b-d6d0702b184d"
      ],
      "langs": [
        "4dcf9614-7914-42aa-99f4-dbce2e059133",
        "de5eda1c-5fb3-46a6-9606-d4554fc5a1d6"
      ],
      "origins": [
        "ac5085db-52d8-44b4-8fbb-1697b24d2046"
      ],
      "singers": [
        "509b5f7b-c400-45ba-8921-1f4fdf0a6c22",
        "53bf5b4b-781e-4bdb-b87e-544e09ffc4a4",
        "8c32560f-a789-49f8-bf99-26cfcc63b2ba",
        "c767c1e1-5428-432e-9bf7-37573c05606b"
      ],
      "songtypes": [
        "7be1b15c-cff8-4b37-a649-5c90f3d569a9"
      ],
      "songwriters": [
        "30e4f047-50d7-4ed7-8ed3-57cef0f20489",
        "d35531fd-32b5-487c-a4ba-a417a9013db4",
        "d5f4599c-3540-4514-b5ac-9bab0450222b"
      ],
      "versions": [
        "03e1e1d2-8641-47b7-bbcb-39a3df9ff21c",
        "12d21e9c-3427-4677-a5bd-1301a0f7358a"
      ]
    },
    "titles": {
      "eng": "Dead End"
    },
    "titles_default_language": "eng",
    "year": 2017
  }
}