{
  "header": {
    "description": "Karaoke Mugen Tag File",
    "version": 1
  },
  "tag": {
    "i18n": {
      "eng": "Katsuyuki Konishi"
    },
    "name": "Katsuyuki Konishi",
    "repository": "karaokebase-kana",
    "tid": "526ce133-ad31-4dbe-9728-b34da460aefa",
    "types": [
      "singers",
      "2"
    ]
  }
}