{
  "header": {
    "description": "Karaoke Mugen Tag File",
    "version": 1
  },
  "tag": {
    "aliases": [
      "(K)NoW_NAME:Ayaka Tachibana",
      "(K)NoW_NAME"
    ],
    "description": null,
    "i18n": {
      "eng": "Ayaka Tachibana"
    },
    "name": "Ayaka Tachibana",
    "repository": "karaokebase-kana",
    "tid": "c9ad6404-f935-45a8-9cb5-0312decc0e6f",
    "types": [
      "singers",
      "songwriters"
    ]
  }
}