{
  "header": {
    "version": 4,
    "description": "Karaoke Mugen Karaoke Data File"
  },
  "medias": [
    {
      "version": "Default",
      "filename": "JPN - Shokugeki no Souma Ni no Sara - ED - Snow Drop ~ Kana Vers.mp4",
      "audiogain": 0.24,
      "loudnorm": "-18.54,-11.67,6.70,-28.62,-1.00",
      "filesize": 24061751,
      "duration": 91,
      "default": true,
      "lyrics": [
        {
          "filename": "JPN - Shokugeki no Souma Ni no Sara - ED - Snow Drop ~ Kana Vers.ass",
          "default": true,
          "version": "Default"
        }
      ]
    }
  ],
  "data": {
    "created_at": "2022-05-05T20:53:37.197Z",
    "ignoreHooks": false,
    "kid": "ceb1ad53-f35d-4b0c-9f33-133521d130b1",
    "modified_at": "2023-02-25T23:51:20.920Z",
    "parents": [
      "67285b85-849d-4eec-8d29-4f0784a2506b"
    ],
    "repository": "karaokebase-kana",
    "tags": {
      "authors": [
        "b5116310-e69b-4ed4-9e47-c5c53ee69023"
      ],
      "collections": [
        "f2462778-f986-4844-a4b8-e1d3ccdb861b"
      ],
      "creators": [
        "802a8ac8-b16f-40a4-944b-99956798c906"
      ],
      "families": [
        "0377db02-3af6-43b8-9b08-c759df3d25c3"
      ],
      "genres": [
        "a0aeef4a-6428-45ff-a6e1-468b595930c2"
      ],
      "groups": [
        "ae613721-1fbe-480d-ba6b-d6d0702b184d"
      ],
      "langs": [
        "4dcf9614-7914-42aa-99f4-dbce2e059133"
      ],
      "origins": [
        "938de218-5343-4865-94d3-fb33f2eaa152"
      ],
      "series": [
        "34ea0292-d56d-49da-b21f-4d326a4ccf75"
      ],
      "singers": [
        "705e40f8-00f0-46e5-838a-4181d93de4b2"
      ],
      "songtypes": [
        "38c77c56-2b95-4040-b676-0994a8cb0597"
      ],
      "songwriters": [
        "222ae5d2-c7d4-4ba9-852c-681baf61ece4",
        "832bbda8-bb5b-4e9d-b7e6-460541a144d8"
      ],
      "versions": [
        "12d21e9c-3427-4677-a5bd-1301a0f7358a"
      ]
    },
    "titles": {
      "eng": "Snow Drop"
    },
    "titles_default_language": "eng",
    "year": 2016
  }
}