{
  "header": {
    "version": 4,
    "description": "Karaoke Mugen Karaoke Data File"
  },
  "medias": [
    {
      "version": "Default",
      "filename": "JPN - Romeo x Juliet - OP - Inori ~You Raise Me Up~ ~ Kana Vers.mp4",
      "audiogain": 3.54,
      "loudnorm": "-21.72,-7.69,10.20,-32.18,-1.25",
      "filesize": 36565927,
      "duration": 91,
      "default": true,
      "lyrics": [
        {
          "filename": "JPN - Romeo x Juliet - OP - Inori ~You Raise Me Up~ ~ Kana Vers.ass",
          "default": true,
          "version": "Default"
        }
      ]
    }
  ],
  "data": {
    "created_at": "2022-06-26T15:56:11.969Z",
    "ignoreHooks": false,
    "kid": "b2669f75-9621-4335-933e-d704b479eb20",
    "modified_at": "2023-02-25T23:51:20.614Z",
    "parents": [
      "ab4757e5-8084-4c1e-8747-7a6b24d89833"
    ],
    "repository": "karaokebase-kana",
    "tags": {
      "authors": [
        "88f23133-8bb2-4ac5-a4ef-d6f06757c5fc"
      ],
      "collections": [
        "f2462778-f986-4844-a4b8-e1d3ccdb861b"
      ],
      "creators": [
        "12d35c78-7372-4a33-8843-b4a18b1ee737"
      ],
      "families": [
        "0377db02-3af6-43b8-9b08-c759df3d25c3"
      ],
      "groups": [
        "3c14c864-533c-49e6-a3cc-6969f1233775",
        "8c22c899-b3ed-42da-a548-ce00f950798b"
      ],
      "langs": [
        "4dcf9614-7914-42aa-99f4-dbce2e059133"
      ],
      "origins": [
        "938de218-5343-4865-94d3-fb33f2eaa152"
      ],
      "series": [
        "85e817cc-8b63-4857-8533-658ce94bd9a5"
      ],
      "singers": [
        "e6d51019-ec6e-498d-8a2a-898a8ffef496"
      ],
      "songtypes": [
        "f02ad9b3-0bd9-4aad-85b3-9976739ba0e4"
      ],
      "songwriters": [
        "efcb4bcc-321b-4ec2-908b-0160262104b7"
      ],
      "versions": [
        "12d21e9c-3427-4677-a5bd-1301a0f7358a"
      ]
    },
    "titles": {
      "eng": "Inori ~You Raise Me Up~",
      "qjr": "Inori ~You Raise Me Up~"
    },
    "titles_default_language": "eng",
    "year": 2007
  }
}