{
  "header": {
    "description": "Karaoke Mugen Tag File",
    "version": 1
  },
  "tag": {
    "description": null,
    "i18n": {
      "eng": "fabthehedgehog"
    },
    "name": "fabthehedgehog",
    "repository": "karaokebase-kana",
    "tid": "9cdf3b70-3550-457c-bdb9-038f3253c6ad",
    "types": [
      "authors",
      "creators"
    ]
  }
}