<?xml version="1.0" encoding="UTF-8" standalone="no"?>
<svg
   version="1.1"
   viewBox="0 0 800 75"
   id="svg28"
   xmlns="http://www.w3.org/2000/svg"
   xmlns:svg="http://www.w3.org/2000/svg">
  <defs
     id="defs10">
    <radialGradient
       id="a"
       cx="508.88"
       cy="275.85"
       r="508"
       gradientTransform="matrix(-.83268 0 0 .72733 822.93 -180.85)"
       gradientUnits="userSpaceOnUse">
      <stop
         stop-color="#4c4c4c"
         offset="0"
         id="stop2" />
      <stop
         offset="1"
         id="stop4" />
    </radialGradient>
    <filter
       id="b"
       x="-0.028653487"
       y="-0.056311252"
       width="1.057307"
       height="1.1126225"
       color-interpolation-filters="sRGB">
      <feGaussianBlur
         stdDeviation="1.331251"
         id="feGaussianBlur7" />
    </filter>
  </defs>
  <g
     transform="matrix(1.3352 0 0 1.3465 -278.26 -347.27)"
     id="g18">
    <path
       transform="matrix(.74895 0 0 .74267 208.4 257.91)"
       d="m0 0v75h800v-75h-800z"
       fill="url(#a)"
       stroke-width="1.3408"
       style="paint-order:fill markers stroke"
       id="path12" />
    <g
       transform="matrix(1.4134 0 -.55446 .73189 210.77 -878.82)"
       id="g16" />
  </g>
  <path
     d="m 347.91163,9.1310822 c -1.559,0.01216 -2.9274,0.9963798 -3.4453,2.4628998 -0.1693,0.4768 -0.21875,0.95892 -0.21875,1.459 v 49.158 c 0.0577,2.0484 1.6588,3.6454 3.6875,3.6504 4.2521,0.006 13.01,-0.01563 13.01,-0.01563 l -0.0156,-3.8027 h -12.771 c -0.0678,-0.40867 -0.0523,-48.517 0.0137,-48.74 0.39125,-0.05464 103.35,-0.03537 103.58,0.01758 0.0623,0.37105 0.0447,48.486 -0.0234,48.738 h -86.105 v 3.8027 c 0,0 0.33447,0.0018 0.48829,0.0078 h 85.988 c 1.5421,-0.0153 2.908,-0.9849 3.4336,-2.4394 0.1693,-0.46334 0.21875,-0.93928 0.21875,-1.4277 v -49.252 c -0.0325,-1.627 -1.1395,-3.0557998 -2.7051,-3.4882998 h -0.002 c -0.4146,-0.11097 -0.82949,-0.13086 -1.2578,-0.13086 z m 47.947,14.4359998 c -0.0322,0.06185 -0.0556,0.10616 -0.0684,0.14844 -3.4895,9.3624 -6.9744,18.727 -10.463,28.088 -0.0153,0.01529 -0.0156,0.0445 -0.0156,0.0625 v 0.03124 c 0,0.01221 0.0148,0.01716 0.0176,0.03126 h 4.791 l 0.008,0.002 c 0.0369,-0.10679 0.0791,-0.19944 0.11133,-0.29883 0.74173,-2.1082 1.4848,-4.2122 2.2285,-6.3223 0.12372,-0.33915 0.24757,-0.68092 0.35938,-1.0215 0.0442,-0.14216 0.11579,-0.21527 0.26562,-0.19727 0.0485,0.006 0.10499,0 0.1543,0 h 10.471 c 0.9465,2.6236 1.8859,5.2269 2.8223,7.832 h 4.9004 c -3.5358,-9.4776 -7.0566,-18.917 -10.57,-28.355 z m -18.422,0.09375 c -0.27315,0 -0.44673,0.07892 -0.62695,0.29102 -3.6496,4.324 -7.3072,8.6494 -10.965,12.969 -0.0485,0.0553 -0.11139,0.10591 -0.2168,0.20313 v -10.758 c 0,-0.89033 0.0153,-1.7831 0,-2.6738 h -4.5898 v 28.205 c 0.36435,0.064 4.3519,0.05058 4.5976,-0.01562 v -0.35742 l -0.0137,-0.002 v -9.8398 c 0,-0.2219 0.063,-0.37689 0.24414,-0.51758 0.75951,-0.60089 1.5084,-1.2187 2.2578,-1.832 0.0748,-0.0555 0.147,-0.10575 0.24024,-0.17383 0.0809,0.10455 0.14816,0.19116 0.21093,0.28516 1.2739,1.8389 2.5491,3.6758 3.8223,5.5117 1.5623,2.2616 3.1286,4.5127 4.6875,6.7637 0.0865,0.13066 0.16545,0.22852 0.35742,0.22852 1.6415,-0.006 3.2803,-0.0059 4.9199,-0.0059 0.0543,0 0.1108,-0.01751 0.19727,-0.03711 -3.6303,-5.2895 -7.2464,-10.542 -10.873,-15.826 0.72955,-0.84733 1.4356,-1.6643 2.1406,-2.5 0.70681,-0.81818 1.4115,-1.639 2.1172,-2.4629 0.70461,-0.82178 1.4048,-1.6442 2.1113,-2.4668 0.70499,-0.82451 1.4104,-1.6466 2.1074,-2.4688 0.70183,-0.81599 1.3986,-1.6334 2.1426,-2.5137 h -0.41406 c -1.4856,0 -2.9693,0.0088 -4.4551,-0.0059 z m 37.193,0.03125 c -0.0766,0.35267 -0.0594,28.006 0.0137,28.238 h 16.512 v -3.9277 h -7.9648 c -0.66954,0 -1.3451,0.006 -2.0117,0 -0.65702,-0.006 -1.3107,0.02378 -1.9922,-0.01562 v -22.113 l -0.004,-0.0059 c 0,-0.73043 0.0264,-1.4523 -0.0215,-2.1758 z m 19.666,0.0078 v 28.223 h 4.5723 c 0.0154,-0.0474 0.0274,-0.07156 0.0274,-0.10352 v -27.953 h -0.002 c 0,-0.04383 -2.2e-4,-0.08149 -0.0156,-0.12695 0,-0.01217 -0.0156,-0.01477 -0.0156,-0.02344 0,-0.0057 -0.0176,-0.01563 -0.0176,-0.01563 z m -35.98,3.9512 c 0.0485,0.07413 0.0865,0.11914 0.0996,0.16797 0.76672,2.8642 1.814,5.6417 2.7656,8.4512 0.39535,1.169 0.80459,2.3322 1.207,3.502 0.0306,0.10466 0.0605,0.20848 0.0977,0.3379 h -8.2227 c 0.0367,-0.12189 0.0679,-0.22523 0.10352,-0.33008 v -0.002 c 0.96526,-2.7965 1.9442,-5.579 2.8848,-8.3828 0.3774,-1.1269 0.66109,-2.2901 0.98242,-3.4395 0.0271,-0.08709 0.0453,-0.17358 0.082,-0.30469 z"
     filter="url(#b)"
     opacity="0.5"
     stroke-width="0.87265"
     id="path20" />
  <g
     transform="matrix(0.87243,0,0,0.87287,-57.006372,60.336082)"
     clip-rule="evenodd"
     fill="#ffffff"
     fill-rule="evenodd"
     stroke-width="0.5135"
     id="g26">
    <path
       d="m 584.63,-58.512 c -0.47522,-0.12713 -0.94925,-0.15048 -1.4402,-0.15048 h -119.06 c -1.787,0.01393 -3.3557,1.1422 -3.9494,2.8223 -0.19405,0.54624 -0.25048,1.0991 -0.25048,1.672 v 56.317 c 0.0661,2.3467 1.902,4.1767 4.2273,4.1824 4.8739,0.00645 14.911,-0.017552 14.911,-0.017552 l -0.0177,-4.3583 h -14.64 c -0.0777,-0.46819 -0.058,-55.582 0.0177,-55.838 0.44846,-0.0626 118.46,-0.04001 118.72,0.02066 0.0714,0.42509 0.0507,55.546 -0.0274,55.835 h -98.696 v 4.3588 c 0,0 0.3852,0 0.5615,0.00645 h 98.561 c 1.7676,-0.017552 3.3336,-1.1263 3.9361,-2.7927 0.19405,-0.53082 0.24982,-1.078 0.24982,-1.6376 v -56.424 c -0.0372,-1.864 -1.3058,-3.5013 -3.1003,-3.9968 z m -100.2,48.414 V -21.37 c 0,-0.25422 0.0714,-0.43273 0.27902,-0.59391 0.87056,-0.68841 1.7294,-1.3964 2.5884,-2.0991 0.0857,-0.06363 0.16902,-0.12016 0.2759,-0.19815 0.0927,0.11977 0.17062,0.2178 0.24257,0.32549 1.4602,2.1067 2.9217,4.2112 4.381,6.3145 1.7907,2.591 3.5844,5.17 5.3712,7.7488 0.0992,0.14969 0.19032,0.26319 0.41036,0.26319 1.8815,-0.00645 3.761,-0.00645 5.6404,-0.00645 0.0622,0 0.12623,-0.02066 0.22534,-0.043106 -4.1611,-6.0599 -8.305,-12.078 -12.462,-18.132 0.83623,-0.97074 1.6452,-1.905 2.4533,-2.8624 0.81016,-0.93735 1.6174,-1.8779 2.4263,-2.8218 0.80765,-0.94147 1.6094,-1.8845 2.4192,-2.8269 0.80808,-0.9446 1.6174,-1.8871 2.4164,-2.829 0.80446,-0.93484 1.6031,-1.8702 2.4559,-2.8787 h -0.47407 c -1.7028,0 -3.4046,0.01033 -5.1076,-0.0065 -0.31309,0 -0.51053,0.09073 -0.71711,0.33372 -4.1833,4.9538 -8.3765,9.9086 -12.569,14.857 -0.0556,0.06337 -0.1279,0.12016 -0.24872,0.23154 v -12.324 c 0,-1.02 0.0175,-2.0431 0,-3.0636 h -5.261 v 32.314 c 0.41763,0.07331 4.9874,0.05834 5.2691,-0.017552 v -0.41116 z m 28.09,0.46768 c 0.0423,-0.12235 0.0907,-0.22744 0.12764,-0.3413 0.85018,-2.4153 1.7012,-4.8265 2.5537,-7.2439 0.14181,-0.38855 0.28282,-0.77923 0.41098,-1.1694 0.0507,-0.16286 0.13378,-0.24806 0.30551,-0.22744 0.0556,0.0065 0.12029,0 0.17681,0 h 12.001 c 1.0849,3.0057 2.1622,5.9895 3.2355,8.9741 h 5.6182 c -4.0528,-10.858 -8.0885,-21.674 -12.116,-32.487 h -5.7448 c -0.0369,0.07086 -0.064,0.12248 -0.0786,0.17092 -3.9997,10.726 -7.9954,21.456 -11.994,32.18 -0.0175,0.017552 -0.0175,0.050724 -0.0175,0.071374 v 0.034333 c 0,0.013933 0.0175,0.02066 0.0207,0.036782 h 5.4904 z m 4.8569,-13.921 c 1.1064,-3.2038 2.2286,-6.3934 3.3067,-9.6056 0.43259,-1.291 0.75869,-2.6227 1.127,-3.9395 0.0311,-0.09977 0.0507,-0.1999 0.0927,-0.3501 0.0556,0.08493 0.0991,0.13672 0.11422,0.19266 0.87884,3.2814 2.0802,6.4652 3.171,9.6839 0.45316,1.3393 0.92251,2.6705 1.3838,4.0106 0.0351,0.1199 0.0698,0.23983 0.11241,0.3881 h -9.4266 c 0.0421,-0.13965 0.0777,-0.25976 0.11848,-0.37988 z m 28.446,-15.936 c 0,-0.83681 0.0308,-1.666 -0.0241,-2.4948 h -5.1958 c -0.0878,0.40404 -0.0663,32.087 0.0175,32.353 h 18.925 v -4.5015 h -9.1291 c -0.76745,0 -1.5409,0.0065 -2.305,0 -0.7531,-0.0065 -1.5031,0.02763 -2.2842,-0.01755 v -25.334 z m 22.592,-2.2957 c 0,-0.05021 0,-0.0919 -0.0176,-0.14399 0,-0.01394 -0.0175,-0.01755 -0.0175,-0.02749 0,-0.0065 -0.0207,-0.01755 -0.0207,-0.01755 h -5.2135 v 32.334 h 5.2412 c 0.0176,-0.054337 0.0308,-0.083247 0.0308,-0.1199 v -32.025 z"
       id="path22" />
  </g>
</svg>
