{
    "KPlugin": {
        "Description": "Window decoration using Kali's visual style for the Plasma Desktop",
        "EnabledByDefault": true,
        "Name": "Kali"
    },
    "X-KDE-ConfigModule": "kcm_breezedecoration",
    "org.kde.kdecoration3": {
        "blur": false,
        "recommendedBorderSize": "None"
    }
}
