<?xml version="1.0" encoding="UTF-8" standalone="no"?>
<svg
   viewBox="0 0 135.47 135.47"
   version="1.1"
   id="svg286"
   sodipodi:docname="kali-dragon-circle-head-blue.svg"
   inkscape:export-filename="kali-dragon-circle-head-blue.png"
   inkscape:export-xdpi="96"
   inkscape:export-ydpi="96"
   inkscape:version="1.2.1 (9c6d41e4, 2022-07-14)"
   xmlns:inkscape="http://www.inkscape.org/namespaces/inkscape"
   xmlns:sodipodi="http://sodipodi.sourceforge.net/DTD/sodipodi-0.dtd"
   xmlns="http://www.w3.org/2000/svg"
   xmlns:svg="http://www.w3.org/2000/svg">
  <defs
     id="defs290" />
  <sodipodi:namedview
     id="namedview288"
     pagecolor="#ffffff"
     bordercolor="#000000"
     borderopacity="0.25"
     inkscape:showpageshadow="2"
     inkscape:pageopacity="0.0"
     inkscape:pagecheckerboard="0"
     inkscape:deskcolor="#d1d1d1"
     showgrid="false"
     inkscape:zoom="1.7420831"
     inkscape:cx="-9.1844069"
     inkscape:cy="67.735001"
     inkscape:window-width="1309"
     inkscape:window-height="456"
     inkscape:window-x="0"
     inkscape:window-y="25"
     inkscape:window-maximized="0"
     inkscape:current-layer="svg286" />
  <g
     transform="matrix(1.1378 0 0 1.1378 -9.3323 -193.13)"
     id="g284">
    <circle
       cx="67.733"
       cy="229.27"
       fill="#2777ff"
       r="59.531"
       id="circle276" />
    <path
       d="m34.342 182.71-1.1816.83203c-1.0939.76925-2.1616 1.5748-3.2012 2.416l-1.9785 1.6016 2.5039 1.8789c.94522.70933 5.2771 4.1799 8.6348 7.2148.64383.58197 1.4032 1.4504 2.084 2.0859-.17328.31157-.39491.68123-.41016.77735-.0231.1459-.0217.16541-.0234.18164-.08.75544.002 1.1388.0781 1.9492.0761.81046.19267 1.8126.3418 2.8867.0613.44165.0833.63438.13477 1.0078-4.3697-3.1092-8.0553-6.3078-11.146-9.8848l-.01-.0117c-.16804-.20133-.49631-.58797-.56054-.66601-1.0583-1.2857-1.9917-2.3704-2.7774-3.2344l-1.4183-1.7214c-6.1156 6.3797-10.113 12.663-13.156 20.227l1.9531 1.0059 32.535 16.709c.70293.36329.99746.57312 1.4531 1.1191.0162.0194-.0156-.12993-.004.0898.0117.21977-.0343.73848-.0898 1.4629v.008c-.0981 1.3614-.0266 2.6752.0215 3.832l.002.0508.004.0508c.33304 3.5692 1.4688 6.7543 3.6289 8.8828 1.8276 1.8008 5.0794 3.7566 11.619 7.3359 3.1159 1.7054 7.0799 4.0391 8.5742 5.0312 3.6818 2.4444 7.5489 5.5672 11.088 8.9121.004.004-.004-.003.002.002l.0117.0117c.00027.00027.002-.00026.002 0l.01.0117c2.4211 2.301 4.8625 4.8782 6.8262 7.2519.86883 1.0543 1.6023 1.8916 2.2031 2.5059.30064.30742.55905.55557.85156.78517.14626.1148.29532.22734.54297.35351.24765.12615.61731.41723 1.5215.18945l.0137-.004.0156-.004c.68826-.18451.54618-.22097.69921-.30859.15304-.0876.32166-.19087.52344-.31641.40356-.25107.93003-.59027 1.5586-1.002 1.2571-.82338 2.9178-1.9343 4.707-3.1484 4.3983-2.9846 6.66-4.5206 7.8945-5.4473.61728-.46334.96937-.68471 1.4004-1.2871.21551-.3012.50057-.86365.44141-1.5352-.0591-.67061-.39953-1.0905-.5254-1.2422-.37865-.45647-.5769-.50169-.75584-.59569-.17897-.094-.33211-.15748-.4922-.21875-.32018-.12255-.66065-.22673-1.0332-.32617l-.004-.002h-.002c-.32145-.085-.65161-.16388-.95703-.2246h-.002c-3.4215-.67696-8.48-2.8298-12.348-5.3359-1.4325-.92822-3.3708-2.4165-5.1973-3.9492-.001-.001-.003-.001-.004-.002-1.8785-1.631-3.5957-3.0409-5.0156-4.7715.23508-.31103.50178-.57927.67774-.97461.31529-.7084.42791-1.587.30664-2.3789-.24255-1.5838-1.0454-2.9045-2.3301-5.0606-3.3006-5.5392-6.5864-11.23-7.8965-13.67v-.002c-1.1168-2.0796-1.8568-3.4017-2.5723-4.4043-.5719-.80146-1.1818-1.3678-1.7051-1.7559-.54894-.40704-1.1136-.83795-2.2129-.96875-.43639-.0519-.84323.0381-1.2812.0293.18362-.47773.28827-.97667.21484-1.2949-.19621-.851-.36184-.82985-.52539-1.0547-.16354-.22483-.34709-.45343-.57031-.7168-.44644-.52673-1.0413-1.1809-1.7637-1.9531-1.4449-1.5442-3.3965-3.5467-5.5568-5.7068-4.3205-4.3202-9.4533-9.2575-12.953-12.357-2.5702-2.2765-5.2789-4.5772-7.4277-6.3711-2.1489-1.7939-3.6006-2.9788-4.0996-3.3555-.28023-.21154-.47547-.35646-.73828-.55469zm38.285 52.301c.46687.65002 1.0084 1.3407 1.375 1.8828.41565.61585.70686 1.0899 1.0625 1.6426-1.6479-.73463-2.4235-1.4167-2.5527-1.9316-.0442-.17605.0296-.93067.11524-1.5938z"
       opacity=".3"
       id="path278" />
    <path
       d="m34.342 180.06-1.1816.83203c-1.0939.76925-2.1616 1.5748-3.2012 2.416l-1.9785 1.6016 2.5039 1.8789c.94522.70933 5.2771 4.1799 8.6348 7.2148.64384.58197 1.4032 1.4504 2.084 2.0859-.17328.31157-.39491.68123-.41016.77735-.02314.1459-.02172.16541-.02344.18164-.07998.75544.002 1.1388.07813 1.9492.0761.81046.19267 1.8126.3418 2.8867.06131.44165.08326.63438.13477 1.0078-4.3697-3.1092-8.0553-6.3078-11.146-9.8848l-.0098-.0117c-.16805-.20133-.49631-.58797-.56055-.66601-1.0583-1.2857-1.9917-2.3704-2.7773-3.2344l-1.4183-1.7214c-6.1156 6.3797-10.113 12.663-13.156 20.227l1.9531 1.0059 32.535 16.709c.70293.36329.99746.57312 1.4531 1.1191.01618.0194-.01561-.12993-.0039.0898.01171.21977-.03433.73848-.08984 1.4629v.008c-.09808 1.3614-.0266 2.6752.02148 3.832l.002.0508.0039.0508c.33305 3.5692 1.4688 6.7543 3.6289 8.8828 1.8276 1.8008 5.0794 3.7566 11.619 7.3359 3.1159 1.7054 7.0799 4.0391 8.5742 5.0312 3.6818 2.4444 7.5489 5.5672 11.088 8.9121.0039.004-.0035-.003.002.002l.01172.0117c.000357.00034.0016-.00034.002 0l.0098.0117c2.4211 2.301 4.8625 4.8782 6.8262 7.252.86883 1.0543 1.6023 1.8916 2.2031 2.5059.30064.30741.55905.55556.85156.78516.14626.1148.29532.22735.54297.35351s.61731.41723 1.5215.18945l.01367-.004.01563-.004c.68827-.18451.54618-.22097.69922-.30859.15304-.0876.32166-.19087.52344-.31641.40356-.25107.93003-.59026 1.5586-1.002 1.2571-.82338 2.9178-1.9343 4.707-3.1484 4.3983-2.9846 6.66-4.5206 7.8945-5.4473.61728-.46335.96937-.68471 1.4004-1.2871.21551-.3012.50057-.86365.4414-1.5352-.0591-.67061-.39952-1.0905-.52539-1.2422-.37866-.45647-.5769-.50169-.75585-.5957-.17896-.094-.3321-.15748-.49219-.21875-.32018-.12255-.66065-.22672-1.0332-.32617l-.004-.002h-.002c-.32145-.085-.65161-.16388-.95703-.2246h-.002c-3.4215-.67696-8.48-2.8298-12.348-5.3359-1.4325-.92822-3.3708-2.4165-5.1973-3.9492-.0012-.001-.0027-.00095-.0039-.002-1.8785-1.631-3.5957-3.0409-5.0156-4.7715.23508-.31103.50178-.57927.67773-.97461.3153-.7084.42791-1.587.30664-2.3789-.24254-1.5838-1.0454-2.9045-2.3301-5.0606-3.3006-5.5392-6.5863-11.23-7.8965-13.67v-.002c-1.1168-2.0796-1.8568-3.4017-2.5723-4.4043-.5719-.80146-1.1818-1.3678-1.7051-1.7559-.54894-.40704-1.1136-.83795-2.2129-.96875-.43639-.0519-.84323.0381-1.2812.0293.18362-.47773.28827-.97667.21484-1.2949-.19621-.851-.36185-.82985-.52539-1.0547s-.34709-.45343-.57031-.7168c-.44644-.52673-1.0413-1.1809-1.7637-1.9531-1.4447-1.5445-3.3964-3.5469-5.5566-5.707-4.3205-4.3202-9.4533-9.2575-12.953-12.357-2.5702-2.2765-5.2789-4.5772-7.4277-6.3711-2.1489-1.7939-3.6007-2.9788-4.0996-3.3555-.28023-.21154-.47547-.35646-.73828-.55469zm38.285 52.301c.46687.65002 1.0084 1.3407 1.375 1.8828.41565.61585.70686 1.0899 1.0625 1.6426-1.6479-.73463-2.4235-1.4167-2.5527-1.9316-.04419-.17605.02963-.93067.11523-1.5938z"
       id="path280" />
    <path
       d="m129.64 79.303a217.5 217.5 0 0 0 -11.695 8.8281l1.7695 1.3281c4.0902 3.0695 20.212 15.996 33.162 27.701 18.442 16.67 41.246 39.482 59.438 59.459 17.676 19.411 20.207 21.002 33.49 21.018 6.77.0113 8.4311-.28121 8.168-1.4219-.88889-3.8553-52.449-55.412-78.43-78.424-19.266-17.064-40.794-34.639-43.119-36.395-1.0429-.78729-1.7742-1.3327-2.7832-2.0938zm-33.791 29.918a217.5 217.5 0 0 0 -6.7852 7.4219c.09941.75995.18213 1.4657.29102 2.25.45691 3.2914.81732 5.9218 1.1289 8.2656-2.1356-1.3206-4.2794-2.628-6.4277-3.9277a217.5 217.5 0 0 0 -28.078 47.424l1.1465.58984 122.97 63.152c3.1716 1.638 5.4766 3.2818 7.8281 6.0996 2.3516 2.8178 1.7597 6.0944 1.3652 11.242-.32526 4.515-.0899 9.2131.0937 13.631 1.1432 12.251 5.1934 22.706 11.508 28.928 5.4578 5.3777 17.67 13.033 42.254 26.488 11.943 6.5367 26.772 15.242 32.953 19.346 14.369 9.5399 29.288 21.601 42.967 34.535.0193.0189.0393.0396.0547.0547 9.3507 8.8869 18.748 18.802 26.414 28.068 6.4074 7.7761 10.773 12.24 11.734 11.998 1.0249-.27477 12.557-7.8672 26.033-17.012 33.24-22.556 34.476-23.482 33.25-24.959-.39689-.47849-2.3454-1.2022-4.7852-1.8535-1.081-.28573-2.2221-.55529-3.1621-.74219-14.415-2.852-33.866-11.23-49.293-21.227-5.8754-3.8071-13.333-9.5495-20.404-15.484-7.1768-6.2353-14.399-11.949-20.533-19.609l-3.2168-4.0606 2.041-2.2441c6.0725-6.6721 5.5924-9.8049-3.9551-25.828-12.51-20.995-24.889-42.429-30.008-51.961-4.1861-7.7946-6.9419-12.649-9.2188-15.84-1.7423-2.4416-3.2618-3.8257-4.8086-4.9727-1.3676-1.0141-3.2753-2.0554-4.7793-2.2344-11.423-1.3589-28.294 3.1739-37.201-1.2344-2.9024-1.4364-5.5398-3.8689-7.5527-5.8027-5.7706-5.5737-11.307-12.35-15.756-17.553-9.7648-11.419-20.59-24.209-24.057-28.42-9.3188-11.322-16.201-18.669-17.887-19.121-.40286-.1081-.37017-.13454-.42578.39062-.17473 1.6503.45878 8.5373 1.5586 16.459 1.4562 10.49 2.2288 15.871 1.9707 18.031-.0765.6401-.0846.78942-.4746.98437-1.0867.54323-3.3208-1.2109-7.6875-4.1816-19.465-13.243-35.216-27.021-48.621-42.551-.56657-.67949-1.7904-2.1224-2.1816-2.5977-3.9372-4.7834-7.4005-8.7991-10.26-11.943zm177.02 145.05c.40384-.0151.81219.13336 1.3477.35937 4.3085 5.3122 8.6069 11.436 11.684 15.986 6.0634 8.9839 10.976 17.092 11.076 18.01.13892 1.272-.33748 1.4076-.53711 1.6328-1.5306 1.7263-6.0307 1.5867-12.174-.63086-10.449-3.7719-16.029-8.2656-17.488-14.078-1.5473-6.1648 1.4437-17.886 4.7676-20.664.52105-.42357.92039-.60079 1.3242-.61523z"
       fill="#fff"
       transform="matrix(.26458 0 0 .26458 0 161.53)"
       id="path282" />
  </g>
</svg>
