27,4,0.,42186
27,4,0.25,40834
27,4,0.5,14472
27,4,0.75,2382
27,4,1.,126
27,5,0.,34301
27,5,0.2,40738
27,5,0.4,19740
27,5,0.6,4626
27,5,0.8,570
27,5,1.,25
27,6,0.,27975
27,6,0.17,39348
27,6,0.33,23628
27,6,0.5,7578
27,6,0.67,1353
27,6,0.8300000000000001,116
27,6,1.,2
27,7,0.,22385
27,7,0.14,37255
27,7,0.29,26731
27,7,0.43,10696
27,7,0.5700000000000001,2527
27,7,0.71,381
27,7,0.86,25
27,7,"",""
27,8,0.,17957
27,8,0.12,34498
27,8,0.25,28555
27,8,0.38,13920
27,8,0.5,4155
27,8,0.62,817
27,8,0.75,92
27,8,0.88,6
27,8,"",""
27,9,0.,14528
27,9,0.11,31392
27,9,0.22,29821
27,9,0.33,16579
27,9,0.44,6049
27,9,0.56,1371
27,9,0.67,244
27,9,0.78,14
27,9,0.89,2
27,9,"",""
27,10,0.,11729
27,10,0.1,28101
27,10,0.2,30119
27,10,0.3,19114
27,10,0.4,8076
27,10,0.5,2329
27,10,0.6,468
27,10,0.7000000000000001,57
27,10,0.8,6
27,10,0.9,1
27,10,"",""
27,12,0.,7689
27,12,0.08,21995
27,12,0.17,28819
27,12,0.25,22837
27,12,0.33,12325
27,12,0.42,4710
27,12,0.5,1317
27,12,0.58,268
27,12,0.67,32
27,12,0.75,8
27,12,"",""
27,12,"",""
27,12,"",""
27,13,0.,6196
27,13,0.08,19106
27,13,0.15,27559
27,13,0.23,24032
27,13,0.31,14371
27,13,0.38,6171
27,13,0.46,1990
27,13,0.54,458
27,13,0.62,101
27,13,0.6900000000000001,12
27,13,0.77,2
27,13,0.85,2
27,13,"",""
27,13,"",""
27,17,0.,2545
27,17,0.06,10797
27,17,0.12,20275
27,17,0.18,24563
27,17,0.24,20189
27,17,0.29,12580
27,17,0.35000000000000003,6009
27,17,0.41000000000000003,2217
27,17,0.47000000000000003,634
27,17,0.53,155
27,17,0.59,30
27,17,0.65,5
27,17,0.71,1
27,17,"",""
27,17,"",""
27,17,"",""
27,17,"",""
27,17,"",""
28,4,0.,48740
28,4,0.25,38406
28,4,0.5,11302
28,4,0.75,1480
28,4,1.,72
28,5,0.,40761
28,5,0.2,40097
28,5,0.4,15765
28,5,0.6,3099
28,5,0.8,264
28,5,1.,14
28,6,0.,33973
28,6,0.17,40306
28,6,0.33,19737
28,6,0.5,5170
28,6,0.67,762
28,6,0.8300000000000001,50
28,6,1.,2
28,7,0.,28397
28,7,0.14,39367
28,7,0.29,22984
28,7,0.43,7577
28,7,0.5700000000000001,1483
28,7,0.71,183
28,7,0.86,9
28,7,"",""
28,8,0.,23793
28,8,0.12,37471
28,8,0.25,25519
28,8,0.38,10371
28,8,0.5,2413
28,8,0.62,393
28,8,0.75,39
28,8,0.88,1
28,8,"",""
28,10,0.,16659
28,10,0.1,32599
28,10,0.2,29106
28,10,0.3,15087
28,10,0.4,5118
28,10,0.5,1209
28,10,0.6,200
28,10,0.7000000000000001,21
28,10,0.8,1
28,10,"",""
28,10,"",""
28,12,0.,11557
28,12,0.08,27296
28,12,0.17,29744
28,12,0.25,19355
28,12,0.33,8552
28,12,0.42,2770
28,12,0.5,603
28,12,0.58,118
28,12,0.67,5
28,12,"",""
28,12,"",""
28,12,"",""
28,12,"",""
28,15,0.,6751
28,15,0.07,19928
28,15,0.13,27728
28,15,0.2,23381
28,15,0.27,13652
28,15,0.33,6023
28,15,0.4,1918
28,15,0.47000000000000003,515
28,15,0.53,86
28,15,0.6,17
28,15,0.67,1
28,15,"",""
28,15,"",""
28,15,"",""
28,15,"",""
28,15,"",""
29,4,0.,46094
29,4,0.25,39068
29,4,0.5,12925
29,4,0.75,1816
29,4,1.,97
29,5,0.,37832
29,5,0.2,40805
29,5,0.4,17255
29,5,0.6,3692
29,5,0.8,397
29,5,1.,19
29,6,0.,30791
29,6,0.17,40120
29,6,0.33,21749
29,6,0.5,6219
29,6,0.67,1027
29,6,0.8300000000000001,86
29,6,1.,8
29,7,0.,25386
29,7,0.14,38614
29,7,0.29,24876
29,7,0.43,8970
29,7,0.5700000000000001,1899
29,7,0.71,244
29,7,0.86,11
29,7,"",""
29,8,0.,21181
29,8,0.12,36155
29,8,0.25,27252
29,8,0.38,11627
29,8,0.5,3201
29,8,0.62,522
29,8,0.75,60
29,8,0.88,2
29,8,"",""
29,9,0.,17166
29,9,0.11,33668
29,9,0.22,28751
29,9,0.33,14538
29,9,0.44,4651
29,9,0.56,1046
29,9,0.67,163
29,9,0.78,17
29,9,"",""
29,9,"",""
29,10,0.,14280
29,10,0.1,30439
29,10,0.2,29760
29,10,0.3,17093
29,10,0.4,6451
29,10,0.5,1613
29,10,0.6,318
29,10,0.7000000000000001,44
29,10,0.8,2
29,10,"",""
29,10,"",""
29,11,0.,11547
29,11,0.09,27591
29,11,0.18,29915
29,11,0.27,19293
29,11,0.36,8350
29,11,0.45,2618
29,11,0.55,570
29,11,0.64,104
29,11,0.73,11
29,11,0.8200000000000001,1
29,11,"",""
29,11,"",""
29,13,0.,7944
29,13,0.08,22276
29,13,0.15,28679
29,13,0.23,22646
29,13,0.31,12149
29,13,0.38,4616
29,13,0.46,1382
29,13,0.54,265
29,13,0.62,38
29,13,0.6900000000000001,5
29,13,"",""
29,13,"",""
29,13,"",""
29,13,"",""
29,14,0.,6464
29,14,0.07,19515
29,14,0.14,27320
29,14,0.21,23744
29,14,0.29,14176
29,14,0.36,6158
29,14,0.43,2034
29,14,0.5,478
29,14,0.5700000000000001,96
29,14,0.64,15
29,14,"",""
29,14,"",""
29,14,"",""
29,14,"",""
29,14,"",""
30,4,0.,36547
30,4,0.25,41919
30,4,0.5,17946
30,4,0.75,3357
30,4,1.,231
30,5,0.,28551
30,5,0.2,40644
30,5,0.4,23204
30,5,0.6,6624
30,5,0.8,917
30,5,1.,60
30,6,0.,22190
30,6,0.17,37679
30,6,0.33,27341
30,6,0.5,10329
30,6,0.67,2209
30,6,0.8300000000000001,241
30,6,1.,11
30,7,0.,17084
30,7,0.14,34968
30,7,0.29,29156
30,7,0.43,14165
30,7,0.5700000000000001,3899
30,7,0.71,673
30,7,0.86,54
30,7,1.,1
30,8,0.,13371
30,8,0.12,30493
30,8,0.25,30878
30,8,0.38,17327
30,8,0.5,6327
30,8,0.62,1408
30,8,0.75,179
30,8,0.88,16
30,8,1.,1
30,9,0.,10540
30,9,0.11,26456
30,9,0.22,30843
30,9,0.33,20278
30,9,0.44,8807
30,9,0.56,2522
30,9,0.67,495
30,9,0.78,57
30,9,0.89,2
30,9,"",""
30,10,0.,8152
30,10,0.1,23080
30,10,0.2,29749
30,10,0.3,22486
30,10,0.4,11557
30,10,0.5,3863
30,10,0.6,945
30,10,0.7000000000000001,152
30,10,0.8,16
30,10,"",""
30,10,"",""
30,11,0.,6205
30,11,0.09,19817
30,11,0.18,28378
30,11,0.27,24296
30,11,0.36,13819
30,11,0.45,5549
30,11,0.55,1562
30,11,0.64,311
30,11,0.73,61
30,11,0.8200000000000001,2
30,11,"",""
30,11,"",""
30,16,0.,1751
30,16,0.06,8371
30,16,0.12,17697
30,16,0.19,23073
30,16,0.25,21853
30,16,0.31,14849
30,16,0.38,7779
30,16,0.44,3206
30,16,0.5,1099
30,16,0.56,253
30,16,0.62,58
30,16,0.6900000000000001,10
30,16,0.75,1
30,16,"",""
30,16,"",""
30,16,"",""
30,16,"",""
30,18,0.,1044
30,18,0.06,5677
30,18,0.11,13481
30,18,0.17,20619
30,18,0.22,21571
30,18,0.28,18111
30,18,0.33,11056
30,18,0.39,5479
30,18,0.44,2091
30,18,0.5,648
30,18,0.56,177
30,18,0.61,39
30,18,0.67,5
30,18,0.72,1
30,18,0.78,1
30,18,"",""
30,18,"",""
30,18,"",""
30,18,"",""
31,4,0.,49893
31,4,0.25,37992
31,4,0.5,10792
31,4,0.75,1253
31,4,1.,70
31,5,0.,41857
31,5,0.2,40187
31,5,0.4,14783
31,5,0.6,2917
31,5,0.8,247
31,5,1.,9
31,6,0.,35506
31,6,0.17,40151
31,6,0.33,19002
31,6,0.5,4652
31,6,0.67,637
31,6,0.8300000000000001,52
31,6,"",""
31,7,0.,29672
31,7,0.14,39436
31,7,0.29,22331
31,7,0.43,7041
31,7,0.5700000000000001,1357
31,7,0.71,159
31,7,0.86,4
31,7,"",""
31,8,0.,25002
31,8,0.12,38074
31,8,0.25,24995
31,8,0.38,9448
31,8,0.5,2120
31,8,0.62,333
31,8,0.75,27
31,8,0.88,1
31,8,"",""
31,9,0.,20911
31,9,0.11,35593
31,9,0.22,27284
31,9,0.33,12092
31,9,0.44,3378
31,9,0.56,664
31,9,0.67,74
31,9,0.78,4
31,9,"",""
31,9,"",""
31,10,0.,17533
31,10,0.1,33596
31,10,0.2,28387
31,10,0.3,14526
31,10,0.4,4691
31,10,0.5,1067
31,10,0.6,185
31,10,0.7000000000000001,15
31,10,"",""
31,10,"",""
31,10,"",""
31,11,0.,14889
31,11,0.09,30911
31,11,0.18,29055
31,11,0.27,16647
31,11,0.36,6417
31,11,0.45,1708
31,11,0.55,321
31,11,0.64,50
31,11,0.73,2
31,11,"",""
31,11,"",""
31,11,"",""
31,12,0.,12607
31,12,0.08,28503
31,12,0.17,29249
31,12,0.25,18668
31,12,0.33,8011
31,12,0.42,2319
31,12,0.5,543
31,12,0.58,87
31,12,0.67,12
31,12,0.75,1
31,12,"",""
31,12,"",""
31,12,"",""
31,13,0.,10501
31,13,0.08,25796
31,13,0.15,29307
31,13,0.23,20416
31,13,0.31,9637
31,13,0.38,3332
31,13,0.46,833
31,13,0.54,149
31,13,0.62,25
31,13,0.6900000000000001,4
31,13,"",""
31,13,"",""
31,13,"",""
31,13,"",""
31,17,0.,5231
31,17,0.06,16827
31,17,0.12,25751
31,17,0.18,24293
31,17,0.24,15968
31,17,0.29,7816
31,17,0.35000000000000003,3042
31,17,0.41000000000000003,824
31,17,0.47000000000000003,198
31,17,0.53,46
31,17,0.59,4
31,17,"",""
31,17,"",""
31,17,"",""
31,17,"",""
31,17,"",""
31,17,"",""
31,17,"",""
32,4,0.,42198
32,4,0.25,40685
32,4,0.5,14496
32,4,0.75,2468
32,4,1.,153
32,5,0.,34397
32,5,0.2,40759
32,5,0.4,19510
32,5,0.6,4712
32,5,0.8,595
32,5,1.,27
32,6,0.,27299
32,6,0.17,39544
32,6,0.33,23926
32,6,0.5,7703
32,6,0.67,1389
32,6,0.8300000000000001,133
32,6,1.,6
32,7,0.,22270
32,7,0.14,37164
32,7,0.29,26835
32,7,0.43,10699
32,7,0.5700000000000001,2588
32,7,0.71,408
32,7,0.86,35
32,7,1.,1
32,8,0.,17807
32,8,0.12,34468
32,8,0.25,28639
32,8,0.38,14014
32,8,0.5,4160
32,8,0.62,811
32,8,0.75,98
32,8,0.88,3
32,8,"",""
32,9,0.,14283
32,9,0.11,30812
32,9,0.22,30200
32,9,0.33,16933
32,9,0.44,6014
32,9,0.56,1495
32,9,0.67,247
32,9,0.78,16
32,9,"",""
32,9,"",""
32,10,0.,11687
32,10,0.1,27670
32,10,0.2,30174
32,10,0.3,19445
32,10,0.4,8103
32,10,0.5,2363
32,10,0.6,484
32,10,0.7000000000000001,69
32,10,0.8,4
32,10,0.9,1
32,10,"",""
32,11,0.,9387
32,11,0.09,24743
32,11,0.18,29878
32,11,0.27,21436
32,11,0.36,10227
32,11,0.45,3315
32,11,0.55,856
32,11,0.64,138
32,11,0.73,17
32,11,0.8200000000000001,3
32,11,"",""
32,11,"",""
32,12,0.,7617
32,12,0.08,21803
32,12,0.17,28646
32,12,0.25,23031
32,12,0.33,12623
32,12,0.42,4638
32,12,0.5,1312
32,12,0.58,278
32,12,0.67,44
32,12,0.75,8
32,12,"",""
32,12,"",""
32,12,"",""
32,13,0.,5931
32,13,0.08,18969
32,13,0.15,27427
32,13,0.23,24211
32,13,0.31,14542
32,13,0.38,6327
32,13,0.46,2037
32,13,0.54,463
32,13,0.62,79
32,13,0.6900000000000001,12
32,13,0.77,2
32,13,"",""
32,13,"",""
32,13,"",""
32,15,0.,3967
32,15,0.07,14324
32,15,0.13,23837
32,15,0.2,25067
32,15,0.27,17953
32,15,0.33,9528
32,15,0.4,3833
32,15,0.47000000000000003,1176
32,15,0.53,260
32,15,0.6,46
32,15,0.67,9
32,15,"",""
32,15,"",""
32,15,"",""
32,15,"",""
32,15,"",""
32,16,0.,3216
32,16,0.06,12100
32,16,0.12,22222
32,16,0.19,24910
32,16,0.25,19371
32,16,0.31,11126
32,16,0.38,4879
32,16,0.44,1662
32,16,0.5,414
32,16,0.56,87
32,16,0.62,10
32,16,0.6900000000000001,3
32,16,"",""
32,16,"",""
32,16,"",""
32,16,"",""
32,16,"",""
33,4,0.,37350
33,4,0.25,41750
33,4,0.5,17444
33,4,0.75,3220
33,4,1.,236
33,5,0.,29490
33,5,0.2,40502
33,5,0.4,22741
33,5,0.6,6307
33,5,0.8,907
33,5,1.,53
33,6,0.,22968
33,6,0.17,37982
33,6,0.33,26866
33,6,0.5,9879
33,6,0.67,2053
33,6,0.8300000000000001,243
33,6,1.,9
33,7,0.,17814
33,7,0.14,35021
33,7,0.29,29174
33,7,0.43,13558
33,7,0.5700000000000001,3701
33,7,0.71,662
33,7,0.86,68
33,7,1.,2
33,8,0.,13960
33,8,0.12,31138
33,8,0.25,30606
33,8,0.38,16745
33,8,0.5,5964
33,8,0.62,1377
33,8,0.75,188
33,8,0.88,21
33,8,1.,1
33,9,0.,10887
33,9,0.11,27609
33,9,0.22,30539
33,9,0.33,19785
33,9,0.44,8349
33,9,0.56,2369
33,9,0.67,414
33,9,0.78,45
33,9,0.89,3
33,9,"",""
33,10,0.,8589
33,10,0.1,23866
33,10,0.2,29817
33,10,0.3,22309
33,10,0.4,10882
33,10,0.5,3534
33,10,0.6,854
33,10,0.7000000000000001,133
33,10,0.8,15
33,10,0.9,1
33,10,"",""
33,11,0.,6754
33,11,0.09,20440
33,11,0.18,28410
33,11,0.27,23957
33,11,0.36,13335
33,11,0.45,5313
33,11,0.55,1496
33,11,0.64,250
33,11,0.73,39
33,11,0.8200000000000001,6
33,11,"",""
33,11,"",""
33,12,0.,5215
33,12,0.08,17383
33,12,0.17,26834
33,12,0.25,25123
33,12,0.33,15630
33,12,0.42,6945
33,12,0.5,2240
33,12,0.58,537
33,12,0.67,83
33,12,0.75,8
33,12,0.8300000000000001,2
33,12,"",""
33,12,"",""
33,13,0.,3949
33,13,0.08,14784
33,13,0.15,24915
33,13,0.23,25228
33,13,0.31,17794
33,13,0.38,8864
33,13,0.46,3298
33,13,0.54,945
33,13,0.62,188
33,13,0.6900000000000001,30
33,13,0.77,5
33,13,"",""
33,13,"",""
33,13,"",""
34,4,0.,39484
34,4,0.25,41545
34,4,0.5,15962
34,4,0.75,2817
34,4,1.,192
34,5,0.,31446
34,5,0.2,40967
34,5,0.4,21283
34,5,0.6,5520
34,5,0.8,759
34,5,1.,25
34,6,0.,24890
34,6,0.17,38956
34,6,0.33,25342
34,6,0.5,8869
34,6,0.67,1753
34,6,0.8300000000000001,182
34,6,1.,8
34,7,0.,20029
34,7,0.14,36059
34,7,0.29,28137
34,7,0.43,12082
34,7,0.5700000000000001,3149
34,7,0.71,496
34,7,0.86,48
34,7,"",""
34,8,0.,15920
34,8,0.12,32681
34,8,0.25,29941
34,8,0.38,15324
34,8,0.5,4961
34,8,0.62,1025
34,8,0.75,135
34,8,0.88,13
34,8,"",""
34,9,0.,12332
34,9,0.11,29162
34,9,0.22,30459
34,9,0.33,18520
34,9,0.44,7252
34,9,0.56,1920
34,9,0.67,307
34,9,0.78,47
34,9,0.89,1
34,9,"",""
34,10,0.,9921
34,10,0.1,25976
34,10,0.2,29992
34,10,0.3,20897
34,10,0.4,9506
34,10,0.5,2989
34,10,0.6,611
34,10,0.7000000000000001,102
34,10,0.8,6
34,10,"",""
34,10,"",""
34,11,0.,7800
34,11,0.09,22365
34,11,0.18,29311
34,11,0.27,22808
34,11,0.36,11954
34,11,0.45,4395
34,11,0.55,1114
34,11,0.64,219
34,11,0.73,31
34,11,0.8200000000000001,3
34,11,"",""
34,11,"",""
34,12,0.,6248
34,12,0.08,19717
34,12,0.17,27744
34,12,0.25,24113
34,12,0.33,14035
34,12,0.42,5866
34,12,0.5,1837
34,12,0.58,371
34,12,0.67,63
34,12,0.75,6
34,12,"",""
34,12,"",""
34,12,"",""
34,13,0.,4905
34,13,0.08,16987
34,13,0.15,25924
34,13,0.23,24843
34,13,0.31,16228
34,13,0.38,7697
34,13,0.46,2585
34,13,0.54,689
34,13,0.62,120
34,13,0.6900000000000001,20
34,13,0.77,2
34,13,"",""
34,13,"",""
34,13,"",""
34,14,0.,4060
34,14,0.07,14304
34,14,0.14,23920
34,14,0.21,25132
34,14,0.29,17996
34,14,0.36,9306
34,14,0.43,3799
34,14,0.5,1133
34,14,0.5700000000000001,299
34,14,0.64,46
34,14,0.71,5
34,14,"",""
34,14,"",""
34,14,"",""
34,14,"",""
34,18,0.,1588
34,18,0.06,7116
34,18,0.11,16101
34,18,0.17,22174
34,18,0.22,21882
34,18,0.28,16189
34,18,0.33,8952
34,18,0.39,4023
34,18,0.44,1430
34,18,0.5,418
34,18,0.56,107
34,18,0.61,15
34,18,0.67,3
34,18,0.72,2
34,18,"",""
34,18,"",""
34,18,"",""
34,18,"",""
34,18,"",""
35,4,0.,34729
35,4,0.25,42032
35,4,0.5,18997
35,4,0.75,3948
35,4,1.,294
35,5,0.,26137
35,5,0.2,40482
35,5,0.4,24631
35,5,0.6,7535
35,5,0.8,1153
35,5,1.,62
35,6,0.,20315
35,6,0.17,36884
35,6,0.33,28158
35,6,0.5,11646
35,6,0.67,2673
35,6,0.8300000000000001,307
35,6,1.,17
35,7,0.,15598
35,7,0.14,33232
35,7,0.29,30265
35,7,0.43,15266
35,7,0.5700000000000001,4668
35,7,0.71,867
35,7,0.86,100
35,7,1.,4
35,8,0.,11836
35,8,0.12,29176
35,8,0.25,31015
35,8,0.38,18790
35,8,0.5,7127
35,8,0.62,1754
35,8,0.75,282
35,8,0.88,20
35,8,"",""
35,9,0.,9146
35,9,0.11,24917
35,9,0.22,30444
35,9,0.33,21854
35,9,0.44,9821
35,9,0.56,3074
35,9,0.67,642
35,9,0.78,97
35,9,0.89,5
35,9,"",""
35,10,0.,6942
35,10,0.1,21292
35,10,0.2,29139
35,10,0.3,23710
35,10,0.4,12812
35,10,0.5,4694
35,10,0.6,1176
35,10,0.7000000000000001,211
35,10,0.8,23
35,10,0.9,1
35,10,"",""
35,11,0.,5340
35,11,0.09,17995
35,11,0.18,27216
35,11,0.27,25004
35,11,0.36,15424
35,11,0.45,6547
35,11,0.55,1987
35,11,0.64,430
35,11,0.73,55
35,11,0.8200000000000001,2
35,11,"",""
35,11,"",""
35,12,0.,4090
35,12,0.08,15191
35,12,0.17,25260
35,12,0.25,25396
35,12,0.33,17477
35,12,0.42,8640
35,12,0.5,2993
35,12,0.58,789
35,12,0.67,152
35,12,0.75,11
35,12,0.8300000000000001,1
35,12,"",""
35,12,"",""
35,13,0.,3113
35,13,0.08,12359
35,13,0.15,23007
35,13,0.23,25486
35,13,0.31,19288
35,13,0.38,10654
35,13,0.46,4376
35,13,0.54,1352
35,13,0.62,299
35,13,0.6900000000000001,59
35,13,0.77,7
35,13,"",""
35,13,"",""
35,13,"",""
35,19,0.,640
35,19,0.05,3758
35,19,0.11,10024
35,19,0.16,17609
35,19,0.21,21246
35,19,0.26,19450
35,19,0.32,13903
35,19,0.37,7888
35,19,0.42,3602
35,19,0.47000000000000003,1368
35,19,0.53,372
35,19,0.58,112
35,19,0.63,24
35,19,0.68,2
35,19,0.74,2
35,19,"",""
35,19,"",""
35,19,"",""
35,19,"",""
35,19,"",""
36,4,0.,26448
36,4,0.25,41762
36,4,0.5,24596
36,4,0.75,6558
36,4,1.,636
36,5,0.,18853
36,5,0.2,37292
36,5,0.4,29670
36,5,0.6,11669
36,5,0.8,2325
36,5,1.,191
36,6,0.,13319
36,6,0.17,32122
36,6,0.33,31752
36,6,0.5,17037
36,6,0.67,4956
36,6,0.8300000000000001,765
36,6,1.,49
36,7,0.,9733
36,7,0.14,26886
36,7,0.29,31727
36,7,0.43,20921
36,7,0.5700000000000001,8446
36,7,0.71,2037
36,7,0.86,240
36,7,1.,10
36,8,0.,6972
36,8,0.12,22025
36,8,0.25,30504
36,8,0.38,24144
36,8,0.5,11798
36,8,0.62,3754
36,8,0.75,731
36,8,0.88,71
36,8,1.,1
36,9,0.,4960
36,9,0.11,17423
36,9,0.22,28253
36,9,0.33,26134
36,9,0.44,15182
36,9,0.56,6164
36,9,0.67,1572
36,9,0.78,281
36,9,0.89,29
36,9,1.,2
36,10,0.,3664
36,10,0.1,13941
36,10,0.2,25224
36,10,0.3,26494
36,10,0.4,18180
36,10,0.5,8820
36,10,0.6,2894
36,10,0.7000000000000001,671
36,10,0.8,103
36,10,0.9,8
36,10,1.,1
36,13,0.,1285
36,13,0.08,6630
36,13,0.15,16049
36,13,0.23,23298
36,13,0.31,22989
36,13,0.38,16506
36,13,0.46,8528
36,13,0.54,3423
36,13,0.62,1011
36,13,0.6900000000000001,235
36,13,0.77,44
36,13,0.85,2
36,13,"",""
36,13,"",""
36,14,0.,985
36,14,0.07,5347
36,14,0.14,13110
36,14,0.21,21303
36,14,0.29,23118
36,14,0.36,18096
36,14,0.43,10791
36,14,0.5,4953
36,14,0.5700000000000001,1728
36,14,0.64,450
36,14,0.71,99
36,14,0.79,19
36,14,0.86,1
36,14,"",""
36,14,"",""
36,15,0.,630
36,15,0.07,4023
36,15,0.13,11002
36,15,0.2,19003
36,15,0.27,22441
36,15,0.33,19592
36,15,0.4,12975
36,15,0.47000000000000003,6687
36,15,0.53,2613
36,15,0.6,798
36,15,0.67,189
36,15,0.73,43
36,15,0.8,3
36,15,0.87,1
36,15,"",""
36,15,"",""
36,18,0.,266
36,18,0.06,1722
36,18,0.11,5910
36,18,0.17,12451
36,18,0.22,18422
36,18,0.28,20703
36,18,0.33,17780
36,18,0.39,11838
36,18,0.44,6638
36,18,0.5,2891
36,18,0.56,1030
36,18,0.61,281
36,18,0.67,57
36,18,0.72,11
36,18,"",""
36,18,"",""
36,18,"",""
36,18,"",""
36,18,"",""
37,4,0.,18331
37,4,0.25,39048
37,4,0.5,30669
37,4,0.75,10522
37,4,1.,1430
37,5,0.,12453
37,5,0.2,31656
37,5,0.4,33341
37,5,0.6,17541
37,5,0.8,4524
37,5,1.,485
37,6,0.,7981
37,6,0.17,25223
37,6,0.33,32893
37,6,0.5,22843
37,6,0.67,8973
37,6,0.8300000000000001,1885
37,6,1.,202
37,7,0.,5061
37,7,0.14,19332
37,7,0.29,30220
37,7,0.43,26423
37,7,0.5700000000000001,13806
37,7,0.71,4283
37,7,0.86,817
37,7,1.,58
37,8,0.,3400
37,8,0.12,14417
37,8,0.25,26655
37,8,0.38,27542
37,8,0.5,18125
37,8,0.62,7652
37,8,0.75,1918
37,8,0.88,278
37,8,1.,13
37,9,0.,2191
37,9,0.11,10721
37,9,0.22,22214
37,9,0.33,27274
37,9,0.44,21441
37,9,0.56,11303
37,9,0.67,3836
37,9,0.78,902
37,9,0.89,108
37,9,1.,10
37,10,0.,1524
37,10,0.1,7665
37,10,0.2,18322
37,10,0.3,25317
37,10,0.4,23464
37,10,0.5,14830
37,10,0.6,6453
37,10,0.7000000000000001,1964
37,10,0.8,428
37,10,0.9,32
37,10,1.,1
37,11,0.,911
37,11,0.09,5682
37,11,0.18,14532
37,11,0.27,23082
37,11,0.36,24198
37,11,0.45,17583
37,11,0.55,9462
37,11,0.64,3445
37,11,0.73,909
37,11,0.8200000000000001,181
37,11,0.91,15
37,11,"",""
37,12,0.,637
37,12,0.08,3779
37,12,0.17,11433
37,12,0.25,20145
37,12,0.33,24004
37,12,0.42,19909
37,12,0.5,12315
37,12,0.58,5450
37,12,0.67,1808
37,12,0.75,443
37,12,0.8300000000000001,72
37,12,0.92,5
37,12,"",""
37,13,0.,389
37,13,0.08,2784
37,13,0.15,8912
37,13,0.23,17125
37,13,0.31,22363
37,13,0.38,21452
37,13,0.46,14979
37,13,0.54,7837
37,13,0.62,3057
37,13,0.6900000000000001,866
37,13,0.77,209
37,13,0.85,24
37,13,0.92,3
37,13,"",""
37,14,0.,265
37,14,0.07,2009
37,14,0.14,6810
37,14,0.21,14258
37,14,0.29,20618
37,14,0.36,21823
37,14,0.43,17078
37,14,0.5,10161
37,14,0.5700000000000001,4745
37,14,0.64,1686
37,14,0.71,438
37,14,0.79,95
37,14,0.86,14
37,14,"",""
37,14,"",""
37,15,0.,184
37,15,0.07,1403
37,15,0.13,5240
37,15,0.2,11648
37,15,0.27,18470
37,15,0.33,21309
37,15,0.4,18657
37,15,0.47000000000000003,12700
37,15,0.53,6645
37,15,0.6,2675
37,15,0.67,819
37,15,0.73,212
37,15,0.8,34
37,15,0.87,3
37,15,0.93,1
37,15,"",""
38,4,0.,13697
38,4,0.25,35059
38,4,0.5,34034
38,4,0.75,14770
38,4,1.,2440
38,5,0.,8363
38,5,0.2,26324
38,5,0.4,34810
38,5,0.6,22364
38,5,0.8,7177
38,5,1.,962
38,6,0.,4974
38,6,0.17,19464
38,6,0.33,31371
38,6,0.5,27233
38,6,0.67,13233
38,6,0.8300000000000001,3326
38,6,1.,399
38,7,0.,3018
38,7,0.14,13988
38,7,0.29,26718
38,7,0.43,28502
38,7,0.5700000000000001,18725
38,7,0.71,7361
38,7,0.86,1527
38,7,1.,161
38,8,0.,1866
38,8,0.12,9374
38,8,0.25,21437
38,8,0.38,28151
38,8,0.5,22866
38,8,0.62,11811
38,8,0.75,3760
38,8,0.88,669
38,8,1.,66
38,9,0.,1191
38,9,0.11,6655
38,9,0.22,16897
38,9,0.33,25289
38,9,0.44,24737
38,9,0.56,16146
38,9,0.67,6849
38,9,0.78,1893
38,9,0.89,310
38,9,1.,33
38,10,0.,687
38,10,0.1,4409
38,10,0.2,12840
38,10,0.3,21922
38,10,0.4,25143
38,10,0.5,19529
38,10,0.6,10432
38,10,0.7000000000000001,3936
38,10,0.8,943
38,10,0.9,152
38,10,1.,7
38,11,0.,353
38,11,0.09,3069
38,11,0.18,9321
38,11,0.27,18573
38,11,0.36,24122
38,11,0.45,21759
38,11,0.55,13885
38,11,0.64,6305
38,11,0.73,2087
38,11,0.8200000000000001,458
38,11,0.91,62
38,11,1.,6
38,12,0.,263
38,12,0.08,1893
38,12,0.17,6887
38,12,0.25,15112
38,12,0.33,21824
38,12,0.42,22461
38,12,0.5,17021
38,12,0.58,9390
38,12,0.67,3773
38,12,0.75,1160
38,12,0.8300000000000001,194
38,12,0.92,22
38,12,"",""
38,14,0.,85
38,14,0.07,852
38,14,0.14,3596
38,14,0.21,8927
38,14,0.29,16070
38,14,0.36,21003
38,14,0.43,20478
38,14,0.5,15172
38,14,0.5700000000000001,8638
38,14,0.64,3648
38,14,0.71,1228
38,14,0.79,254
38,14,0.86,41
38,14,0.93,8
38,14,"",""
38,15,0.,52
38,15,0.07,594
38,15,0.13,2352
38,15,0.2,6941
38,15,0.27,13398
38,15,0.33,19172
38,15,0.4,20499
38,15,0.47000000000000003,17425
38,15,0.53,11021
38,15,0.6,5584
38,15,0.67,2127
38,15,0.73,652
38,15,0.8,162
38,15,0.87,21
38,15,"",""
38,15,"",""
39,4,0.,8777
39,4,0.25,29325
39,4,0.5,37005
39,4,0.75,20650
39,4,1.,4243
39,5,0.,4773
39,5,0.2,20198
39,5,0.4,33480
39,5,0.6,28064
39,5,0.8,11450
39,5,1.,2035
39,6,0.,2682
39,6,0.17,13222
39,6,0.33,27217
39,6,0.5,30579
39,6,0.67,19160
39,6,0.8300000000000001,6303
39,6,1.,837
39,7,0.,1500
39,7,0.14,8366
39,7,0.29,20767
39,7,0.43,29499
39,7,0.5700000000000001,24157
39,7,0.71,11904
39,7,0.86,3429
39,7,1.,378
39,8,0.,796
39,8,0.12,5103
39,8,0.25,15162
39,8,0.38,25400
39,8,0.5,26890
39,8,0.62,17431
39,8,0.75,7254
39,8,0.88,1788
39,8,1.,176
39,9,0.,429
39,9,0.11,3204
39,9,0.22,10516
39,9,0.33,20723
39,9,0.44,25917
39,9,0.56,21770
39,9,0.67,12087
39,9,0.78,4349
39,9,0.89,914
39,9,1.,91
39,10,0.,231
39,10,0.1,1928
39,10,0.2,7193
39,10,0.3,16138
39,10,0.4,23474
39,10,0.5,23680
39,10,0.6,16724
39,10,0.7000000000000001,7805
39,10,0.8,2347
39,10,0.9,443
39,10,1.,37
39,11,0.,154
39,11,0.09,1165
39,11,0.18,4902
39,11,0.27,12108
39,11,0.36,20277
39,11,0.45,23419
39,11,0.55,19776
39,11,0.64,11771
39,11,0.73,4839
39,11,0.8200000000000001,1364
39,11,0.91,212
39,11,1.,13
39,12,0.,78
39,12,0.08,671
39,12,0.17,3221
39,12,0.25,8679
39,12,0.33,16539
39,12,0.42,21822
39,12,0.5,21566
39,12,0.58,15558
39,12,0.67,7945
39,12,0.75,3082
39,12,0.8300000000000001,731
39,12,0.92,101
39,12,1.,7
39,13,0.,42
39,13,0.08,412
39,13,0.15,1991
39,13,0.23,6106
39,13,0.31,13082
39,13,0.38,19515
39,13,0.46,21809
39,13,0.54,18179
39,13,0.62,11388
39,13,0.6900000000000001,5276
39,13,0.77,1745
39,13,0.85,389
39,13,0.92,63
39,13,1.,3
39,14,0.,18
39,14,0.07,254
39,14,0.14,1257
39,14,0.21,4234
39,14,0.29,9796
39,14,0.36,16543
39,14,0.43,20859
39,14,0.5,19608
39,14,0.5700000000000001,14693
39,14,0.64,8063
39,14,0.71,3384
39,14,0.79,1047
39,14,0.86,213
39,14,0.93,30
39,14,1.,1
39,15,0.,8
39,15,0.07,145
39,15,0.13,813
39,15,0.2,3029
39,15,0.27,7329
39,15,0.33,13651
39,15,0.4,18750
39,15,0.47000000000000003,20348
39,15,0.53,16753
39,15,0.6,10898
39,15,0.67,5511
39,15,0.73,2081
39,15,0.8,579
39,15,0.87,88
39,15,0.93,16
39,15,1.,1
40,4,0.,7766
40,4,0.25,27838
40,4,0.5,37425
40,4,0.75,22086
40,4,1.,4885
40,5,0.,4100
40,5,0.2,18437
40,5,0.4,32793
40,5,0.6,29268
40,5,0.8,13120
40,5,1.,2282
40,6,0.,2281
40,6,0.17,11701
40,6,0.33,25996
40,6,0.5,31045
40,6,0.67,20480
40,6,0.8300000000000001,7405
40,6,1.,1092
40,7,0.,1174
40,7,0.14,7213
40,7,0.29,19313
40,7,0.43,28737
40,7,0.5700000000000001,25465
40,7,0.71,13552
40,7,0.86,4016
40,7,1.,530
40,8,0.,585
40,8,0.12,4315
40,8,0.25,13700
40,8,0.38,24630
40,8,0.5,26685
40,8,0.62,19028
40,8,0.75,8611
40,8,0.88,2204
40,8,1.,242
40,9,0.,341
40,9,0.11,2607
40,9,0.22,9145
40,9,0.33,19421
40,9,0.44,25596
40,9,0.56,22901
40,9,0.67,13454
40,9,0.78,5213
40,9,0.89,1194
40,9,1.,128
40,10,0.,156
40,10,0.1,1615
40,10,0.2,6113
40,10,0.3,14376
40,10,0.4,22865
40,10,0.5,23839
40,10,0.6,18049
40,10,0.7000000000000001,9222
40,10,0.8,3118
40,10,0.9,610
40,10,1.,37
40,11,0.,88
40,11,0.09,881
40,11,0.18,3857
40,11,0.27,10418
40,11,0.36,18567
40,11,0.45,23728
40,11,0.55,20839
40,11,0.64,13458
40,11,0.73,6023
40,11,0.8200000000000001,1831
40,11,0.91,291
40,11,1.,19
40,12,0.,46
40,12,0.08,549
40,12,0.17,2474
40,12,0.25,7357
40,12,0.33,14903
40,12,0.42,21094
40,12,0.5,22324
40,12,0.58,16857
40,12,0.67,9434
40,12,0.75,3758
40,12,0.8300000000000001,1032
40,12,0.92,161
40,12,1.,11
40,13,0.,28
40,13,0.08,315
40,13,0.15,1529
40,13,0.23,5182
40,13,0.31,11316
40,13,0.38,18314
40,13,0.46,21654
40,13,0.54,19328
40,13,0.62,13020
40,13,0.6900000000000001,6384
40,13,0.77,2314
40,13,0.85,539
40,13,0.92,74
40,13,1.,3
40,14,0.,15
40,14,0.07,145
40,14,0.14,998
40,14,0.21,3417
40,14,0.29,8474
40,14,0.36,14915
40,14,0.43,20088
40,14,0.5,20576
40,14,0.5700000000000001,15934
40,14,0.64,9555
40,14,0.71,4176
40,14,0.79,1317
40,14,0.86,342
40,14,0.93,46
40,14,1.,2
41,4,0.,5973
41,4,0.25,24129
41,4,0.5,37179
41,4,0.75,26059
41,4,1.,6660
41,5,0.,3052
41,5,0.2,14927
41,5,0.4,31055
41,5,0.6,31515
41,5,0.8,16188
41,5,1.,3263
41,6,0.,1413
41,6,0.17,8581
41,6,0.33,22810
41,6,0.5,31546
41,6,0.67,24157
41,6,0.8300000000000001,9765
41,6,1.,1728
41,7,0.,739
41,7,0.14,5021
41,7,0.29,15739
41,7,0.43,26951
41,7,0.5700000000000001,27731
41,7,0.71,17005
41,7,0.86,5915
41,7,1.,899
41,8,0.,343
41,8,0.12,2965
41,8,0.25,10406
41,8,0.38,21110
41,8,0.5,27278
41,8,0.62,22380
41,8,0.75,11634
41,8,0.88,3427
41,8,1.,457
41,9,0.,167
41,9,0.11,1539
41,9,0.22,6555
41,9,0.33,15732
41,9,0.44,24141
41,9,0.56,25000
41,9,0.67,17072
41,9,0.78,7609
41,9,0.89,1955
41,9,1.,230
41,12,0.,18
41,12,0.08,296
41,12,0.17,1474
41,12,0.25,4815
41,12,0.33,11399
41,12,0.42,18668
41,12,0.5,22384
41,12,0.58,19790
41,12,0.67,12931
41,12,0.75,6009
41,12,0.8300000000000001,1875
41,12,0.92,320
41,12,1.,21
41,13,0.,10
41,13,0.08,123
41,13,0.15,819
41,13,0.23,3024
41,13,0.31,8059
41,13,0.38,15097
41,13,0.46,20681
41,13,0.54,21370
41,13,0.62,16391
41,13,0.6900000000000001,9392
41,13,0.77,3772
41,13,0.85,1059
41,13,0.92,191
41,13,1.,12
41,17,0.,1
41,17,0.06,11
41,17,0.12,81
41,17,0.18,460
41,17,0.24,1652
41,17,0.29,4339
41,17,0.35000000000000003,8737
41,17,0.41000000000000003,14148
41,17,0.47000000000000003,18194
41,17,0.53,18684
41,17,0.59,15468
41,17,0.65,10207
41,17,0.71,5172
41,17,0.76,2055
41,17,0.8200000000000001,639
41,17,0.88,137
41,17,0.9400000000000001,13
41,17,1.,2
42,4,0.,1651
42,4,0.25,11813
42,4,0.5,31814
42,4,0.75,37891
42,4,1.,16831
42,5,0.,562
42,5,0.2,5309
42,5,0.4,18651
42,5,0.6,33873
42,5,0.8,30656
42,5,1.,10949
42,6,0.,196
42,6,0.17,2330
42,6,0.33,10101
42,6,0.5,24414
42,6,0.67,32371
42,6,0.8300000000000001,23681
42,6,1.,6907
42,7,0.,86
42,7,0.14,981
42,7,0.29,5080
42,7,0.43,15423
42,7,0.5700000000000001,27458
42,7,0.71,29289
42,7,0.86,17384
42,7,1.,4299
42,8,0.,30
42,8,0.12,421
42,8,0.25,2436
42,8,0.38,8790
42,8,0.5,19675
42,8,0.62,27759
42,8,0.75,25248
42,8,0.88,12835
42,8,1.,2806
42,9,0.,13
42,9,0.11,180
42,9,0.22,1132
42,9,0.33,4697
42,9,0.44,12606
42,9,0.56,22602
42,9,0.67,27017
42,9,0.78,20689
42,9,0.89,9293
42,9,1.,1771
42,10,0.,1
42,10,0.1,62
42,10,0.2,524
42,10,0.3,2498
42,10,0.4,7506
42,10,0.5,16109
42,10,0.6,24318
42,10,0.7000000000000001,24661
42,10,0.8,16461
42,10,0.9,6629
42,10,1.,1231
42,11,0.09,25
42,11,0.18,211
42,11,0.27,1228
42,11,0.36,4279
42,11,0.45,10597
42,11,0.55,19168
42,11,0.64,24506
42,11,0.73,21812
42,11,0.8200000000000001,12877
42,11,0.91,4534
42,11,1.,763
42,11,"",""
42,12,0.08,10
42,12,0.17,89
42,12,0.25,553
42,12,0.33,2358
42,12,0.42,6525
42,12,0.5,13719
42,12,0.58,20914
42,12,0.67,23355
42,12,0.75,18772
42,12,0.8300000000000001,9950
42,12,0.92,3275
42,12,1.,480
42,12,"",""
42,14,0.14,15
42,14,0.21,118
42,14,0.29,572
42,14,0.36,2061
42,14,0.43,5788
42,14,0.5,11888
42,14,0.5700000000000001,18263
42,14,0.64,21791
42,14,0.71,19472
42,14,0.79,12578
42,14,0.86,5698
42,14,0.93,1561
42,14,1.,195
42,14,"",""
42,14,"",""
43,4,0.,903
43,4,0.25,8266
43,4,0.5,27314
43,4,0.75,41008
43,4,1.,22509
43,5,0.,317
43,5,0.2,3194
43,5,0.4,14187
43,5,0.6,31519
43,5,0.8,35133
43,5,1.,15650
43,6,0.,96
43,6,0.17,1209
43,6,0.33,6618
43,6,0.5,19418
43,6,0.67,32637
43,6,0.8300000000000001,29322
43,6,1.,10700
43,7,0.,35
43,7,0.14,423
43,7,0.29,2968
43,7,0.43,10663
43,7,0.5700000000000001,23980
43,7,0.71,31552
43,7,0.86,23001
43,7,1.,7378
43,8,0.,9
43,8,0.12,156
43,8,0.25,1152
43,8,0.38,5291
43,8,0.5,14639
43,8,0.62,26228
43,8,0.75,28930
43,8,0.88,18492
43,8,1.,5103
43,9,0.,7
43,9,0.11,53
43,9,0.22,478
43,9,0.33,2369
43,9,0.44,8233
43,9,0.56,18094
43,9,0.67,26916
43,9,0.78,25919
43,9,0.89,14376
43,9,1.,3555
43,10,0.,1
43,10,0.1,16
43,10,0.2,196
43,10,0.3,1055
43,10,0.4,4289
43,10,0.5,11477
43,10,0.6,20909
43,10,0.7000000000000001,26569
43,10,0.8,22244
43,10,0.9,10878
43,10,1.,2366
44,4,0.,760
44,4,0.25,7424
44,4,0.5,26454
44,4,0.75,41393
44,4,1.,23969
44,5,0.,210
44,5,0.2,2832
44,5,0.4,13100
44,5,0.6,30817
44,5,0.8,36042
44,5,1.,16999
44,6,0.,64
44,6,0.17,1026
44,6,0.33,5917
44,6,0.5,18606
44,6,0.67,32338
44,6,0.8300000000000001,30177
44,6,1.,11872
44,7,0.,21
44,7,0.14,362
44,7,0.29,2382
44,7,0.43,9561
44,7,0.5700000000000001,22658
44,7,0.71,31919
44,7,0.86,24919
44,7,1.,8178
44,8,0.,9
44,8,0.12,121
44,8,0.25,1044
44,8,0.38,4589
44,8,0.5,13541
44,8,0.62,25143
44,8,0.75,29932
44,8,0.88,19792
44,8,1.,5829
44,9,0.,1
44,9,0.11,38
44,9,0.22,361
44,9,0.33,2059
44,9,0.44,7307
44,9,0.56,17098
44,9,0.67,26771
44,9,0.78,26784
44,9,0.89,15500
44,9,1.,4081
44,10,0.1,14
44,10,0.2,159
44,10,0.3,831
44,10,0.4,3681
44,10,0.5,10239
44,10,0.6,20115
44,10,0.7000000000000001,26654
44,10,0.8,23337
44,10,0.9,12130
44,10,1.,2840
44,10,"",""
44,12,0.08,3
44,12,0.17,14
44,12,0.25,152
44,12,0.33,744
44,12,0.42,2870
44,12,0.5,7850
44,12,0.58,15755
44,12,0.67,22904
44,12,0.75,24003
44,12,0.8300000000000001,16995
44,12,0.92,7265
44,12,1.,1445
44,12,"",""
44,17,0.18,2
44,17,0.24,12
44,17,0.29,59
44,17,0.35000000000000003,233
44,17,0.41000000000000003,872
44,17,0.47000000000000003,2635
44,17,0.53,6404
44,17,0.59,11864
44,17,0.65,17692
44,17,0.71,20733
44,17,0.76,18917
44,17,0.8200000000000001,12657
44,17,0.88,5937
44,17,0.9400000000000001,1763
44,17,1.,220
44,17,"",""
44,17,"",""
44,17,"",""
