group,cases,sum_eggs,eggPercase,noError_prop,acrocentricError_prop,metacentric_prop,submetacentric_prop,sexchr_prop,twoErrors_prop,complex_prop
27,90,394,4.37777777777778,0.807106598984772,0.0355329949238579,0.0253807106598985,0.065989847715736,0.0050761421319797,0.0304568527918782,0.0304568527918782
28,74,317,4.28378378378378,0.83596214511041,0.0473186119873817,0.0220820189274448,0.0378548895899054,0.00630914826498423,0.028391167192429,0.0220820189274448
29,60,282,4.7,0.822695035460993,0.0531914893617021,0.0319148936170213,0.0319148936170213,0,0.0319148936170213,0.0283687943262411
30,90,405,4.5,0.777777777777778,0.0567901234567901,0.054320987654321,0.0419753086419753,0.00493827160493827,0.0320987654320988,0.0320987654320988
31,98,390,3.97959183673469,0.841025641025641,0.041025641025641,0.0282051282051282,0.0358974358974359,0.00769230769230769,0.0282051282051282,0.0179487179487179
32,129,573,4.44186046511628,0.806282722513089,0.0506108202443281,0.0418848167539267,0.0331588132635253,0.00698080279232112,0.0331588132635253,0.0279232111692845
33,143,578,4.04195804195804,0.782006920415225,0.0743944636678201,0.0484429065743945,0.0380622837370242,0.00519031141868512,0.0242214532871972,0.027681660899654
34,170,765,4.5,0.793464052287582,0.0588235294117647,0.0535947712418301,0.0444444444444444,0.0104575163398693,0.0235294117647059,0.0156862745098039
35,196,856,4.36734693877551,0.766355140186916,0.066588785046729,0.0654205607476635,0.0408878504672897,0.00233644859813084,0.0338785046728972,0.0245327102803738
36,234,923,3.94444444444444,0.71614301191766,0.107258938244854,0.0541711809317443,0.0390032502708559,0.00650054171180932,0.0400866738894908,0.0368364030335861
37,226,915,4.04867256637168,0.655737704918033,0.104918032786885,0.0601092896174863,0.0688524590163934,0.00655737704918033,0.0546448087431694,0.0491803278688525
38,263,978,3.71863117870722,0.607361963190184,0.149284253578732,0.0582822085889571,0.0695296523517382,0.00511247443762781,0.0623721881390593,0.0480572597137014
39,235,890,3.78723404255319,0.544943820224719,0.149438202247191,0.0820224719101124,0.0775280898876405,0.00674157303370787,0.0853932584269663,0.0539325842696629
40,253,906,3.58102766798419,0.528697571743929,0.116997792494481,0.08719646799117,0.0949227373068433,0.0011037527593819,0.105960264900662,0.065121412803532
41,231,694,3.004329004329,0.492795389048991,0.148414985590778,0.0749279538904899,0.0821325648414986,0.00576368876080692,0.126801152737752,0.069164265129683
42,182,591,3.24725274725275,0.358714043993232,0.150592216582064,0.0812182741116751,0.0998307952622673,0.00169204737732657,0.165820642978003,0.142131979695431
43,124,342,2.75806451612903,0.309941520467836,0.172514619883041,0.0672514619883041,0.0964912280701754,0,0.187134502923977,0.166666666666667
44,122,358,2.9344262295082,0.298882681564246,0.11731843575419,0.0474860335195531,0.0837988826815642,0.00279329608938547,0.17877094972067,0.270949720670391
