{
    "id": "6dae50fa-cae0-11e7-80b6-8d86701fdd2f",
    "voucher_id": "6dae40fa-cae0-11e7-80b6-8c85901eed2e",
    "client_id": "6cde40fa-cae0-11e8-80b6-8c85901eed2e",
    "amount": "10.53",
    "order_number": "ORDER-62642",
    "type": "charge",
    "created_at": "2017-07-21T17:32:28Z",
    "updated_at": "2017-07-21T17:32:28Z"
}
