{
    "id": "da39a3ee5eb28b7392ef5",
    "client_group_id": "cff8784e5eb28b81ca02a",
    "name": "Test-Client",
    "secret": "VrhgrKVDTqjg1GVr3R6Juvx7FfHQK7Psim7ORAXm",
    "scopes": [
        "can_use"
    ],
    "created_at": "2017-07-21T17:32:28Z",
    "updated_at": "2017-07-21T17:32:28Z",
    "connected_at": "2017-07-21T17:32:28Z"
}
