%YAML 1.1
%TAG !u! tag:unity3d.com,2011:
--- !u!21 &2100000
Material:
  serializedVersion: 3
  m_ObjectHideFlags: 0
  m_PrefabParentObject: {fileID: 0}
  m_PrefabInternal: {fileID: 0}
  m_Name: TestMat_Metal_RustyDull
  m_Shader: {fileID: 4800000, guid: 400a16de57a637f468dab1f38afbe96f, type: 3}
  m_ShaderKeywords: []
  m_CustomRenderQueue: -1
  m_SavedProperties:
    serializedVersion: 2
    m_TexEnvs:
      data:
        first:
          name: _MainTex
        second:
          m_Texture: {fileID: 2800000, guid: 8a97cf9e4ec150c4daccccadaaf0b813, type: 3}
          m_Scale: {x: 1, y: 1}
          m_Offset: {x: 0, y: 0}
      data:
        first:
          name: _BumpMap
        second:
          m_Texture: {fileID: 2800000, guid: 5baab0abccc10954780529c71f1c38e5, type: 3}
          m_Scale: {x: 1, y: 1}
          m_Offset: {x: 0, y: 0}
      data:
        first:
          name: _Cube
        second:
          m_Texture: {fileID: 8900000, guid: 65a7d442f1932344384c29c6fecc89c6, type: 2}
          m_Scale: {x: 1, y: 1}
          m_Offset: {x: 0, y: 0}
      data:
        first:
          name: _Spec_Gloss_Reflec_Masks
        second:
          m_Texture: {fileID: 2800000, guid: 981c0c82a6bc9a9468cf524fb2e14164, type: 3}
          m_Scale: {x: 1, y: 1}
          m_Offset: {x: 0, y: 0}
      data:
        first:
          name: _Diffuse
        second:
          m_Texture: {fileID: 0}
          m_Scale: {x: 1, y: 1}
          m_Offset: {x: 0, y: 0}
    m_Floats:
      data:
        first:
          name: _Reflection
        second: .358208954
      data:
        first:
          name: _Shininess
        second: 1.66119409
      data:
        first:
          name: _Gloss
        second: .358208925
      data:
        first:
          name: _FrezPow
        second: .701492548
      data:
        first:
          name: _FrezFalloff
        second: 1.64179099
      data:
        first:
          name: _Metalics
        second: .641791046
      data:
        first:
          name: _EdgeAlpha
        second: 0
      data:
        first:
          name: _Density
        second: -.119925372
      data:
        first:
          name: _Bounds
        second: 1
      data:
        first:
          name: _RefScale
        second: 1
    m_Colors:
      data:
        first:
          name: _Color
        second: {r: .423529416, g: .423529416, b: .423529416, a: 1}
      data:
        first:
          name: _SpecColor
        second: {r: 1, g: 1, b: 1, a: 1}
      data:
        first:
          name: _ReflectColor
        second: {r: 1, g: 1, b: 1, a: .5}
--- !u!1002 &2100001
EditorExtensionImpl:
  serializedVersion: 6
