%YAML 1.1
%TAG !u! tag:unity3d.com,2011:
--- !u!21 &2100000
Material:
  serializedVersion: 3
  m_ObjectHideFlags: 0
  m_PrefabParentObject: {fileID: 0}
  m_PrefabInternal: {fileID: 0}
  m_Name: fixation
  m_Shader: {fileID: 4800000, guid: 85837419f9a08f440a3ade2bcff13911, type: 3}
  m_ShaderKeywords: []
  m_CustomRenderQueue: -1
  m_SavedProperties:
    serializedVersion: 2
    m_TexEnvs:
      data:
        first:
          name: _MainTex
        second:
          m_Texture: {fileID: 0}
          m_Scale: {x: 1, y: 1}
          m_Offset: {x: 0, y: 0}
      data:
        first:
          name: _BumpMap
        second:
          m_Texture: {fileID: 2800000, guid: 0023b90661cc6b24b83491b428a71e50, type: 3}
          m_Scale: {x: 1, y: 1}
          m_Offset: {x: 0, y: 0}
      data:
        first:
          name: _Cube
        second:
          m_Texture: {fileID: 8900000, guid: 4f4191f418e71054f9993e34de56d91d, type: 2}
          m_Scale: {x: 1, y: 1}
          m_Offset: {x: 0, y: 0}
      data:
        first:
          name: _Spec_Gloss_Reflec_Masks
        second:
          m_Texture: {fileID: 2800000, guid: 61ecf9f23aee56842b2e268c54805efb, type: 3}
          m_Scale: {x: 1, y: 1}
          m_Offset: {x: 0, y: 0}
    m_Floats:
      data:
        first:
          name: _Reflection
        second: .24626866
      data:
        first:
          name: _Shininess
        second: .0647508577
      data:
        first:
          name: _Gloss
        second: .395522386
      data:
        first:
          name: _FrezPow
        second: .656716406
      data:
        first:
          name: _FrezFalloff
        second: 0
      data:
        first:
          name: _Metalics
        second: .619403005
      data:
        first:
          name: _EdgeAlpha
        second: 0
    m_Colors:
      data:
        first:
          name: _Color
        second: {r: .352941155, g: .352941155, b: .352941155, a: 1}
      data:
        first:
          name: _SpecColor
        second: {r: .529411793, g: .529411793, b: .529411793, a: 1}
