%YAML 1.1
%TAG !u! tag:unity3d.com,2011:
--- !u!21 &2100000
Material:
  serializedVersion: 3
  m_ObjectHideFlags: 0
  m_PrefabParentObject: {fileID: 0}
  m_PrefabInternal: {fileID: 0}
  m_Name: Skull_Free_Crystal
  m_Shader: {fileID: 4800000, guid: c0096a96d54378848b8674c4703cd253, type: 3}
  m_ShaderKeywords: []
  m_CustomRenderQueue: -1
  m_SavedProperties:
    serializedVersion: 2
    m_TexEnvs:
      data:
        first:
          name: _MainTex
        second:
          m_Texture: {fileID: 2800000, guid: b5b17358c7490424a8bcb764d7d04395, type: 3}
          m_Scale: {x: 1, y: 1}
          m_Offset: {x: 0, y: 0}
      data:
        first:
          name: _BumpMap
        second:
          m_Texture: {fileID: 2800000, guid: d7670c73122f8ec4bb292d81ad906b43, type: 3}
          m_Scale: {x: 1, y: 1}
          m_Offset: {x: 0, y: 0}
      data:
        first:
          name: _Cube
        second:
          m_Texture: {fileID: 8900000, guid: 65a7d442f1932344384c29c6fecc89c6, type: 2}
          m_Scale: {x: 1, y: 1}
          m_Offset: {x: 0, y: 0}
      data:
        first:
          name: _Spec_Gloss_Reflec_Masks
        second:
          m_Texture: {fileID: 2800000, guid: 4f49dd892c13f4f45af945b520bd6dc4, type: 3}
          m_Scale: {x: 1, y: 1}
          m_Offset: {x: 0, y: 0}
    m_Floats:
      data:
        first:
          name: _Reflection
        second: .49253732
      data:
        first:
          name: _Shininess
        second: 1.34880602
      data:
        first:
          name: _Gloss
        second: 1
      data:
        first:
          name: _FrezPow
        second: .477611929
      data:
        first:
          name: _FrezFalloff
        second: .360461771
      data:
        first:
          name: _Metalics
        second: .528301895
      data:
        first:
          name: _EdgeAlpha
        second: 1
      data:
        first:
          name: _Density
        second: .113362715
    m_Colors:
      data:
        first:
          name: _Color
        second: {r: .216287136, g: .882352948, b: 0, a: .752941191}
      data:
        first:
          name: _SpecColor
        second: {r: .678136408, g: 1, b: .674509764, a: 1}
--- !u!1002 &2100001
EditorExtensionImpl:
  serializedVersion: 6
