{
  "Deploy": {
    "Project": {
      "Name": "cloud jonas boman hiq se",
      "Alias": "cloud-jonas-boman-hiq-se",
      "Id": "9b12dd73-ea65-46b4-ae8a-7203aa4832eb",
      "Workspaces": [
        {
          "Id": "3e3de4c8-c6e3-4967-9866-dab35df9bd86",
          "Name": "Development",
          "Type": "development",
          "Url": "https://dev-cloud-jonas-boman-hiq-se.euwest01.umbraco.io"
        },
        {
          "Id": "f03753ac-3b92-46ec-9357-6a78cfae3be6",
          "Name": "Live",
          "Type": "live",
          "Url": "https://cloud-jonas-boman-hiq-se.euwest01.umbraco.io"
        }
      ]
    },
    "Settings": {
      "ApiKey": "3700450DF5902E98DFFE366BD4CA4442BE19BF29"
    }
  },
  "Identity": {
    "ClientId": "0297c0f6-83ad-4481-9ae2-07a3f5475333",
    "ClientSecret": "Q5~T526ixOHlj47lg7Mu7_.zN1fK.7ua.9",
    "EnvironmentId": "f03753ac-3b92-46ec-9357-6a78cfae3be6",
    "LocalLoginRedirectUri": "https://redirect.identity.umbraco.com"
  }
}