{
  "page": {
    "width": 300,
    "height": 200
  },
  "objects": [
    {
      "x": 10,
      "y": 10,
      "fontsize": 12,
      "type": "text",
      "value": "{parcelnumber}"
    },
    {
      "x": 10,
      "y": 50,
      "width": 40,
      "height": 40,
      "type": "QR",
      "value": "{parcelnumber}"
    },
    {
      "x": 10,
      "y": 100,
      "fontsize": 12,
      "type": "text",
      "value": "{firstname} {lastname}"
    }
  ]
}