{
    "_meta": {
        "hostvars": {
            "foobar.example.com": {
                "example": "one"
            }
        }
    },
    "all": {
        "children": [
            "ungrouped"
        ]
    },
    "ungrouped": {
        "hosts": [
            "foobar.example.com"
        ]
    }
}
