{
    "_meta": {
        "hostvars": {
            "foobar-1.example.com": {
                "group_1": "group_1",
                "group_2": "group_2",
                "merged": [
                    {
                        "name": "foobar_1",
                        "nickname": "something"
                    },
                    {
                        "name": "foobar_2",
                        "nickname": "something",
                        "something_2": "something"
                    }
                ]
            },
            "foobar-2.example.com": {
                "group_1": "group_1",
                "group_2": "group_2",
                "merged": [
                    {
                        "name": "foobar_1",
                        "nickname": "something"
                    },
                    {
                        "name": "foobar_2",
                        "nickname": "something",
                        "something_2": "something"
                    }
                ]
            },
            "foobar-3.example.com": {
                "group_1": "group_1",
                "group_2": "group_2",
                "merged": [
                    {
                        "name": "foobar_1",
                        "nickname": "something"
                    },
                    {
                        "name": "foobar_2",
                        "nickname": "something",
                        "something_2": "something"
                    },
                    {
                        "name": "plus me",
                        "nickname": "something",
                        "something_ovr": "something"
                    }
                ]
            },
            "foobar-4.example.com": {
                "group_1": "group_1",
                "group_2": "group_2",
                "merged": [
                    {
                        "name": "only me",
                        "nickname": "something"
                    }
                ]
            }
        }
    },
    "all": {
        "children": [
            "group_1",
            "group_2",
            "ungrouped"
        ]
    },
    "group_1": {
        "children": [
            "group_both"
        ],
        "hosts": [
            "foobar-2.example.com"
        ]
    },
    "group_2": {
        "children": [
            "group_both"
        ],
        "hosts": [
            "foobar-2.example.com"
        ]
    },
    "group_both": {
        "children": [
            "group_overwrite"
        ],
        "hosts": [
            "foobar-1.example.com"
        ]
    },
    "group_overwrite": {
        "hosts": [
            "foobar-3.example.com",
            "foobar-4.example.com"
        ]
    }
}
