{
    "_meta": {
        "hostvars": {
            "foobar.example.com": {
                "one": "one"
            },
            "foobar2.example.com": {
                "one": "two"
            }
        }
    },
    "all": {
        "children": [
            "ungrouped"
        ]
    },
    "ungrouped": {
        "hosts": [
            "foobar.example.com",
            "foobar2.example.com"
        ]
    }
}
