{
    "_meta": {
        "hostvars": {
            "foobar-1.example.com": {
                "once": "once",
                "twice": [
                    "twice"
                ]
            },
            "foobar-2.example.com": {
                "once": "once",
                "twice": [
                    "twice"
                ]
            },
            "foobar-3.example.com": {
                "once": "once",
                "twice": [
                    "twice"
                ]
            },
            "foobar-4.example.com": {
                "once": "once",
                "twice": [
                    "twice"
                ]
            },
            "foobar-5.example.com": {
                "once": "once",
                "twice": [
                    "twice"
                ]
            }
        }
    },
    "all": {
        "children": [
            "group_parent",
            "ungrouped"
        ]
    },
    "group_one": {
        "children": [
            "group_three"
        ],
        "hosts": [
            "foobar-1.example.com",
            "foobar-3.example.com",
            "foobar-5.example.com"
        ]
    },
    "group_parent": {
        "children": [
            "group_one",
            "group_two"
        ]
    },
    "group_three": {
        "hosts": [
            "foobar-2.example.com",
            "foobar-5.example.com"
        ]
    },
    "group_two": {
        "children": [
            "group_three"
        ],
        "hosts": [
            "foobar-1.example.com",
            "foobar-4.example.com",
            "foobar-5.example.com"
        ]
    }
}
