{
  "_id": "rvajwpljbhqgxizd",
  "name": "Howdah",
  "type": "loot",
  "img": "systems/pf1/icons/items/inventory/dice.jpg",
  "effects": [],
  "folder": null,
  "sort": 0,
  "flags": {},
  "system": {
    "description": {
      "value": "\r\n<p class=\"source\"><b>Source</b> <a href=\"http://www.amazon.com/gp/search/ref=as_li_qf_sp_sr_il?ie=UTF8&amp;amp;camp=1789&amp;amp;creative=9325&amp;amp;index=aps&amp;amp;keywords=Pathfinder%20Campaign%20Setting%3A%20Belkzen%2C%20Hold%20of%20the%20Orc%20Hordes&amp;amp;linkCode=as2&amp;amp;tag=httpwwwd20pfs-20&amp;amp;linkId=MU26YVXHNNL3F4EH\" target=\"_blank\" rel=\"noopener\">PCS:Orcs</a></p>\r\n<p>This wooden platform is tied like a <a href=\"https://www.d20pfsrd.com/equipment/goods-and-services/animals-animal-gear#TOC-Saddle\">saddle</a> to a Huge creature's back. The platform is 10 feet square and enclosed by a low wall and sometimes a roof. The howdah has room for four Medium creatures (usually armed with bows or longspears), or two Medium creatures and a light ballista or light catapult. Occupants of the howdah have <a href=\"https://www.d20pfsrd.com/gamemastering/combat#TOC-Cover\">cover</a> against attackers from below and are considered mounted for the purposes of making attacks.</p>\r\n\r\n"
    },
    "tags": [],
    "weight": {
      "value": 2
    },
    "price": 2,
    "equipped": false,
    "changes": [],
    "contextNotes": [],
    "links": {
      "children": []
    },
    "flags": {
      "boolean": [],
      "dictionary": []
    },
    "scriptCalls": [],
    "subType": "gear"
  },
  "ownership": {
    "default": 0
  },
  "_stats": {
    "systemId": "pf1",
    "systemVersion": "0.82.1",
    "coreVersion": "10.285",
    "createdTime": 1663018753498,
    "modifiedTime": 1663018755708,
    "lastModifiedBy": "DbeAbHwpEqczKjsD"
  }
}
