{
  "_id": "VpQaERDK6ALltstl",
  "name": "Crushing Grapple",
  "type": "feat",
  "img": "systems/pf1/icons/items/inventory/banner-red.jpg",
  "effects": [],
  "folder": null,
  "sort": 0,
  "flags": {},
  "system": {
    "description": {
      "value": "<p>At 8th level, the cavalier gains&nbsp;<a href=\"https://aonprd.com/FeatDisplay.aspx?ItemName=Chokehold\">Chokehold</a>&nbsp;as a bonus feat, even if she does not meet the prerequisites. She does not take the –5 penalty on grapple checks to put an opponent in a chokehold.</p>"
    },
    "tags": [],
    "actions": [],
    "attackNotes": [],
    "effectNotes": [],
    "changes": [],
    "contextNotes": [],
    "links": {
      "children": [],
      "charges": []
    },
    "tag": "classFeat_crushingGrapple",
    "useCustomTag": true,
    "armorProf": {
      "value": []
    },
    "weaponProf": {
      "value": []
    },
    "languages": {
      "value": []
    },
    "scriptCalls": [],
    "featType": "classFeat",
    "associations": {
      "classes": [["Cavalier"]]
    },
    "abilityType": "ex"
  },
  "ownership": {
    "default": 0
  },
  "_stats": {
    "systemId": "pf1",
    "systemVersion": "0.82.1",
    "coreVersion": "10.285",
    "createdTime": 1663018766091,
    "modifiedTime": 1663018778287,
    "lastModifiedBy": "DbeAbHwpEqczKjsD"
  }
}
