{
  "name": "Lesser Major Headband",
  "flags": {},
  "description": "",
  "results": [
    {
      "_id": "d7MTDqma29TTeVLk",
      "flags": {},
      "type": 0,
      "text": "\tSoulbound Eye",
      "weight": 9,
      "range": [1, 9],
      "drawn": false
    },
    {
      "_id": "Yh9ZLo6EXCoEbEmq",
      "flags": {},
      "type": 0,
      "text": "\tWinter Wolf Headband",
      "weight": 10,
      "range": [10, 19],
      "drawn": false
    },
    {
      "_id": "QAtrVgerf41ybhsK",
      "flags": {},
      "type": 0,
      "text": "\tHeadband of Alluring Charisma +6",
      "weight": 13,
      "range": [20, 32],
      "drawn": false
    },
    {
      "_id": "tnae87vg76rfn7Em",
      "flags": {},
      "type": 0,
      "text": "\tHeadband of Inspired Wisdom +6",
      "weight": 13,
      "range": [33, 45],
      "drawn": false
    },
    {
      "_id": "yp3LVmxGxsYMTTKq",
      "flags": {},
      "type": 0,
      "text": "\tHeadband of Vast Intelligence +6",
      "weight": 13,
      "range": [46, 58],
      "drawn": false
    },
    {
      "_id": "hpIaB67AeHV8momZ",
      "flags": {},
      "type": 0,
      "text": "\tShift.r's Headband +6",
      "weight": 8,
      "range": [59, 66],
      "drawn": false
    },
    {
      "_id": "iQ1Bt6l0ycwJkbH3",
      "flags": {},
      "type": 0,
      "text": "\tHeadband of Mental Prowess +4",
      "weight": 15,
      "range": [67, 81],
      "drawn": false
    },
    {
      "_id": "dhALljbfQSQ92419",
      "flags": {},
      "type": 0,
      "text": "\tHeadband of Seduction",
      "weight": 9,
      "range": [82, 90],
      "drawn": false
    },
    {
      "_id": "uWYMARzuOqtLmxh3",
      "flags": {},
      "type": 0,
      "text": "\tHeadband of Aerial Agility +4",
      "weight": 10,
      "range": [91, 100],
      "drawn": false
    }
  ],
  "formula": "1d100",
  "replacement": true,
  "displayRoll": true,
  "_id": "iLOFGvcHV4qyMnA7",
  "ownership": {
    "default": 0
  }
}
