{
  "_id": "u4J7bpV3lQU4HooU",
  "name": "Greater Minor Divine Scrolls",
  "flags": {},
  "description": "",
  "results": [
    {
      "_id": "OX5G3i2yo3tkVlED",
      "flags": {},
      "type": 2,
      "text": "Common Level 0 Divine Scrolls",
      "img": "icons/svg/d20-black.svg",
      "collection": "pf1.ultimate-equipment",
      "resultId": "oQJAp9ehquwTQoEG",
      "weight": 5,
      "range": [1, 5],
      "drawn": false
    },
    {
      "_id": "zzSzqLGwTozDbEjI",
      "flags": {},
      "type": 2,
      "text": "Common Level 1 Divine Scrolls",
      "img": "icons/svg/d20-black.svg",
      "collection": "pf1.ultimate-equipment",
      "resultId": "ChuzetMXj6gRKCaI",
      "weight": 30,
      "range": [6, 35],
      "drawn": false
    },
    {
      "_id": "elsBfan535Lf3pWW",
      "flags": {},
      "type": 2,
      "text": "Common Level 2 Divine Scrolls",
      "img": "icons/svg/d20-black.svg",
      "collection": "pf1.ultimate-equipment",
      "resultId": "4K2GxrliYpHJs3tT",
      "weight": 55,
      "range": [36, 90],
      "drawn": false
    },
    {
      "_id": "4xCe35L0b1coClWD",
      "flags": {},
      "type": 2,
      "text": "Common Level 3 Divine Scrolls",
      "collection": "pf1.ultimate-equipment",
      "resultId": "haj5Z1NTEPbRQWtH",
      "weight": 10,
      "range": [91, 100],
      "drawn": false
    }
  ],
  "formula": "1d100",
  "replacement": true,
  "displayRoll": true,
  "ownership": {
    "default": 0
  }
}
