{
  "_id": "lJuRjhRWoRz3wG2V",
  "name": "Rocket Bomb",
  "type": "feat",
  "img": "systems/pf1/icons/items/potions/unique-3.jpg",
  "effects": [],
  "folder": null,
  "sort": 0,
  "flags": {},
  "system": {
    "description": {
      "value": "<p>Alchemists with this discovery can prepare special rockets to deliver their bombs. Rocket bombs travel farther and explode bigger than normal bombs, but cannot target individual creatures. Rocket bombs explode in a 20-foot radius, and all creatures in that area take the alchemist’s normal splash damage. The range increment on a rocket bomb is 50 feet. Rocket bombs cannot be used with the precise bomb or fast bomb discoveries.</p>\n<p>An alchemist must be at least 6th level before selecting this discovery.</p>"
    },
    "tags": [],
    "actions": [],
    "attackNotes": [],
    "effectNotes": [],
    "changes": [],
    "contextNotes": [],
    "links": {
      "children": [],
      "charges": []
    },
    "tag": "classFeat_rocketBomb",
    "useCustomTag": true,
    "armorProf": {
      "value": []
    },
    "weaponProf": {
      "value": []
    },
    "languages": {
      "value": []
    },
    "scriptCalls": [],
    "featType": "classFeat",
    "associations": {
      "classes": [["Alchemist"]]
    },
    "abilityType": "su"
  },
  "ownership": {
    "default": 0
  },
  "_stats": {
    "systemId": "pf1",
    "systemVersion": "0.82.1",
    "coreVersion": "10.285",
    "createdTime": 1663018768178,
    "modifiedTime": 1663018778486,
    "lastModifiedBy": "DbeAbHwpEqczKjsD"
  }
}
