{
  "_id": "quonqudYcCHGRMC3",
  "name": "Blood Debt",
  "type": "feat",
  "img": "systems/pf1/icons/items/weapons/kunai.png",
  "effects": [],
  "folder": null,
  "sort": 0,
  "flags": {},
  "system": {
    "description": {
      "value": "<p>A ninja with this ability gains In Harm’s Way&nbsp;as a bonus feat, even if she doesn’t meet the prerequisites. When the ninja intercepts an attack using this feat, she can spend 1 ki point to impose a blood debt on the aided ally. The ninja’s ki pool is reduced by 1 until she ends this effect, which she may do as an immediate action. If the ninja ends the blood debt in response to a successful attack against her by a creature the indebted ally threatens, the ally (who must be willing) takes full damage from that attack and any associated effects instead of the ninja.</p>"
    },
    "tags": [],
    "actions": [],
    "attackNotes": [],
    "effectNotes": [],
    "changes": [],
    "contextNotes": [],
    "links": {
      "children": [],
      "charges": []
    },
    "tag": "classFeat_bloodDebt",
    "useCustomTag": true,
    "armorProf": {
      "value": []
    },
    "weaponProf": {
      "value": []
    },
    "languages": {
      "value": []
    },
    "scriptCalls": [],
    "featType": "classFeat",
    "associations": {
      "classes": [["Ninja"]]
    },
    "abilityType": "su"
  },
  "ownership": {
    "default": 0
  },
  "_stats": {
    "systemId": "pf1",
    "systemVersion": "0.82.1",
    "coreVersion": "10.285",
    "createdTime": 1663018768811,
    "modifiedTime": 1663018778522,
    "lastModifiedBy": "DbeAbHwpEqczKjsD"
  }
}
