{
  "_id": "gqcqnlhpfqwcclch",
  "name": "Troll Oil",
  "type": "loot",
  "img": "systems/pf1/icons/items/inventory/dice.jpg",
  "effects": [],
  "folder": null,
  "sort": 0,
  "flags": {},
  "system": {
    "description": {
      "value": "\r\n<p><b>Price</b> 50 gp; <b>Weight</b> 1 lb.</p>\r\n<p>This crimson liquid is viscous and tastes foul. If you drink it, for the next hour you automatically <a href=\"https://www.d20pfsrd.com/gamemastering/conditions#TOC-Stable\">stabilize</a> when reduced to negative <a href=\"https://www.d20pfsrd.com/gamemastering/combat#TOC-Hit-Points\">hit points</a> (unless the damage is sufficient to instantly kill you) and have a 50% chance each round to end any bleed effect on you. If you take fire or acid damage, the benefits of <a href=\"https://www.d20pfsrd.com/bestiary/monster-listings/humanoids/giants/troll\">troll</a> oil are suspended for 1 round.</p>\r\n"
    },
    "tags": [],
    "weight": {
      "value": 1
    },
    "price": 50,
    "equipped": false,
    "changes": [],
    "contextNotes": [],
    "links": {
      "children": []
    },
    "flags": {
      "boolean": [],
      "dictionary": []
    },
    "scriptCalls": [],
    "subType": "gear"
  },
  "ownership": {
    "default": 0
  },
  "_stats": {
    "systemId": "pf1",
    "systemVersion": "0.82.1",
    "coreVersion": "10.285",
    "createdTime": 1663018753157,
    "modifiedTime": 1663018755682,
    "lastModifiedBy": "DbeAbHwpEqczKjsD"
  }
}
