{
  "_id": "0R8c0js1gWlCtbCY",
  "name": "Implement Mastery",
  "type": "feat",
  "img": "systems/pf1/icons/items/equipment/belt-girdle.jpg",
  "effects": [],
  "folder": null,
  "sort": 0,
  "flags": {},
  "system": {
    "description": {
      "value": "<p>At 20th level, an occultist learns to master one of his implements. He selects one implement school. Whenever he uses a focus power from an implement of that school, the DC to resist any of the effects increases by 4 and he treats his occultist level as 4 higher when determining the effects and duration of that power.</p>\n<p>In addition, the occultist gains 4 extra points of mental focus, but these points must always be invested in implements of the mastered school. He can’t save these points or expend them for any ability other than the focus powers of those implements.</p>\n<p>The hardness of each of the occultist’s implements of the mastered school increases by an additional 20 as long as the item has at least 1 point of mental focus stored within.</p>"
    },
    "tags": [],
    "actions": [],
    "attackNotes": [],
    "effectNotes": [],
    "changes": [],
    "contextNotes": [],
    "links": {
      "children": [],
      "charges": []
    },
    "tag": "classFeat_implementMastery",
    "useCustomTag": true,
    "armorProf": {
      "value": []
    },
    "weaponProf": {
      "value": []
    },
    "languages": {
      "value": []
    },
    "scriptCalls": [],
    "featType": "classFeat",
    "associations": {
      "classes": [["Occultist"]]
    },
    "abilityType": "su"
  },
  "ownership": {
    "default": 0
  },
  "_stats": {
    "systemId": "pf1",
    "systemVersion": "0.82.1",
    "coreVersion": "10.285",
    "createdTime": 1663018761832,
    "modifiedTime": 1663018778068,
    "lastModifiedBy": "DbeAbHwpEqczKjsD"
  }
}
