{
  "_id": "eROVW8PzBztdcMd6",
  "name": "Repose Domain",
  "type": "feat",
  "img": "systems/pf1/icons/skills/affliction_05.jpg",
  "effects": [],
  "folder": null,
  "sort": 0,
  "flags": {},
  "system": {
    "description": {
      "value": "<p><strong>Granted Powers:</strong> You see death not as something to be feared, but as a final rest and reward for a life well spent. The taint of undeath is a mockery of what you hold dear.</p>\n<p><strong>Domain Spells:</strong></p>\n<ul>\n<li>1st—@Compendium[pf1.spells.1hjxxr3k62rcpb5c]{Deathwatch}</li>\n<li>2nd—@Compendium[pf1.spells.vdmsaodgnbo8wjfx]{Gentle Repose}</li>\n<li>3rd—@Compendium[pf1.spells.byn5q46du0ck592a]{Speak with Dead}</li>\n<li>4th—@Compendium[pf1.spells.e0rlki4hwu76l5ya]{Death Ward}</li>\n<li>5th—@Compendium[pf1.spells.dg3mrasygkm83c3e]{Slay Living}</li>\n<li>6th—@Compendium[pf1.spells.lllhr9py6w44cxjm]{Undeath to Death}</li>\n<li>7th—@Compendium[pf1.spells.rlfd7f64wgjfvg6e]{Destruction}</li>\n<li>8th—@Compendium[pf1.spells.9f3hf9h3j8q8062b]{Waves of Exhaustion}</li>\n<li>9th—@Compendium[pf1.spells.wplgawb6aznjx7se]{Wail of the Banshee}</li>\n</ul>"
    },
    "tags": [],
    "actions": [],
    "attackNotes": [],
    "effectNotes": [],
    "changes": [],
    "contextNotes": [],
    "links": {
      "children": [],
      "charges": []
    },
    "tag": "classFeat_reposeDomain",
    "useCustomTag": true,
    "armorProf": {
      "value": []
    },
    "weaponProf": {
      "value": []
    },
    "languages": {
      "value": []
    },
    "scriptCalls": [],
    "featType": "classFeat",
    "associations": {
      "classes": [["Cleric"]]
    }
  },
  "ownership": {
    "default": 0
  },
  "_stats": {
    "systemId": "pf1",
    "systemVersion": "0.82.1",
    "coreVersion": "10.285",
    "createdTime": 1663018767123,
    "modifiedTime": 1663018778438,
    "lastModifiedBy": "DbeAbHwpEqczKjsD"
  }
}
