{
  "_id": "rJFSTniHbaclYyAR",
  "name": "Nails",
  "type": "feat",
  "img": "systems/pf1/icons/skills/violet_02.jpg",
  "effects": [],
  "folder": null,
  "sort": 0,
  "flags": {},
  "system": {
    "description": {
      "value": "<p>The witch's nails are long and sharp, and count as natural weapons that deal 1d3 points of damage (1d2 for a Small witch). These attacks are secondary attacks.</p>\n<p>If trimmed, the witch's nails regrow to their normal size in 1d4 days.</p>"
    },
    "tags": [],
    "actions": [],
    "attackNotes": [],
    "effectNotes": [],
    "changes": [],
    "contextNotes": [],
    "links": {
      "children": [],
      "charges": []
    },
    "tag": "classFeat_nails",
    "useCustomTag": true,
    "armorProf": {
      "value": []
    },
    "weaponProf": {
      "value": []
    },
    "languages": {
      "value": []
    },
    "scriptCalls": [],
    "featType": "classFeat",
    "associations": {
      "classes": [["Witch"]]
    },
    "abilityType": "ex"
  },
  "ownership": {
    "default": 0
  },
  "_stats": {
    "systemId": "pf1",
    "systemVersion": "0.82.1",
    "coreVersion": "10.285",
    "createdTime": 1663018769103,
    "modifiedTime": 1663018778525,
    "lastModifiedBy": "DbeAbHwpEqczKjsD"
  }
}
