{
  "_id": "EqLUfMmdPJOmjX3L",
  "name": "Shadow Final Revelation",
  "type": "feat",
  "img": "systems/pf1/icons/spells/light-royal-1.jpg",
  "effects": [],
  "folder": null,
  "sort": 0,
  "flags": {},
  "system": {
    "description": {
      "value": "<p>Upon reaching 20th level, your body becomes permanently suffused with the essence of the Shadow Plane. You gain regeneration 5 while in dim light or darkness and immunity to cold, critical hits, and sneak attacks. Your regeneration is suppressed while in any level of illumination brighter than dim light. In addition, any spells you cast of the shadow subschool or with the darkness descriptor are automatically enlarged without affecting their spell level.</p>"
    },
    "tags": [],
    "actions": [],
    "attackNotes": [],
    "effectNotes": [],
    "changes": [],
    "contextNotes": [],
    "links": {
      "children": [],
      "charges": []
    },
    "tag": "classFeat_shadowFinalRevelation",
    "useCustomTag": true,
    "armorProf": {
      "value": []
    },
    "weaponProf": {
      "value": []
    },
    "languages": {
      "value": []
    },
    "scriptCalls": [],
    "featType": "classFeat",
    "associations": {
      "classes": [["Oracle"]]
    }
  },
  "ownership": {
    "default": 0
  },
  "_stats": {
    "systemId": "pf1",
    "systemVersion": "0.82.1",
    "coreVersion": "10.285",
    "createdTime": 1663018763845,
    "modifiedTime": 1663018778185,
    "lastModifiedBy": "DbeAbHwpEqczKjsD"
  }
}
