{
  "_id": "hdmbcuuqkujzwfml",
  "name": "Scarf, Head",
  "type": "loot",
  "img": "systems/pf1/icons/items/inventory/dice.jpg",
  "effects": [],
  "folder": null,
  "sort": 0,
  "flags": {},
  "system": {
    "description": {
      "value": " \n<p class=\"source\"><b>Source</b> <a href=\"http://amzn.to/2eT3m9D\" target=\"_blank\" rel=\"noopener\">PPZO94102</a></p> \n<p><b>Price</b> 1 sp-10 gp; <b>Weight</b> -</p> \n<p>Often worn for privacy, religious or cultural reasons, or protection from the elements, full scarves designed to be wrapped around the head are common accessories. Headscarves of bright colors or ornate embroidery can fetch a substantially higher price.</p> \n"
    },
    "tags": [],
    "price": 0.1,
    "equipped": false,
    "changes": [],
    "contextNotes": [],
    "links": {
      "children": []
    },
    "flags": {
      "boolean": [],
      "dictionary": []
    },
    "scriptCalls": [],
    "subType": "gear"
  },
  "ownership": {
    "default": 0
  },
  "_stats": {
    "systemId": "pf1",
    "systemVersion": "0.82.1",
    "coreVersion": "10.285",
    "createdTime": 1663018753181,
    "modifiedTime": 1663018755684,
    "lastModifiedBy": "DbeAbHwpEqczKjsD"
  }
}
