{
  "_id": "5K2nfB7kaAhKEruh",
  "name": "Brawler",
  "type": "feat",
  "img": "systems/pf1/icons/feats/deafening-critical.jpg",
  "effects": [],
  "folder": null,
  "sort": 0,
  "flags": {},
  "system": {
    "description": {
      "value": "<p>While raging, the barbarian is treated as if she has @Compendium[pf1.feats.2aTFNMs3pW6nUBlr]{Improved Unarmed Strike}. If she already has the feat, her unarmed strikes deal 1d6 points of damage (1d4 if she is Small).</p>"
    },
    "tags": [],
    "actions": [],
    "attackNotes": [],
    "effectNotes": [],
    "changes": [],
    "contextNotes": [],
    "links": {
      "children": [],
      "charges": []
    },
    "tag": "classFeat_brawler",
    "useCustomTag": true,
    "armorProf": {
      "value": []
    },
    "weaponProf": {
      "value": []
    },
    "languages": {
      "value": []
    },
    "scriptCalls": [],
    "featType": "classFeat",
    "associations": {
      "classes": [["Barbarian"], ["Skald"]]
    }
  },
  "ownership": {
    "default": 0
  },
  "_stats": {
    "systemId": "pf1",
    "systemVersion": "0.82.1",
    "coreVersion": "10.285",
    "createdTime": 1663018762476,
    "modifiedTime": 1663018778106,
    "lastModifiedBy": "DbeAbHwpEqczKjsD"
  }
}
