{
  "_id": "QBMwtuhQ4i63LvfT",
  "name": "Penetrating Bite",
  "type": "feat",
  "img": "systems/pf1/icons/feats/deafening-critical.jpg",
  "effects": [],
  "folder": null,
  "sort": 0,
  "flags": {},
  "system": {
    "description": {
      "value": "<p>When using the animal fury rage power while raging, the barbarian’s bite is able to pierce most resistances.</p>\n<p>At 4th level, her bite is treated as a magic weapon for the purpose of overcoming damage reduction.</p>\n<p>At 7th level, her bite is also treated as cold iron and silver for the purpose of overcoming damage reduction.</p>\n<p>At 10th level, her bite is also treated as a chaotic weapon for the purpose of overcoming damage reduction.</p>\n<p>At 16th level, her bite is treated as an adamantine weapon for the purpose of overcoming damage reduction and bypassing hardness.</p>\n<p>A barbarian must have the animal fury rage power and be at least 4th level to select this rage power.</p>"
    },
    "tags": [],
    "actions": [],
    "attackNotes": [],
    "effectNotes": [],
    "changes": [],
    "contextNotes": [],
    "links": {
      "children": [],
      "charges": []
    },
    "tag": "classFeat_penetratingBite",
    "useCustomTag": true,
    "armorProf": {
      "value": []
    },
    "weaponProf": {
      "value": []
    },
    "languages": {
      "value": []
    },
    "scriptCalls": [],
    "featType": "classFeat",
    "associations": {
      "classes": [["Barbarian"], ["Skald"]]
    },
    "abilityType": "ex"
  },
  "ownership": {
    "default": 0
  },
  "_stats": {
    "systemId": "pf1",
    "systemVersion": "0.82.1",
    "coreVersion": "10.285",
    "createdTime": 1663018765256,
    "modifiedTime": 1663018778254,
    "lastModifiedBy": "DbeAbHwpEqczKjsD"
  }
}
