{
  "_id": "kzjopnqwektidpkk",
  "name": "Kit, Forger's",
  "type": "loot",
  "img": "systems/pf1/icons/items/inventory/dice.jpg",
  "effects": [],
  "folder": null,
  "sort": 0,
  "flags": {},
  "system": {
    "description": {
      "value": "\r\n<p><b>Price</b> 200 gp; <b>Weight</b> 6 lbs.</p>\r\n<p>These inks, pens, papers, templates for certificates, and tools for modifying or copying official seals facilitates the creation of counterfeit documents. It grants a +2 <a href=\"https://www.d20pfsrd.com/basics-ability-scores/glossary#TOC-Circumstance-Bonus\">circumstance bonus</a> on Linguistic checks made for the purpose of making forgeries.</p>\r\n\r\n"
    },
    "tags": [],
    "weight": {
      "value": 6
    },
    "price": 200,
    "equipped": false,
    "changes": [],
    "contextNotes": [],
    "links": {
      "children": []
    },
    "flags": {
      "boolean": [],
      "dictionary": []
    },
    "scriptCalls": [],
    "subType": "gear"
  },
  "ownership": {
    "default": 0
  },
  "_stats": {
    "systemId": "pf1",
    "systemVersion": "0.82.1",
    "coreVersion": "10.285",
    "createdTime": 1663018753250,
    "modifiedTime": 1663018755690,
    "lastModifiedBy": "DbeAbHwpEqczKjsD"
  }
}
