{
  "_id": "hEduWO7ZjxgCbrSy",
  "name": "Telepathic Link",
  "type": "feat",
  "img": "systems/pf1/icons/skills/violet_26.jpg",
  "effects": [],
  "folder": null,
  "sort": 0,
  "flags": {},
  "system": {
    "description": {
      "value": "<p>The subject can communicate telepathically with the mesmerist during a crisis. The mesmerist can trigger this trick when the subject and her allies are outnumbered in combat. For 1 minute per mesmerist level, the subject and the mesmerist can communicate telepathically. If the subject and the mesmerist are more than a medium distance (100 feet + 10 feet per level) apart, the telepathic connection is severed and cannot be regained unless the trick is implanted again.</p>\n<p>The mesmerist and the subject must share a language to be able to communicate.</p>"
    },
    "tags": [],
    "actions": [],
    "attackNotes": [],
    "effectNotes": [],
    "changes": [],
    "contextNotes": [],
    "links": {
      "children": [],
      "charges": []
    },
    "tag": "classFeat_telepathicLink",
    "useCustomTag": true,
    "armorProf": {
      "value": []
    },
    "weaponProf": {
      "value": []
    },
    "languages": {
      "value": []
    },
    "scriptCalls": [],
    "featType": "classFeat",
    "associations": {
      "classes": [["Mesmerist"]]
    }
  },
  "ownership": {
    "default": 0
  },
  "_stats": {
    "systemId": "pf1",
    "systemVersion": "0.82.1",
    "coreVersion": "10.285",
    "createdTime": 1663018767662,
    "modifiedTime": 1663018778462,
    "lastModifiedBy": "DbeAbHwpEqczKjsD"
  }
}
