{
  "name": "Common Level 3 Wands",
  "flags": {},
  "description": "",
  "results": [
    {
      "_id": "3bHT0FbA2GYj4Lz7",
      "flags": {},
      "type": 0,
      "text": "Wand of Beast Shape I",
      "img": "icons/svg/d20-black.svg",
      "resultId": "",
      "weight": 2,
      "range": [1, 2],
      "drawn": false
    },
    {
      "_id": "Yt0Dw5GvTxpEsOLJ",
      "flags": {},
      "type": 0,
      "text": "Wand of Blink",
      "img": "icons/svg/d20-black.svg",
      "resultId": "",
      "weight": 2,
      "range": [3, 4],
      "drawn": false
    },
    {
      "_id": "93slQGrAQM8RwH9b",
      "flags": {},
      "type": 0,
      "text": "Wand of Call Lightning",
      "img": "icons/svg/d20-black.svg",
      "resultId": "",
      "weight": 3,
      "range": [5, 7],
      "drawn": false
    },
    {
      "_id": "1ZxccGC3sj1PZ1qw",
      "flags": {},
      "type": 0,
      "text": "Wand of Create Food and Water",
      "img": "icons/svg/d20-black.svg",
      "resultId": "",
      "weight": 1,
      "range": [8, 8],
      "drawn": false
    },
    {
      "_id": "Y5TvWgtTeE31NNBI",
      "flags": {},
      "type": 0,
      "text": "Wand of Cure Serious Wounds",
      "img": "icons/svg/d20-black.svg",
      "resultId": "",
      "weight": 6,
      "range": [9, 14],
      "drawn": false
    },
    {
      "_id": "ZAw7UQqcjS0gShHe",
      "flags": {},
      "type": 0,
      "text": "Wand of Daylight",
      "img": "icons/svg/d20-black.svg",
      "resultId": "",
      "weight": 2,
      "range": [15, 16],
      "drawn": false
    },
    {
      "_id": "Ic9ILlBanKCwuVTR",
      "flags": {},
      "type": 0,
      "text": "Wand of Deep Slumber",
      "img": "icons/svg/d20-black.svg",
      "resultId": "",
      "weight": 2,
      "range": [17, 18],
      "drawn": false
    },
    {
      "_id": "cdpLY6xGtnk1Ymcg",
      "flags": {},
      "type": 0,
      "text": "Wand of Deeper Darkness",
      "img": "icons/svg/d20-black.svg",
      "resultId": "",
      "weight": 2,
      "range": [19, 20],
      "drawn": false
    },
    {
      "_id": "H5DMVTsUc8xkGplM",
      "flags": {},
      "type": 0,
      "text": "Wand of Dispel Magic",
      "img": "icons/svg/d20-black.svg",
      "resultId": "",
      "weight": 5,
      "range": [21, 25],
      "drawn": false
    },
    {
      "_id": "aywoDZdw4umybqSP",
      "flags": {},
      "type": 0,
      "text": "Wand of Displacement",
      "img": "icons/svg/d20-black.svg",
      "resultId": "",
      "weight": 3,
      "range": [26, 28],
      "drawn": false
    },
    {
      "_id": "WvILrfK41ILQRIAd",
      "flags": {},
      "type": 0,
      "text": "Wand of Fireball",
      "img": "icons/svg/d20-black.svg",
      "resultId": "",
      "weight": 6,
      "range": [29, 34],
      "drawn": false
    },
    {
      "_id": "uJGZqUBGAij3NkoF",
      "flags": {},
      "type": 0,
      "text": "Wand of Flame Arrow",
      "img": "icons/svg/d20-black.svg",
      "resultId": "",
      "weight": 1,
      "range": [35, 35],
      "drawn": false
    },
    {
      "_id": "wZFFbEnetRGCgsJZ",
      "flags": {},
      "type": 0,
      "text": "Wand of Fly",
      "img": "icons/svg/d20-black.svg",
      "resultId": "",
      "weight": 2,
      "range": [36, 37],
      "drawn": false
    },
    {
      "_id": "t8fi7lHZIeHgNSGi",
      "flags": {},
      "type": 0,
      "text": "Wand of Gaseous Form",
      "img": "icons/svg/d20-black.svg",
      "resultId": "",
      "weight": 1,
      "range": [38, 38],
      "drawn": false
    },
    {
      "_id": "dW3OXrGtuVdrTnbA",
      "flags": {},
      "type": 0,
      "text": "Wand of Haste",
      "img": "icons/svg/d20-black.svg",
      "resultId": "",
      "weight": 2,
      "range": [39, 40],
      "drawn": false
    },
    {
      "_id": "nY2BbBlXJaVzcegU",
      "flags": {},
      "type": 0,
      "text": "Wand of Heroism",
      "img": "icons/svg/d20-black.svg",
      "resultId": "",
      "weight": 2,
      "range": [41, 42],
      "drawn": false
    },
    {
      "_id": "F4yrxHfnCXaEFBxm",
      "flags": {},
      "type": 0,
      "text": "Wand of Inflict Serious Wounds",
      "img": "icons/svg/d20-black.svg",
      "resultId": "",
      "weight": 3,
      "range": [43, 45],
      "drawn": false
    },
    {
      "_id": "4jkRz8YMrpEsjcyM",
      "flags": {},
      "type": 0,
      "text": "Wand of Invisibility Purge",
      "img": "icons/svg/d20-black.svg",
      "resultId": "",
      "weight": 2,
      "range": [46, 47],
      "drawn": false
    },
    {
      "_id": "v75wvFuhEGZGBnqd",
      "flags": {},
      "type": 0,
      "text": "Wand of Invisibility Sphere",
      "img": "icons/svg/d20-black.svg",
      "resultId": "",
      "weight": 1,
      "range": [48, 48],
      "drawn": false
    },
    {
      "_id": "1YeZoODueM1mi0kq",
      "flags": {},
      "type": 0,
      "text": "Wand of Keen Edge",
      "img": "icons/svg/d20-black.svg",
      "resultId": "",
      "weight": 2,
      "range": [49, 50],
      "drawn": false
    },
    {
      "_id": "syc3ZDRp9iBFJx7J",
      "flags": {},
      "type": 0,
      "text": "Wand of Lightning Bolt",
      "img": "icons/svg/d20-black.svg",
      "resultId": "",
      "weight": 5,
      "range": [51, 55],
      "drawn": false
    },
    {
      "_id": "ND2vEHNnBf69KsPf",
      "flags": {},
      "type": 0,
      "text": "Wand of Magic Circle Against Chaos",
      "img": "icons/svg/d20-black.svg",
      "resultId": "",
      "weight": 1,
      "range": [56, 56],
      "drawn": false
    },
    {
      "_id": "aGN9O7bb4usOSqKp",
      "flags": {},
      "type": 0,
      "text": "Wand of Magic Circle Against Evil",
      "img": "icons/svg/d20-black.svg",
      "resultId": "",
      "weight": 1,
      "range": [57, 57],
      "drawn": false
    },
    {
      "_id": "87tdDuIvGlOAICOC",
      "flags": {},
      "type": 0,
      "text": "Wand of Magic Circle Against Good",
      "img": "icons/svg/d20-black.svg",
      "resultId": "",
      "weight": 1,
      "range": [58, 58],
      "drawn": false
    },
    {
      "_id": "iHd2Xm5Mr7aODzzG",
      "flags": {},
      "type": 0,
      "text": "Wand of Magic Circle Against Law",
      "img": "icons/svg/d20-black.svg",
      "resultId": "",
      "weight": 1,
      "range": [59, 59],
      "drawn": false
    },
    {
      "_id": "4TXVuk0U3GkoXmZF",
      "flags": {},
      "type": 0,
      "text": "Wand of Magic Fang, Greater",
      "img": "icons/svg/d20-black.svg",
      "resultId": "",
      "weight": 1,
      "range": [60, 60],
      "drawn": false
    },
    {
      "_id": "qyiKkjuokeLaoUOm",
      "flags": {},
      "type": 0,
      "text": "Wand of Magic Vestment",
      "img": "icons/svg/d20-black.svg",
      "resultId": "",
      "weight": 2,
      "range": [61, 62],
      "drawn": false
    },
    {
      "_id": "JpMHMS0EszRFFepl",
      "flags": {},
      "type": 0,
      "text": "Wand of Magic Weapon, Greater",
      "img": "icons/svg/d20-black.svg",
      "resultId": "",
      "weight": 2,
      "range": [63, 64],
      "drawn": false
    },
    {
      "_id": "HFmvemxuaYiqYinR",
      "flags": {},
      "type": 0,
      "text": "Wand of Major Image",
      "img": "icons/svg/d20-black.svg",
      "resultId": "",
      "weight": 2,
      "range": [65, 66],
      "drawn": false
    },
    {
      "_id": "dBtrGWunRLVvENbO",
      "flags": {},
      "type": 0,
      "text": "Wand of Prayer",
      "img": "icons/svg/d20-black.svg",
      "resultId": "",
      "weight": 4,
      "range": [67, 70],
      "drawn": false
    },
    {
      "_id": "S2MqMhuCp6WCv2NW",
      "flags": {},
      "type": 0,
      "text": "Wand of Protection From Energy",
      "img": "icons/svg/d20-black.svg",
      "resultId": "",
      "weight": 4,
      "range": [71, 74],
      "drawn": false
    },
    {
      "_id": "kB02cvIKpJ21XExY",
      "flags": {},
      "type": 0,
      "text": "Wand of Remove Blindness/Deafness",
      "img": "icons/svg/d20-black.svg",
      "resultId": "",
      "weight": 1,
      "range": [75, 75],
      "drawn": false
    },
    {
      "_id": "5rSwrBdspbJsID4I",
      "flags": {},
      "type": 0,
      "text": "Wand of Remove Curse",
      "img": "icons/svg/d20-black.svg",
      "resultId": "",
      "weight": 2,
      "range": [76, 77],
      "drawn": false
    },
    {
      "_id": "jzFR38VUMmsipaZm",
      "flags": {},
      "type": 0,
      "text": "Wand of Remove Disease",
      "img": "icons/svg/d20-black.svg",
      "resultId": "",
      "weight": 2,
      "range": [78, 79],
      "drawn": false
    },
    {
      "_id": "EzN7UieGxXXlSVxI",
      "flags": {},
      "type": 0,
      "text": "Wand of Searing Light",
      "img": "icons/svg/d20-black.svg",
      "resultId": "",
      "weight": 3,
      "range": [80, 82],
      "drawn": false
    },
    {
      "_id": "3MLVm3TnVvfB3aZ8",
      "flags": {},
      "type": 0,
      "text": "Wand of Sleet Storm",
      "img": "icons/svg/d20-black.svg",
      "resultId": "",
      "weight": 1,
      "range": [83, 83],
      "drawn": false
    },
    {
      "_id": "5Y6VIB4AxHHQ8QWD",
      "flags": {},
      "type": 0,
      "text": "Wand of Slow",
      "img": "icons/svg/d20-black.svg",
      "resultId": "",
      "weight": 2,
      "range": [84, 85],
      "drawn": false
    },
    {
      "_id": "j8fXCFIia06D73q2",
      "flags": {},
      "type": 0,
      "text": "Wand of Speak With Dead",
      "img": "icons/svg/d20-black.svg",
      "resultId": "",
      "weight": 2,
      "range": [86, 87],
      "drawn": false
    },
    {
      "_id": "0qqx7zr66YK81wEK",
      "flags": {},
      "type": 0,
      "text": "Wand of Stinking Cloud",
      "img": "icons/svg/d20-black.svg",
      "resultId": "",
      "weight": 2,
      "range": [88, 89],
      "drawn": false
    },
    {
      "_id": "fxrUrIvsZjr21g6Z",
      "flags": {},
      "type": 0,
      "text": "Wand of Stone Shape",
      "img": "icons/svg/d20-black.svg",
      "resultId": "",
      "weight": 1,
      "range": [90, 90],
      "drawn": false
    },
    {
      "_id": "AnzUgahlzORFPtL5",
      "flags": {},
      "type": 0,
      "text": "Wand of Suggestion",
      "img": "icons/svg/d20-black.svg",
      "resultId": "",
      "weight": 2,
      "range": [91, 92],
      "drawn": false
    },
    {
      "_id": "ySg7yCrQyMTAThVr",
      "flags": {},
      "type": 0,
      "text": "Wand of Summon Monster III",
      "img": "icons/svg/d20-black.svg",
      "resultId": "",
      "weight": 1,
      "range": [93, 93],
      "drawn": false
    },
    {
      "_id": "vhw0pz2ays2Wh1Z5",
      "flags": {},
      "type": 0,
      "text": "Wand of Summon Nature's Ally III",
      "img": "icons/svg/d20-black.svg",
      "resultId": "",
      "weight": 1,
      "range": [94, 94],
      "drawn": false
    },
    {
      "_id": "zictPSyrHQEMjbAn",
      "flags": {},
      "type": 0,
      "text": "Wand of Vampiric Touch",
      "img": "icons/svg/d20-black.svg",
      "resultId": "",
      "weight": 3,
      "range": [95, 97],
      "drawn": false
    },
    {
      "_id": "DD7k9PUGxNG45P4T",
      "flags": {},
      "type": 0,
      "text": "Wand of Water Breathing",
      "img": "icons/svg/d20-black.svg",
      "resultId": "",
      "weight": 2,
      "range": [98, 99],
      "drawn": false
    },
    {
      "_id": "gzfCybCrZRxpZbac",
      "flags": {},
      "type": 0,
      "text": "Wand of Animate Dead",
      "img": "icons/svg/d20-black.svg",
      "resultId": "",
      "weight": 1,
      "range": [100, 100],
      "drawn": false
    }
  ],
  "formula": "1d100",
  "replacement": true,
  "displayRoll": true,
  "_id": "dB3WvGIjmNmuI0kP",
  "ownership": {
    "default": 0
  }
}
