{
  "_id": "xduktluxilowrlla",
  "name": "Kit, Perfume",
  "type": "loot",
  "img": "systems/pf1/icons/items/inventory/dice.jpg",
  "effects": [],
  "folder": null,
  "sort": 0,
  "flags": {},
  "system": {
    "description": {
      "value": "\r\n<p class=\"source\"><b>Source</b>: <a href=\"http://www.opengamingstore.com/collections/all-products/products/ultimate-intrigue-pathfinder-rpg\" target=\"_blank\" rel=\"noopener\">PZO1134</a></p>\r\n<p><b>Price</b> 40 gp; <b>Weight</b> 10 lbs.</p>\r\n<p>A perfume kit consists of an atomizer and a diverse array of perfumes, scented oils, wild flowers, and herbs. Applying scents from a perfume kit takes 1 minute, and grants you a +1 <a href=\"https://www.d20pfsrd.com/basics-ability-scores/glossary#TOC-Circumstance-Bonus\">circumstance bonus</a> on <a href=\"https://www.d20pfsrd.com/skills/bluff\">Bluff</a>, <a href=\"https://www.d20pfsrd.com/skills/diplomacy\">Diplomacy</a>, <a href=\"https://www.d20pfsrd.com/skills/disguise\">Disguise</a>, <a href=\"https://www.d20pfsrd.com/skills/handle-animal\">Handle Animal</a>, <a href=\"https://www.d20pfsrd.com/skills/intimidate\">Intimidate</a>, or <a href=\"https://www.d20pfsrd.com/skills/perform\">Perform</a> checks, subject to GM discretion.</p>\r\n<p>You must choose the type of check when you apply the fragrances.</p>\r\n<p>This bonus typically doesn't apply in combat or against hostile creatures, and might not work on creatures without olfactory senses or who would be more offended than entranced by your <a href=\"https://www.d20pfsrd.com/gamemastering/special-abilities#TOC-Scent\">scent</a>. The bonus lasts for 4 hours. You can gain only one bonus from a perfume kit at a time, and the bonus from <a href=\"https://www.d20pfsrd.com/equipment/goods-and-services/containers-bags-boxes-more#TOC-Perfume-or-Cologne\">perfume</a> does not stack with bonuses from any masterwork tools you possess for the same skill. A perfume kit is <a href=\"https://www.d20pfsrd.com/gamemastering/conditions#TOC-Exhausted\">exhausted</a> after 10 uses.</p>\r\n\r\n"
    },
    "tags": [],
    "weight": {
      "value": 10
    },
    "price": 40,
    "equipped": false,
    "changes": [],
    "contextNotes": [],
    "links": {
      "children": []
    },
    "flags": {
      "boolean": [],
      "dictionary": []
    },
    "scriptCalls": [],
    "subType": "gear"
  },
  "ownership": {
    "default": 0
  },
  "_stats": {
    "systemId": "pf1",
    "systemVersion": "0.82.1",
    "coreVersion": "10.285",
    "createdTime": 1663018753648,
    "modifiedTime": 1663018755717,
    "lastModifiedBy": "DbeAbHwpEqczKjsD"
  }
}
