{
  "_id": "5iDrtRQMuIhLymUA",
  "name": "Summoner (Unchained)",
  "type": "class",
  "img": "systems/pf1/icons/skills/blue_26.jpg",
  "effects": [],
  "folder": null,
  "sort": 0,
  "flags": {},
  "system": {
    "description": {
      "value": "<p>There are those who take a different path when pursuing the arcane arts, reaching across the boundaries of the world to the far-f lung planes to call forth all manner of creatures to do their bidding. Known as summoners, these arcane practitioners form close bonds with particular outsiders, known as eidolons, which increase in power along with their callers. In the end, summoners and their eidolons become linked, sharing shards of the same souls.</p>\n<p><strong>Unchained:</strong> Most of the summoner’s class features are the same as those of the class’s original design—the biggest change comes to the eidolon. The unchained summoner selects a subtype for his eidolon (such as angel, demon, or protean), which determines a number of its evolutions and helps to shape the eidolon’s general attitude and appearance. In addition, some of the evolutions are now tied to one or more subtypes and base forms, to make eidolons that better match the expected appearances and abilities of such creatures. Finally, the summoner spell list has been greatly revised, removing a number of imbalances.</p>\n<p><strong>Alignment:</strong> Any.</p>\n<p><strong>Hit Die:</strong> d8.</p>\n<p><strong>Starting Wealth:</strong> 2d6 x 10 gp (average 70 gp).</p>\n<h2><span id=\"Class_Skills\">Class Skills</span></h2>\n<p>The summoner’s class skills are&nbsp;<a href=\"https://www.d20pfsrd.com/skills/craft\">Craft</a>&nbsp;(<a href=\"https://www.d20pfsrd.com/basics-ability-scores/ability-scores#TOC-Intelligence-Int-\" rel=\"nofollow\">Int</a>),&nbsp;<a href=\"https://www.d20pfsrd.com/skills/fly\">Fly</a>&nbsp;(<a href=\"https://www.d20pfsrd.com/basics-ability-scores/ability-scores#TOC-Dexterity-Dex-\" rel=\"nofollow\">Dex</a>),&nbsp;<a href=\"https://www.d20pfsrd.com/skills/handle-animal\">Handle Animal</a>&nbsp;(<a href=\"https://www.d20pfsrd.com/basics-ability-scores/ability-scores#TOC-Charisma-Cha-\" rel=\"nofollow\">Cha</a>),&nbsp;<a href=\"https://www.d20pfsrd.com/skills/knowledge\">Knowledge</a> (all) (<a href=\"https://www.d20pfsrd.com/basics-ability-scores/ability-scores#TOC-Intelligence-Int-\" rel=\"nofollow\">Int</a>),&nbsp;<a href=\"https://www.d20pfsrd.com/skills/linguistics\">Linguistics</a>&nbsp;(<a href=\"https://www.d20pfsrd.com/basics-ability-scores/ability-scores#TOC-Intelligence-Int-\" rel=\"nofollow\">Int</a>),&nbsp;<a href=\"https://www.d20pfsrd.com/skills/profession\">Profession</a>&nbsp;(Wis),&nbsp;<a href=\"https://www.d20pfsrd.com/skills/ride\">Ride</a>&nbsp;(<a href=\"https://www.d20pfsrd.com/basics-ability-scores/ability-scores#TOC-Dexterity-Dex-\" rel=\"nofollow\">Dex</a>),&nbsp;<a href=\"https://www.d20pfsrd.com/skills/spellcraft\">Spellcraft</a>&nbsp;(<a href=\"https://www.d20pfsrd.com/basics-ability-scores/ability-scores#TOC-Intelligence-Int-\" rel=\"nofollow\">Int</a>), and&nbsp;<a href=\"https://www.d20pfsrd.com/skills/use-magic-device\">Use Magic Device</a>&nbsp;(<a href=\"https://www.d20pfsrd.com/basics-ability-scores/ability-scores#TOC-Charisma-Cha-\" rel=\"nofollow\">Cha</a>).</p>\n<p><strong>Skill Ranks per Level</strong>: 2 +&nbsp;<a href=\"https://www.d20pfsrd.com/basics-ability-scores/ability-scores#TOC-Intelligence-Int-\">Int</a> modifier.</p>"
    },
    "tags": [],
    "changes": [],
    "links": {
      "children": [],
      "classAssociations": [
        {
          "id": "pf1.class-abilities.uURWe8xOp8w7YBQY",
          "dataType": "compendium",
          "name": "Twin Eidolon (UC)",
          "img": "systems/pf1/icons/skills/yellow_14.jpg",
          "level": 20,
          "_index": 0
        },
        {
          "id": "pf1.class-abilities.Yr1ZNxgxDVsRwxtj",
          "dataType": "compendium",
          "name": "Eidolon (UC)",
          "img": "systems/pf1/icons/skills/blue_26.jpg",
          "level": 1,
          "_index": 1
        },
        {
          "id": "pf1.class-abilities.xYuyemfGIFp0a97P",
          "dataType": "compendium",
          "name": "Life Link",
          "img": "systems/pf1/icons/spells/link-blue-3.jpg",
          "level": 1,
          "_index": 2
        },
        {
          "id": "pf1.class-abilities.pMpN2f4mTgLt2NaR",
          "dataType": "compendium",
          "name": "Summon Monster (UC)",
          "img": "systems/pf1/icons/spells/runes-magenta-3.jpg",
          "level": 1,
          "_index": 3
        },
        {
          "id": "pf1.class-abilities.AaZ3OdpKFsMC6dFg",
          "dataType": "compendium",
          "name": "Shield Ally",
          "img": "systems/pf1/icons/spells/protect-blue-1.jpg",
          "level": 4,
          "_index": 4
        },
        {
          "id": "pf1.class-abilities.81XUmdEI8Yr0UXeG",
          "dataType": "compendium",
          "name": "Greater Shield Ally",
          "img": "systems/pf1/icons/skills/blue_18.jpg",
          "level": 12,
          "_index": 5
        },
        {
          "id": "pf1.class-abilities.r5dE8fMdwjLVCHma",
          "dataType": "compendium",
          "name": "Aspect",
          "img": "systems/pf1/icons/skills/beast_01.jpg",
          "level": 10,
          "_index": 6
        },
        {
          "id": "pf1.class-abilities.ew7BBQtX2HrVhxOu",
          "dataType": "compendium",
          "name": "Greater Aspect",
          "img": "systems/pf1/icons/skills/blue_34.jpg",
          "level": 18,
          "_index": 7
        },
        {
          "id": "pf1.class-abilities.YOanbBgt7VuD5QDt",
          "dataType": "compendium",
          "name": "Maker's Call (UC)",
          "img": "systems/pf1/icons/spells/link-eerie-1.jpg",
          "level": 6,
          "_index": 8
        },
        {
          "id": "pf1.class-abilities.fJuxnPlNDncuHuT5",
          "dataType": "compendium",
          "name": "Bond Senses (UC)",
          "img": "systems/pf1/icons/spells/evil-eye-eerie-2.jpg",
          "level": 2,
          "_index": 9
        },
        {
          "id": "pf1.class-abilities.NAso2tQYl5bBfL1O",
          "dataType": "compendium",
          "name": "Transposition",
          "img": "systems/pf1/icons/spells/link-spirit-3.jpg",
          "level": 8,
          "_index": 10
        },
        {
          "id": "pf1.class-abilities.ZF6FlGlFJRaiO4OH",
          "dataType": "compendium",
          "name": "Life Bond",
          "img": "systems/pf1/icons/skills/blood_04.jpg",
          "level": 14,
          "_index": 11
        },
        {
          "id": "pf1.class-abilities.k9ZGUwUB9yJiz4Ea",
          "dataType": "compendium",
          "name": "Merge Forms (UC)",
          "img": "systems/pf1/icons/skills/blue_37.jpg",
          "level": 16,
          "_index": 12
        }
      ]
    },
    "tag": "summonerUnchained",
    "useCustomTag": true,
    "armorProf": {
      "value": ["lgt"]
    },
    "weaponProf": {
      "value": ["sim"]
    },
    "languages": {
      "value": []
    },
    "flags": {
      "boolean": [],
      "dictionary": []
    },
    "scriptCalls": [],
    "bab": "med",
    "skillsPerLevel": 2,
    "savingThrows": {
      "will": {
        "value": "high"
      }
    },
    "classSkills": {
      "crf": true,
      "acr": false,
      "apr": false,
      "art": false,
      "blf": false,
      "clm": false,
      "dip": false,
      "dev": false,
      "dis": false,
      "esc": false,
      "fly": true,
      "han": true,
      "hea": false,
      "int": false,
      "kar": true,
      "kdu": true,
      "ken": true,
      "kge": true,
      "khi": true,
      "klo": true,
      "kna": true,
      "kno": true,
      "kpl": true,
      "kre": true,
      "lin": true,
      "lor": false,
      "per": false,
      "prf": false,
      "pro": true,
      "rid": true,
      "sen": false,
      "slt": false,
      "spl": true,
      "ste": false,
      "sur": false,
      "swm": false,
      "umd": true
    }
  },
  "ownership": {
    "default": 0
  },
  "_stats": {
    "systemId": "pf1",
    "systemVersion": "0.82.1",
    "coreVersion": "10.285",
    "createdTime": 1663018728641,
    "modifiedTime": 1663018728971,
    "lastModifiedBy": "DbeAbHwpEqczKjsD"
  }
}
