{
  "_id": "lnahlmp5mih2ongh",
  "name": "Astral Projection",
  "type": "spell",
  "img": "systems/pf1/icons/misc/magic-swirl.png",
  "effects": [],
  "folder": null,
  "sort": 0,
  "flags": {},
  "system": {
    "tags": [],
    "actions": [
      {
        "_id": "fygl96nb16mz6cht",
        "name": "Use",
        "img": "systems/pf1/icons/misc/magic-swirl.png",
        "description": "",
        "tag": "",
        "activation": {
          "cost": 30,
          "type": "minute"
        },
        "unchainedAction": {
          "activation": {
            "cost": 30,
            "type": "minute"
          }
        },
        "duration": {
          "value": "see text",
          "units": ""
        },
        "target": {
          "value": "you plus one additional willing creature touched per two caster levels"
        },
        "range": {
          "value": null,
          "units": "touch",
          "maxIncrements": 1,
          "minValue": null,
          "minUnits": ""
        },
        "uses": {
          "autoDeductCharges": true,
          "autoDeductChargesCost": "1",
          "self": {
            "value": 0,
            "maxFormula": "",
            "per": null
          },
          "per": "",
          "value": 0,
          "maxFormula": ""
        },
        "measureTemplate": {
          "type": "",
          "size": "0",
          "overrideColor": false,
          "customColor": "",
          "overrideTexture": false,
          "customTexture": ""
        },
        "attackName": "",
        "actionType": "",
        "attackBonus": "",
        "critConfirmBonus": "",
        "damage": {
          "parts": [],
          "critParts": [],
          "nonCritParts": []
        },
        "attackParts": [],
        "formulaicAttacks": {
          "count": {
            "formula": ""
          },
          "bonus": {
            "formula": ""
          },
          "label": null
        },
        "formula": "",
        "ability": {
          "attack": "",
          "damage": "",
          "damageMult": 1,
          "critRange": 20,
          "critMult": 2
        },
        "save": {
          "dc": "0",
          "type": "",
          "description": ""
        },
        "effectNotes": [],
        "attackNotes": [],
        "soundEffect": "",
        "powerAttack": {
          "multiplier": "",
          "damageBonus": 2,
          "critMultiplier": 1
        },
        "naturalAttack": {
          "primaryAttack": true,
          "secondary": {
            "attackBonus": "-5",
            "damageMult": 0.5
          }
        },
        "nonlethal": false,
        "usesAmmo": false,
        "spellEffect": "",
        "spellArea": "",
        "conditionals": [],
        "enh": {
          "value": null
        }
      }
    ],
    "uses": {
      "per": ""
    },
    "attackNotes": [],
    "effectNotes": [],
    "links": {
      "children": []
    },
    "flags": {
      "boolean": [],
      "dictionary": []
    },
    "scriptCalls": [],
    "learnedAt": {
      "class": [
        ["sorcerer/wizard", 9],
        ["cleric/oracle", 9],
        ["witch", 9],
        ["psychic", 9]
      ],
      "domain": [["Travel", 9]],
      "subDomain": [],
      "elementalSchool": [],
      "bloodline": [["Dreamspun", 9]]
    },
    "level": 9,
    "school": "nec",
    "components": {
      "verbal": true,
      "somatic": true,
      "material": true
    },
    "materials": {
      "value": "1,000 gp jacinth",
      "gpValue": 1000
    },
    "spellbook": "",
    "preparation": {
      "autoDeductCharges": false,
      "spontaneousPrepared": false
    },
    "shortDescription": "<p>By freeing your spirit from your physical body, this spell allows you to project an astral body onto another plane altogether. You can bring the astral forms of other willing creatures with you, provided that these subjects are linked in a circle with you at the time of the casting. These fellow travelers are dependent upon you and must accompany you at all times. If something happens to you during the journey, your companions are stranded wherever you left them.</p><p>You project your astral self onto the Astral Plane, leaving your physical body behind on the Material Plane in a state of suspended animation. The spell projects an astral copy of you and all you wear or carry onto the Astral Plane. Since the Astral Plane touches upon other planes, you can travel astrally to any of these other planes as you will. To enter one, you leave the Astral Plane, forming a new physical body (and equipment) on the plane of existence you have chosen to enter.</p><p>While you are on the Astral Plane, your astral body is connected at all times to your physical body by an incorporeal silver cord. If the cord is broken, you are killed, astrally and physically. Luckily, very few things can destroy a silver cord. When a second body is formed on a different plane, the silver cord remains invisibly attached to the new body. If the second body or the astral form is slain, the cord simply returns to your body where it rests on the Material Plane, thereby reviving it from its state of suspended animation. This is a traumatic affair, however, and you gain two permanent negative levels if your second body or astral form is slain. Although astral projections are able to function on the Astral Plane, their actions affect only creatures existing on the Astral Plane; a physical body must be materialized on other planes.</p><p>You and your companions may travel through the Astral Plane indefinitely. Your bodies simply wait behind in a state of suspended animation until you choose to return your spirits to them. The spell lasts until you desire to end it, or until it is terminated by some outside means, such as <i>dispel magic</i> cast upon either the physical body or the astral form, the breaking of the silver cord, or the destruction of your body back on the Material Plane (which kills you).</p><p>When this spell ends, your astral body and all of its gear, vanishes.</p>"
  },
  "ownership": {
    "default": 0
  },
  "_stats": {
    "systemId": "pf1",
    "systemVersion": "0.82.1",
    "coreVersion": "10.285",
    "createdTime": 1663018734051,
    "modifiedTime": 1663018744877,
    "lastModifiedBy": "DbeAbHwpEqczKjsD"
  }
}
