{
  "name": "Greater Medium Ring",
  "flags": {},
  "description": "",
  "results": [
    {
      "_id": "mXik3AjEp7SzmuOC",
      "flags": {},
      "type": 0,
      "text": "Ring of Inner Fortitude, Minor",
      "weight": 4,
      "range": [1, 4],
      "drawn": false
    },
    {
      "_id": "6cOZ5xTDzGbc1jpb",
      "flags": {},
      "type": 0,
      "text": "Ring of Protection +3",
      "weight": 12,
      "range": [5, 16],
      "drawn": false
    },
    {
      "_id": "vhp4pKdCPSdd8aJn",
      "flags": {},
      "type": 0,
      "text": "Ring of Spell Storing, Minor",
      "weight": 10,
      "range": [17, 26],
      "drawn": false
    },
    {
      "_id": "9NNobViBFYwMMeYz",
      "flags": {},
      "type": 0,
      "text": "Ring of Energy Shroud (Electricity), Minor",
      "weight": 4,
      "range": [27, 30],
      "drawn": false
    },
    {
      "_id": "Qt0HHzmMqYfMpONH",
      "flags": {},
      "type": 0,
      "text": "Ring of Arcane Mastery",
      "weight": 5,
      "range": [31, 35],
      "drawn": false
    },
    {
      "_id": "KIwK73ysIOWrs9qk",
      "flags": {},
      "type": 0,
      "text": "Ring of Invisibility",
      "weight": 11,
      "range": [36, 46],
      "drawn": false
    },
    {
      "_id": "4LeRu6QfVv1zocN6",
      "flags": {},
      "type": 0,
      "text": "Ring of Wizardry I",
      "weight": 8,
      "range": [47, 54],
      "drawn": false
    },
    {
      "_id": "gmK2oHCu5V3I9aRu",
      "flags": {},
      "type": 0,
      "text": "Ring of Revelation, Superior",
      "weight": 6,
      "range": [55, 60],
      "drawn": false
    },
    {
      "_id": "SarBdU9xzIwt55oG",
      "flags": {},
      "type": 0,
      "text": "Ring of Spell Knowledge IV",
      "weight": 8,
      "range": [61, 68],
      "drawn": false
    },
    {
      "_id": "PbNn3tMM3W83rSbX",
      "flags": {},
      "type": 0,
      "text": "Ring of Evasion",
      "weight": 12,
      "range": [69, 80],
      "drawn": false
    },
    {
      "_id": "BipdwCqtsfhWZ3Xl",
      "flags": {},
      "type": 0,
      "text": "Ring of X-Ray Vision",
      "weight": 8,
      "range": [81, 88],
      "drawn": false
    },
    {
      "_id": "lzRKWYZ42VGWDy7q",
      "flags": {},
      "type": 0,
      "text": "Ring of Blinking",
      "weight": 12,
      "range": [89, 100],
      "drawn": false
    }
  ],
  "formula": "1d100",
  "replacement": true,
  "displayRoll": true,
  "_id": "oi89OBTO8p4JGduA",
  "ownership": {
    "default": 0
  }
}
