{
  "_id": "a3P821aUxxJbSpVV",
  "name": "Mutagen, Str",
  "type": "buff",
  "img": "icons/tools/laboratory/vial-orange.webp",
  "effects": [],
  "folder": null,
  "sort": 0,
  "flags": {},
  "system": {
    "tags": [],
    "changes": [
      {
        "_id": "5em86dex",
        "formula": "4",
        "operator": "add",
        "subTarget": "str",
        "modifier": "alchemical",
        "priority": 0,
        "value": 0,
        "target": "ability"
      },
      {
        "_id": "jieaewfc",
        "formula": "-2",
        "operator": "add",
        "subTarget": "int",
        "modifier": "alchemical",
        "priority": 0,
        "value": 0,
        "target": "ability"
      },
      {
        "_id": "vvzlv2eb",
        "formula": "2",
        "operator": "add",
        "subTarget": "nac",
        "modifier": "alchemical",
        "priority": 0,
        "value": 0,
        "target": "ac"
      }
    ],
    "contextNotes": [],
    "links": {
      "children": []
    },
    "tag": "mutagenStr",
    "flags": {
      "boolean": [],
      "dictionary": []
    },
    "scriptCalls": [],
    "level": "1",
    "duration": {
      "value": "@item.level * 10",
      "units": "minute"
    },
    "hideFromToken": true
  },
  "ownership": {
    "default": 0
  },
  "_stats": {
    "systemId": "pf1",
    "systemVersion": "0.82.1",
    "coreVersion": "10.285",
    "createdTime": 1663018729303,
    "modifiedTime": 1663018729407,
    "lastModifiedBy": "DbeAbHwpEqczKjsD"
  }
}
