{
  "_id": "3QJ79Cq3qXHRxJZq",
  "name": "Infusion Specialization",
  "type": "feat",
  "img": "systems/pf1/icons/spells/light-air-fire-2.jpg",
  "effects": [],
  "folder": null,
  "sort": 0,
  "flags": {},
  "system": {
    "description": {
      "value": "<p>At 5th level, whenever a kineticist uses one or more infusions with a blast, she reduces the combined burn cost of the infusions by 1. This can’t reduce the total cost of the infusions used below 0.</p>\n<p>She reduces the burn cost by 1 additional point at 8th, 11th, 14th, 17th, and 20th levels.</p>"
    },
    "tags": [],
    "actions": [],
    "attackNotes": [],
    "effectNotes": [],
    "changes": [],
    "contextNotes": [],
    "links": {
      "children": [],
      "charges": []
    },
    "tag": "classFeat_infusionSpecialization",
    "useCustomTag": true,
    "armorProf": {
      "value": []
    },
    "weaponProf": {
      "value": []
    },
    "languages": {
      "value": []
    },
    "scriptCalls": [],
    "featType": "classFeat",
    "associations": {
      "classes": [["Kineticist"]]
    },
    "abilityType": "ex"
  },
  "ownership": {
    "default": 0
  },
  "_stats": {
    "systemId": "pf1",
    "systemVersion": "0.82.1",
    "coreVersion": "10.285",
    "createdTime": 1663018762085,
    "modifiedTime": 1663018778091,
    "lastModifiedBy": "DbeAbHwpEqczKjsD"
  }
}
