{
  "_id": "Wkv124hVPATT35bm",
  "name": "Aura",
  "type": "feat",
  "img": "systems/pf1/icons/skills/blue_35.jpg",
  "effects": [],
  "folder": null,
  "sort": 0,
  "flags": {},
  "system": {
    "description": {
      "value": "<p>A cleric of a chaotic, evil, good, or lawful deity has a particularly powerful aura corresponding to the deity&rsquo;s alignment (see @Compendium[pf1.spells.tr7m97npkbgm4wp7]{Detect Evil} for details).</p>"
    },
    "tags": [],
    "actions": [],
    "attackNotes": [],
    "effectNotes": [],
    "changes": [],
    "contextNotes": [],
    "links": {
      "children": [],
      "charges": []
    },
    "tag": "classFeat_aura",
    "useCustomTag": true,
    "armorProf": {
      "value": []
    },
    "weaponProf": {
      "value": []
    },
    "languages": {
      "value": []
    },
    "scriptCalls": [],
    "featType": "classFeat",
    "associations": {
      "classes": [["Cleric"]]
    },
    "abilityType": "ex"
  },
  "ownership": {
    "default": 0
  },
  "_stats": {
    "systemId": "pf1",
    "systemVersion": "0.82.1",
    "coreVersion": "10.285",
    "createdTime": 1663018766135,
    "modifiedTime": 1663018778297,
    "lastModifiedBy": "DbeAbHwpEqczKjsD"
  }
}
