{
  "_id": "bosoyirljrelcyuc",
  "name": "Blue Book",
  "type": "loot",
  "img": "systems/pf1/icons/items/inventory/dice.jpg",
  "effects": [],
  "folder": null,
  "sort": 0,
  "flags": {},
  "system": {
    "description": {
      "value": "\r\n<p><b>Blue Book</b> This book details the seedier entertainment establishments in one major city. It contains the names of brothels, burlesque houses, and gambling halls in that city. By consulting the book for 1 hour, for the next 24 hours you gain a +2 circumstance bonus on <a href=\"https://www.d20pfsrd.com/skills/knowledge\">Knowledge</a> (local), Bluff, and Diplomacy checks to gather or use information in that city. At the GM's discretion, you can use it in settlements near that city for a +1 bonus. <b>Price</b> 5 gp; <b>Weight</b> 1 lb.</p>\r\n"
    },
    "tags": [],
    "weight": {
      "value": 1
    },
    "price": 5,
    "equipped": false,
    "changes": [],
    "contextNotes": [],
    "links": {
      "children": []
    },
    "flags": {
      "boolean": [],
      "dictionary": []
    },
    "scriptCalls": [],
    "subType": "gear"
  },
  "ownership": {
    "default": 0
  },
  "_stats": {
    "systemId": "pf1",
    "systemVersion": "0.82.1",
    "coreVersion": "10.285",
    "createdTime": 1663018752942,
    "modifiedTime": 1663018755673,
    "lastModifiedBy": "DbeAbHwpEqczKjsD"
  }
}
