{
  "_id": "11ClnanF4PdEPd9g",
  "name": "Rapid Reload",
  "type": "feat",
  "img": "systems/pf1/icons/feats/rapid-reload.jpg",
  "effects": [],
  "folder": null,
  "sort": 0,
  "flags": {},
  "system": {
    "description": {
      "value": "<p><em>Choose a type of crossbow (hand, light, or heavy). You can reload such weapons quickly.</em></p>\n<p>&nbsp;</p>\n<p><strong>Prerequisite</strong></p>\n<p>Weapon Proficiency (crossbow type chosen).</p>\n<p>&nbsp;</p>\n<p><strong>Benefit</strong></p>\n<p>The time required for you to reload your chosen type of crossbow is reduced to a free action (for a hand or light crossbow) or a move action (for a heavy crossbow). Reloading a crossbow still provokes an attack of opportunity.</p>\n<p>If you have selected this feat for hand crossbow or light crossbow, you may fire that weapon as many times in a full-attack action as you could attack if you were using a bow.</p>\n<p>&nbsp;</p>\n<p><strong>Normal</strong></p>\n<p>A character without this feat needs a move action to reload a hand or light crossbow, or a full-round action to reload a heavy crossbow.</p>\n<p>&nbsp;</p>\n<p><strong>Special</strong></p>\n<p>You can gain Rapid Reload multiple times. Each time you take the feat, it applies to a new type of crossbow.</p>"
    },
    "tags": [["Combat"], ["Ranged"], ["Weapon"], ["Offensive"]],
    "actions": [],
    "attackNotes": [],
    "effectNotes": [],
    "changes": [],
    "contextNotes": [],
    "links": {
      "children": [],
      "charges": []
    },
    "tag": "feat_rapidReload",
    "useCustomTag": true,
    "armorProf": {
      "value": []
    },
    "weaponProf": {
      "value": []
    },
    "languages": {
      "value": []
    },
    "scriptCalls": [],
    "associations": {
      "classes": []
    }
  },
  "ownership": {
    "default": 0
  },
  "_stats": {
    "systemId": "pf1",
    "systemVersion": "0.82.1",
    "coreVersion": "10.285",
    "createdTime": 1663018751731,
    "modifiedTime": 1663018752328,
    "lastModifiedBy": "DbeAbHwpEqczKjsD"
  }
}
