{
  "_id": "Bs5i98ja24ODe9WL",
  "name": "Hunter's Bond",
  "type": "feat",
  "img": "systems/pf1/icons/skills/green_21.jpg",
  "effects": [],
  "folder": null,
  "sort": 0,
  "flags": {},
  "system": {
    "description": {
      "value": "<p>At 4th level, a ranger forms a bond with his hunting companions. This bond can take one of two forms. Once the form is chosen, it cannot be changed. The first is a bond to his companions. This bond allows him to spend a&nbsp;<a href=\"https://www.d20pfsrd.com/gamemastering/combat#TOC-Move-Actions\">move action</a>&nbsp;to grant half his&nbsp;<a href=\"https://www.d20pfsrd.com/classes/core-classes/Ranger/#TOC-Favored-Enemy-Ex-\">favored enemy</a>&nbsp;bonus against a single target of the appropriate type to all allies within 30 feet who can see or hear him. This bonus lasts for a number of rounds equal to the ranger’s&nbsp;<a href=\"https://www.d20pfsrd.com/basics-ability-scores/ability-scores#TOC-Wisdom-Wis-\">Wisdom</a>&nbsp;modifier (minimum 1). This bonus does not stack with any&nbsp;<a href=\"https://www.d20pfsrd.com/classes/core-classes/Ranger/#TOC-Favored-Enemy-Ex-\">favored enemy</a>&nbsp;bonuses possessed by his allies; they use whichever bonus is higher.</p>\n<p>The second option is to form a close bond with an&nbsp;<a href=\"https://www.d20pfsrd.com/classes/core-classes/druid/animal-companions\">animal companion</a>. A ranger who selects an&nbsp;<a href=\"https://www.d20pfsrd.com/classes/core-classes/druid/animal-companions\">animal companion</a>&nbsp;can choose from the following list:&nbsp;<a href=\"https://www.d20pfsrd.com/classes/core-classes/druid/animal-companions#TOC-Badger\">badger</a>,&nbsp;<a href=\"https://www.d20pfsrd.com/classes/core-classes/druid/animal-companions#TOC-Bird\">bird</a>,&nbsp;<a href=\"https://www.d20pfsrd.com/classes/core-classes/druid/animal-companions#TOC-camel\">camel</a>,&nbsp;<a href=\"https://www.d20pfsrd.com/classes/core-classes/druid/animal-companions#TOC-Cat-Small\">cat (small)</a>,&nbsp;<a href=\"https://www.d20pfsrd.com/classes/core-classes/druid/animal-companions#TOC-Rat-Dire\">dire rat</a>,&nbsp;<a href=\"https://www.d20pfsrd.com/classes/core-classes/druid/animal-companions#TOC-Dog\">dog</a>,&nbsp;<a href=\"https://www.d20pfsrd.com/classes/core-classes/druid/animal-companions#TOC-Horse\">horse</a>,&nbsp;<a href=\"https://www.d20pfsrd.com/classes/core-classes/druid/animal-companions#TOC-Pony\">pony</a>, snake (<a href=\"https://www.d20pfsrd.com/classes/core-classes/druid/animal-companions#TOC-Snake-Viper\">viper</a>&nbsp;or&nbsp;<a href=\"https://www.d20pfsrd.com/classes/core-classes/druid/animal-companions#TOC-Snake-Constrictor\">constrictor</a>), or&nbsp;<a href=\"https://www.d20pfsrd.com/classes/core-classes/druid/animal-companions#TOC-Wolf\">wolf</a>. If the campaign takes place wholly or partly in an aquatic environment, the ranger may choose a shark instead. This animal is a loyal companion that accompanies the ranger on his adventures as appropriate for its kind. A ranger’s&nbsp;<a href=\"https://www.d20pfsrd.com/classes/core-classes/druid/animal-companions\">animal companion</a>&nbsp;shares his&nbsp;<a href=\"https://www.d20pfsrd.com/classes/core-classes/Ranger/#TOC-Favored-Enemy-Ex-\">favored enemy</a>&nbsp;and&nbsp;<a href=\"https://www.d20pfsrd.com/classes/core-classes/Ranger/#TOC-Favored-Terrain-Ex-\">favored terrain</a>&nbsp;bonuses.</p>\n<p>This ability functions like the&nbsp;<a href=\"https://www.d20pfsrd.com/classes/core-classes/druid\">druid</a>&nbsp;<a href=\"https://www.d20pfsrd.com/classes/core-classes/druid/animal-companions\">animal companion</a>&nbsp;ability (which is part of the Nature Bond class feature), except that the ranger’s effective&nbsp;<a href=\"https://www.d20pfsrd.com/classes/core-classes/druid\">druid</a>&nbsp;level is equal to his ranger level –3.</p>\n<p>A ranger can select a antelope, baboon, bustard, capybara, elk, falcon, kangaroo,&nbsp;<a href=\"https://www.d20pfsrd.com/bestiary/monster-listings/animals/lizard/lizard-common\">lizard</a>&nbsp;(<a href=\"https://www.d20pfsrd.com/bestiary/monster-listings/animals/lizard/lizard-giant-gecko\">giant gecko</a>), marsupial devil, ram, reindeer,&nbsp;<a href=\"https://www.d20pfsrd.com/bestiary/monster-listings/animals/snake\">snake</a>&nbsp;(reef snake or&nbsp;<a href=\"https://www.d20pfsrd.com/bestiary/monster-listings/animals/snake/snake-cobra-spitting\">spitting cobra</a>), stag, trumpeter swan, thylacine, wolfdog, yak, or zebra as an&nbsp;<a href=\"https://www.d20pfsrd.com/classes/core-classes/druid/animal-companions\">animal companion</a>. If the campaign takes place in an aquatic environment, the ranger can choose an armorfish or reef snake. A falconer ranger can select a falcon companion instead of a bird companion.</p>\n<p>If the campaign takes place in an aquatic environment, the ranger can choose a stingray.</p>\n<p>The&nbsp;<a href=\"https://www.d20pfsrd.com/classes/core-classes/druid/animal-companions/animal-companion-archetypes/ambusher-companion-archetype/\">ambusher</a>,&nbsp;<a href=\"https://www.d20pfsrd.com/classes/core-classes/druid/animal-companions/animal-companion-archetypes/bully-companion-archetype/\">bully</a>,&nbsp;<a href=\"https://www.d20pfsrd.com/classes/core-classes/druid/animal-companions/animal-companion-archetypes/daredevil-companion-archetype/\">daredevil</a>,&nbsp;<a href=\"https://www.d20pfsrd.com/classes/core-classes/druid/animal-companions/animal-companion-archetypes/feytouched-companion-archetype/\">feytouched companion</a>,&nbsp;<a href=\"https://www.d20pfsrd.com/classes/core-classes/druid/animal-companions/animal-companion-archetypes/precocious-companion-archetype/\">precocious companion</a>,&nbsp;<a href=\"https://www.d20pfsrd.com/classes/core-classes/druid/animal-companions/animal-companion-archetypes/totem-guide-companion-archetype/\">totem guide</a>,&nbsp;<a href=\"https://www.d20pfsrd.com/classes/core-classes/druid/animal-companions/animal-companion-archetypes/tracker-companion-archetype/\">tracker</a>,&nbsp;<a href=\"https://www.d20pfsrd.com/classes/core-classes/druid/animal-companions/animal-companion-archetypes/verdant-companion-archetype/\">verdant companion</a>, and&nbsp;<a href=\"https://www.d20pfsrd.com/classes/core-classes/druid/animal-companions/animal-companion-archetypes/wrecker-companion-archetype/\">wrecker archetypes</a>&nbsp;are all particularly appropriate for a&nbsp;<a href=\"https://www.d20pfsrd.com/classes/core-classes/ranger\">ranger’s</a>&nbsp;<a href=\"https://www.d20pfsrd.com/classes/core-classes/druid/animal-companions\">animal companion</a>.</p>"
    },
    "tags": [],
    "actions": [
      {
        "_id": "6n26gjjtvlmtvhce",
        "name": "Use",
        "img": "systems/pf1/icons/skills/green_21.jpg",
        "description": "",
        "tag": "",
        "activation": {
          "cost": 1,
          "type": "passive"
        },
        "unchainedAction": {
          "activation": {
            "cost": 1,
            "type": "passive"
          }
        },
        "duration": {
          "value": null,
          "units": ""
        },
        "target": {
          "value": ""
        },
        "range": {
          "value": null,
          "units": "",
          "maxIncrements": 1,
          "minValue": null,
          "minUnits": ""
        },
        "uses": {
          "autoDeductCharges": true,
          "autoDeductChargesCost": "1",
          "self": {
            "value": 0,
            "maxFormula": "",
            "per": null
          },
          "per": "",
          "value": 0,
          "maxFormula": ""
        },
        "measureTemplate": {
          "type": "",
          "size": "0",
          "overrideColor": false,
          "customColor": "",
          "overrideTexture": false,
          "customTexture": ""
        },
        "attackName": "",
        "actionType": "",
        "attackBonus": "",
        "critConfirmBonus": "",
        "damage": {
          "parts": [],
          "critParts": [],
          "nonCritParts": []
        },
        "attackParts": [],
        "formulaicAttacks": {
          "count": {
            "formula": ""
          },
          "bonus": {
            "formula": ""
          },
          "label": null
        },
        "formula": "",
        "ability": {
          "attack": null,
          "damage": null,
          "damageMult": 1,
          "critRange": 20,
          "critMult": 2
        },
        "save": {
          "dc": 0,
          "type": "",
          "description": ""
        },
        "effectNotes": [],
        "attackNotes": [],
        "soundEffect": "",
        "powerAttack": {
          "multiplier": "",
          "damageBonus": 2,
          "critMultiplier": 1
        },
        "naturalAttack": {
          "primaryAttack": true,
          "secondary": {
            "attackBonus": "-5",
            "damageMult": 0.5
          }
        },
        "nonlethal": false,
        "usesAmmo": false,
        "spellEffect": "",
        "spellArea": "",
        "conditionals": [],
        "enh": {
          "value": null
        }
      }
    ],
    "uses": {
      "per": ""
    },
    "attackNotes": [],
    "effectNotes": [],
    "changes": [],
    "contextNotes": [],
    "links": {
      "children": [],
      "charges": []
    },
    "tag": "classFeat_huntersBond",
    "useCustomTag": true,
    "armorProf": {
      "value": []
    },
    "weaponProf": {
      "value": []
    },
    "languages": {
      "value": []
    },
    "scriptCalls": [],
    "featType": "classFeat",
    "associations": {
      "classes": [["Ranger"]]
    },
    "abilityType": "ex"
  },
  "ownership": {
    "default": 0
  },
  "_stats": {
    "systemId": "pf1",
    "systemVersion": "0.82.1",
    "coreVersion": "10.285",
    "createdTime": 1663018763412,
    "modifiedTime": 1663018778158,
    "lastModifiedBy": "DbeAbHwpEqczKjsD"
  }
}
