{
  "_id": "ohtgksinvafoozaz",
  "name": "Bathtub, Collapsible",
  "type": "loot",
  "img": "systems/pf1/icons/items/inventory/dice.jpg",
  "effects": [],
  "folder": null,
  "sort": 0,
  "flags": {},
  "system": {
    "description": {
      "value": "<h4><span id=\"Bathtub_Collapsible\"><a name=\"TOC-Bathtub-Collapsible\"></a>Bathtub, Collapsible</span></h4>\r\n<p><b>Price</b> 15 gp; <b>Weight</b> 20 lbs.</p>\r\n<p>After 10 minutes of assembly, this collection of wooden slats provides support for a cylindrical watertight <a href=\"https://www.d20pfsrd.com/equipment/goods-and-services/hunting-camping-survival-geaR/#TOC-Canvas-sq.-yd.-\">canvas</a> cloth. It can hold enough water to allow 1 Medium creature to bathe in comfort without any of the risks that might come from entering lakes, rivers, or other bodies of water.</p>\r\n"
    },
    "tags": [],
    "weight": {
      "value": 20
    },
    "price": 15,
    "equipped": false,
    "changes": [],
    "contextNotes": [],
    "links": {
      "children": []
    },
    "flags": {
      "boolean": [],
      "dictionary": []
    },
    "scriptCalls": [],
    "subType": "gear"
  },
  "ownership": {
    "default": 0
  },
  "_stats": {
    "systemId": "pf1",
    "systemVersion": "0.82.1",
    "coreVersion": "10.285",
    "createdTime": 1663018753321,
    "modifiedTime": 1663018755700,
    "lastModifiedBy": "DbeAbHwpEqczKjsD"
  }
}
