{
  "_id": "xmadurflmimdpetv",
  "name": "Consulting A Guide",
  "type": "loot",
  "img": "systems/pf1/icons/items/inventory/dice.jpg",
  "effects": [],
  "folder": null,
  "sort": 0,
  "flags": {},
  "system": {
    "description": {
      "value": "\r\n<p>A PC may consult a dungeon guide whenever he enters a new room or area of the dungeon to learn more about his current location, similar to how one gains information by making a <a href=\"https://www.d20pfsrd.com/skills/knowledge\">Knowledge</a> check. Consulting a dungeon guide takes 10 minutes, and a dungeon guide may only be consulted once in a given area. A dungeon guide only makes sense in context, and thus cannot be consulted outside of the relevant dungeon except for the briefest and most general information about the dungeon in question.</p>\r\n<p>When a PC consults a dungeon guide, the GM makes an accuracy check for the guide by secretly rolling a d20 and adding the guide's accuracy modifier to the roll. The GM then compares the result of the accuracy check to the DC of the information being sought (see the Accuracy Check DCs table). A GM may modify these DCs at her discretion. If the result is equal to or greater than the accuracy check DC, the GM should give the PC a clue or some knowledge about an aspect of the area in question. For example, the book might mention some historical detail of the room's original purpose, how to disarm an obstructive mechanism, where an exit leads, or if the area is a good place to rest.</p>\r\n<p>If the dungeon guide's accuracy check fails by 4 or less, the book doesn't have any relevant information on the area in question. If the dungeon guide fails the check by 5 or more, the GM should provide the PC with seemingly true information that is actually inaccurate or dangerous in some way. For example, the guide might reveal that there is a trap in the room, but give the wrong location for it.</p>\r\n<p>If a PC possesses ranks in the dungeon guide's associated skill, he may attempt a skill check with the associated skill each time he consults the guide. If his check surpasses the guide's associated skill DC, the guide receives a +2 bonus on its next accuracy check and the PC cannot receive inaccurate information from the guide should it fail this accuracy check by 5 or more (in this case the PC simply receives no pertinent information from consulting the text that time).</p>\r\n<table border=\"1\" cellpadding=\"5\"><caption>Table: Accuracy Check DCs</caption>\r\n<thead>\r\n<tr>\r\n<th class=\"text\">DC</th>\r\n<th class=\"text\">Task</th>\r\n</tr>\r\n</thead>\r\n<tbody>\r\n<tr>\r\n<td class=\"number\">20</td>\r\n<td class=\"text\">Determine a mechanism's function</td>\r\n</tr>\r\n<tr>\r\n<td class=\"number\">20</td>\r\n<td class=\"text\">Determine whether an area is a safe place to rest</td>\r\n</tr>\r\n<tr>\r\n<td class=\"number\">25</td>\r\n<td class=\"text\">Fill in the next area of the map</td>\r\n</tr>\r\n<tr>\r\n<td class=\"number\">25</td>\r\n<td class=\"text\">Get a hint on how to solve a puzzle</td>\r\n</tr>\r\n<tr>\r\n<td class=\"number\">20</td>\r\n<td class=\"text\">Get a vague idea of nearby rooms</td>\r\n</tr>\r\n<tr>\r\n<td class=\"text\">10 + creature's CR</td>\r\n<td class=\"text\">Identify a commonly encountered dungeon denizen</td>\r\n</tr>\r\n<tr>\r\n<td class=\"number\">10</td>\r\n<td class=\"text\">Identify a room's original purpose</td>\r\n</tr>\r\n<tr>\r\n<td class=\"text\">10 + <a href=\"https://www.d20pfsrd.com/gamemastering/traps-hazards-and-special-terrains/traps/\">trap's</a> CR</td>\r\n<td class=\"text\">Locate a hidden <a href=\"https://www.d20pfsrd.com/gamemastering/traps-hazards-and-special-terrains/traps/\">trap</a></td>\r\n</tr>\r\n<tr>\r\n<td class=\"number\">15</td>\r\n<td class=\"text\">Locate a nearby source of food or water</td>\r\n</tr>\r\n</tbody>\r\n</table>\r\n"
    },
    "tags": [],
    "weight": {
      "value": 2
    },
    "price": 50,
    "equipped": false,
    "changes": [],
    "contextNotes": [],
    "links": {
      "children": []
    },
    "flags": {
      "boolean": [],
      "dictionary": []
    },
    "scriptCalls": [],
    "subType": "gear"
  },
  "ownership": {
    "default": 0
  },
  "_stats": {
    "systemId": "pf1",
    "systemVersion": "0.82.1",
    "coreVersion": "10.285",
    "createdTime": 1663018753653,
    "modifiedTime": 1663018755718,
    "lastModifiedBy": "DbeAbHwpEqczKjsD"
  }
}
