{
  "_id": "bCyOJTqkHjOCgPzx",
  "name": "Curse Subdomain",
  "type": "feat",
  "img": "systems/pf1/icons/spells/horror-red-1.jpg",
  "effects": [],
  "folder": null,
  "sort": 0,
  "flags": {},
  "system": {
    "description": {
      "value": "<p><strong>Replacement Domain Spells:</strong></p>\n<ul>\n<li>1st—@Compendium[pf1.spells.3etxlex8u32g0hrx]{Bane}</li>\n<li>3rd—@Compendium[pf1.spells.lsboosfk26m0ycqv]{Bestow Curse}</li>\n<li>6th—@Compendium[pf1.spells.z8xnkfpufuqapseq]{Eyebite}</li>\n</ul>"
    },
    "tags": [],
    "actions": [],
    "attackNotes": [],
    "effectNotes": [],
    "changes": [],
    "contextNotes": [],
    "links": {
      "children": [],
      "charges": []
    },
    "tag": "classFeat_curseSubdomain",
    "useCustomTag": true,
    "armorProf": {
      "value": []
    },
    "weaponProf": {
      "value": []
    },
    "languages": {
      "value": []
    },
    "scriptCalls": [],
    "featType": "classFeat",
    "associations": {
      "classes": [["Cleric"]]
    }
  },
  "ownership": {
    "default": 0
  },
  "_stats": {
    "systemId": "pf1",
    "systemVersion": "0.82.1",
    "coreVersion": "10.285",
    "createdTime": 1663018766658,
    "modifiedTime": 1663018778386,
    "lastModifiedBy": "DbeAbHwpEqczKjsD"
  }
}
