{
  "_id": "4ZPiCFQ4y1bXrz3l",
  "name": "Hotchkiss 6 Pounder",
  "type": "weapon",
  "img": "icons/weapons/artillery/cannon-engraved-gold.webp",
  "effects": [],
  "folder": null,
  "sort": 0,
  "flags": {},
  "system": {
    "description": {
      "value": "<p><strong>Source</strong> <em>Pathfinder #71: Rasputin Must Die! pg. 64</em></p><h3 class=\"framing\">Statistics</h3><p><strong>Cost</strong> 2,000 gp <strong>Weight</strong> special</p><p><strong>Damage</strong> 8d6 ; <strong>Critical</strong> x3; <strong>Range</strong> 300 ft.; <strong>Type</strong> B, P, and S</p><p><strong>Misfire</strong> 1; <strong>Crew</strong> 2; <strong>Aim</strong> 0; <strong>Load</strong> 2</p><p><strong>Category</strong> Siege; <strong>Proficiency</strong> Exotic</p><h3 class=\"framing\">Description</h3><p>The Hotchkiss 6 pounder  gun is a shortened version of the Hotchkiss 6 pounder  naval gun, designed for use in the sponsons of World  War I-era tanks such as the Mark IV. The Hotchkiss  6 pounder is a direct-f ire advanced siege f irearm that  must be mounted in place on a vehicle to be used. It  f ires high explosive (HE) shells that deal 8d6 points  of bludgeoning, piercing, and slashing  damage in a 30-foot radius around the  point of impact (Ref lex DC 20 for  half ). A Hotchkiss 6 pounder is a Medium weapon and  has hardness 10 and 70 hit points. Hotchkiss HE shells  cost 25 gp each and weigh 6 pounds each.\" </p>"
    },
    "tags": [],
    "price": 2000,
    "hp": {
      "max": "10",
      "value": "10"
    },
    "hardness": 10,
    "identifiedName": "Hotchkiss 6 Pounder",
    "changes": [],
    "actions": [
      {
        "_id": "dlfa3883plfrhgsa",
        "name": "Attack",
        "img": "icons/weapons/artillery/cannon-engraved-gold.webp",
        "description": "",
        "tag": "",
        "activation": {
          "cost": 1,
          "type": "attack"
        },
        "unchainedAction": {
          "activation": {
            "cost": 1,
            "type": ""
          }
        },
        "duration": {
          "value": null,
          "units": "inst"
        },
        "target": {
          "value": ""
        },
        "range": {
          "value": "300",
          "units": "ft",
          "maxIncrements": 10,
          "minValue": null,
          "minUnits": ""
        },
        "uses": {
          "autoDeductCharges": true,
          "autoDeductChargesCost": "1",
          "self": {
            "value": 0,
            "maxFormula": "",
            "per": null
          },
          "per": "",
          "value": 0,
          "maxFormula": ""
        },
        "measureTemplate": {
          "type": "",
          "size": "",
          "overrideColor": false,
          "customColor": "",
          "overrideTexture": false,
          "customTexture": ""
        },
        "attackName": "",
        "actionType": "rwak",
        "attackBonus": "",
        "critConfirmBonus": "",
        "damage": {
          "parts": [
            [
              "sizeRoll(8, 6, @size)",
              {
                "values": ["slashing"],
                "custom": ""
              }
            ]
          ],
          "critParts": [],
          "nonCritParts": []
        },
        "attackParts": [],
        "formulaicAttacks": {
          "count": {
            "formula": "min(3, ceil(@attributes.bab.total / 5) - 1)"
          },
          "bonus": {
            "formula": "@formulaicAttack * -5"
          },
          "label": null
        },
        "formula": "",
        "ability": {
          "attack": "dex",
          "damage": "",
          "damageMult": 1,
          "critRange": 20,
          "critMult": 3
        },
        "save": {
          "dc": "0",
          "type": "",
          "description": ""
        },
        "effectNotes": [],
        "attackNotes": [],
        "soundEffect": "",
        "powerAttack": {
          "multiplier": "",
          "damageBonus": 2,
          "critMultiplier": 1
        },
        "naturalAttack": {
          "primaryAttack": true,
          "secondary": {
            "attackBonus": "-5",
            "damageMult": 0.5
          }
        },
        "nonlethal": false,
        "usesAmmo": false,
        "spellEffect": "",
        "spellArea": "",
        "conditionals": [],
        "enh": {
          "value": null
        }
      }
    ],
    "uses": {
      "per": ""
    },
    "attackNotes": [],
    "effectNotes": [],
    "contextNotes": [],
    "links": {
      "children": []
    },
    "tag": "hotchkiss6Pounder",
    "scriptCalls": [],
    "weaponGroups": {
      "value": ["firearms"]
    },
    "weaponType": "exotic",
    "weaponSubtype": "ranged"
  },
  "ownership": {
    "default": 0
  },
  "_stats": {
    "systemId": "pf1",
    "systemVersion": "0.82.1",
    "coreVersion": "10.285",
    "createdTime": 1663018758264,
    "modifiedTime": 1663018759913,
    "lastModifiedBy": "DbeAbHwpEqczKjsD"
  }
}
