{
  "_id": "bJNDKZLDUqYWXevQ",
  "name": "Legendary Champion",
  "type": "feat",
  "img": "systems/pf1/icons/skills/yellow_37.jpg",
  "effects": [],
  "folder": null,
  "sort": 0,
  "flags": {},
  "system": {
    "description": {
      "value": "<p>You gain two combat feats of your choice, and you can choose different feats each time you channel a champion spirit. You can treat your base attack bonus from your medium levels as equal to your medium level for the purposes of qualifying for combat feats and determining their effects, and you can count your medium levels as levels of one other class whose base attack bonus equals its class level (such as fighter, barbarian, or slayer) for the purpose of qualifying for the two new combat feats.</p>"
    },
    "tags": [],
    "actions": [],
    "attackNotes": [],
    "effectNotes": [],
    "changes": [],
    "contextNotes": [],
    "links": {
      "children": [],
      "charges": []
    },
    "tag": "classFeat_legendaryChampion",
    "useCustomTag": true,
    "armorProf": {
      "value": []
    },
    "weaponProf": {
      "value": []
    },
    "languages": {
      "value": []
    },
    "scriptCalls": [],
    "featType": "classFeat",
    "associations": {
      "classes": [["Medium"]]
    },
    "abilityType": "su"
  },
  "ownership": {
    "default": 0
  },
  "_stats": {
    "systemId": "pf1",
    "systemVersion": "0.82.1",
    "coreVersion": "10.285",
    "createdTime": 1663018766664,
    "modifiedTime": 1663018778391,
    "lastModifiedBy": "DbeAbHwpEqczKjsD"
  }
}
