{
  "_id": "bqdgdzahtubuuxmn",
  "name": "Kit, Disguise",
  "type": "loot",
  "img": "systems/pf1/icons/items/inventory/dice.jpg",
  "effects": [],
  "folder": null,
  "sort": 0,
  "flags": {},
  "system": {
    "description": {
      "value": "\r\n<p><b>Price</b> 50 gp; <b>Weight</b> 8 lbs.</p>\r\n<p>This kit contains tools like makeup and fake facial hair, and provides a +2 <a href=\"https://www.d20pfsrd.com/basics-ability-scores/glossary#TOC-Circumstance-Bonus\">circumstance bonus</a> on <a href=\"https://www.d20pfsrd.com/skills/disguise\">Disguise</a> checks. A disguise kit is exhausted after 10 uses.</p>\r\n\r\n"
    },
    "tags": [],
    "weight": {
      "value": 8
    },
    "price": 50,
    "equipped": false,
    "identifiedName": "Kit, Disguise",
    "changes": [
      {
        "_id": "cl9ar24j",
        "formula": "2",
        "operator": "add",
        "subTarget": "skill.dis",
        "modifier": "circumstance",
        "priority": 0,
        "value": 0,
        "target": "skill"
      }
    ],
    "contextNotes": [],
    "links": {
      "children": []
    },
    "tag": "kitDisguise",
    "flags": {
      "boolean": [],
      "dictionary": []
    },
    "scriptCalls": [],
    "subType": "gear"
  },
  "ownership": {
    "default": 0
  },
  "_stats": {
    "systemId": "pf1",
    "systemVersion": "0.82.1",
    "coreVersion": "10.285",
    "createdTime": 1663018752944,
    "modifiedTime": 1663018755673,
    "lastModifiedBy": "DbeAbHwpEqczKjsD"
  }
}
