{
  "_id": "uiecpzatsjjjntzc",
  "name": "Leechwort",
  "type": "loot",
  "img": "systems/pf1/icons/items/inventory/dice.jpg",
  "effects": [],
  "folder": null,
  "sort": 0,
  "flags": {},
  "system": {
    "description": {
      "value": "\r\n<p class=\"source\"><b>Source</b> <a href=\"http://amzn.to/2z71S07\" target=\"_blank\" rel=\"noopener\">PZO1140</a></p>\r\n<p><b>Price</b> 3 gp</p>\r\n<p>When dried and ground into a powder, the mottled red-and-gray bark of this shrub is a <a href=\"https://www.d20pfsrd.com/alternative-rule-systems/mythic#TOC-Boon\">boon</a> to healers. Gather DC 16; <b>Yield</b> 1d4 doses</p>\r\n<p><b>Terrain</b> warm forests or swamps</p>\r\n<p><b>Preparation</b> Properly preparing leechwort for use is a time-consuming process that takes 1 week, as fibers of the shrub must be dried and ground until they achieve a fine, powdery texture. A single herbalist can prepare up to a dozen doses simultaneously in this manner. At the end of the week, a successful DC 15 <a href=\"https://www.d20pfsrd.com/skills/craft\">Craft</a> (alchemy) check results in all of the doses being ready for use; failure indicates that all the doses have spoiled.</p>\r\n<p><b>Use</b> When a dose of prepared leechwort is used in conjunction with a <a href=\"https://www.d20pfsrd.com/skills/heal\">Heal</a> check to <a href=\"https://www.d20pfsrd.com/gamemastering/conditions#TOC-Stable\">stabilize</a> a <a href=\"https://www.d20pfsrd.com/gamemastering/conditions#TOC-Dying\">dying</a> creature, provide long-term care, treat wounds from caltrops (or similar effects), or treat deadly wounds, it grants a +1 <a href=\"https://www.d20pfsrd.com/basics-ability-scores/glossary#TOC-Bonus-Alchemical-\">alchemical bonus</a> on the <a href=\"https://www.d20pfsrd.com/skills/heal\">Heal</a> check. This increases to a +2 <a href=\"https://www.d20pfsrd.com/basics-ability-scores/glossary#TOC-Bonus-Alchemical-\">alchemical bonus</a> on <a href=\"https://www.d20pfsrd.com/skills/heal\">Heal</a> checks to staunch bleeding.</p>\r\n"
    },
    "tags": [],
    "weight": {
      "value": 1
    },
    "price": 25,
    "equipped": false,
    "changes": [],
    "contextNotes": [],
    "links": {
      "children": []
    },
    "flags": {
      "boolean": [],
      "dictionary": []
    },
    "scriptCalls": [],
    "subType": "gear"
  },
  "ownership": {
    "default": 0
  },
  "_stats": {
    "systemId": "pf1",
    "systemVersion": "0.82.1",
    "coreVersion": "10.285",
    "createdTime": 1663018753577,
    "modifiedTime": 1663018755712,
    "lastModifiedBy": "DbeAbHwpEqczKjsD"
  }
}
