{
  "_id": "RxsrOn5n8b9UgNbB",
  "name": "Philosopher's Stone",
  "type": "feat",
  "img": "systems/pf1/icons/items/potions/unique-3.jpg",
  "effects": [],
  "folder": null,
  "sort": 0,
  "flags": {},
  "system": {
    "description": {
      "value": "<p>The alchemist learns how to create a&nbsp;<a href=\"https://aonprd.com/MagicArtifactsDisplay.aspx?ItemName=Philosopher%27s%20Stone\">philosopher’s stone</a>, and can do so once per month at no cost. Creating a philosopher’s stone takes 1 day of work.</p>"
    },
    "tags": [],
    "actions": [],
    "attackNotes": [],
    "effectNotes": [],
    "changes": [],
    "contextNotes": [],
    "links": {
      "children": [],
      "charges": []
    },
    "tag": "classFeat_philosophersStone",
    "useCustomTag": true,
    "armorProf": {
      "value": []
    },
    "weaponProf": {
      "value": []
    },
    "languages": {
      "value": []
    },
    "scriptCalls": [],
    "featType": "classFeat",
    "associations": {
      "classes": [["Alchemist"]]
    }
  },
  "ownership": {
    "default": 0
  },
  "_stats": {
    "systemId": "pf1",
    "systemVersion": "0.82.1",
    "coreVersion": "10.285",
    "createdTime": 1663018765620,
    "modifiedTime": 1663018778267,
    "lastModifiedBy": "DbeAbHwpEqczKjsD"
  }
}
