{
  "_id": "GatqQBeUheQlVvDS",
  "name": "Portents Patron",
  "type": "feat",
  "img": "systems/pf1/icons/feats/improved-familiar.jpg",
  "effects": [],
  "folder": null,
  "sort": 0,
  "flags": {},
  "system": {
    "description": {
      "value": "<ul>\n<li>2nd — @Compendium[pf1.spells.wjdhmfdgwrevax3w]{Ill Omen}</li>\n<li>4th — @Compendium[pf1.spells.tcnirpnzjdaym1fd]{Locate Object}</li>\n<li>6th — @Compendium[pf1.spells.tfml9xp8w3xdq0e8]{Blood Biography}</li>\n<li>8th — @Compendium[pf1.spells.pwueht12qqo0268e]{Divination}</li>\n<li>10th — @Compendium[pf1.spells.68ngvzmzvadhf6vs]{Contact Other Plane}</li>\n<li>12th — @Compendium[pf1.spells.b5mz8voksps5g4yq]{Legend Lore}</li>\n<li>14th — @Compendium[pf1.spells.aqeaxoaozlv9vg35]{Vision}</li>\n<li>16th — @Compendium[pf1.spells.2vb5orfcy57lrfmc]{Moment of Prescience}</li>\n<li>18th — @Compendium[pf1.spells.vl7yer8k1leyuxld]{Foresight}</li>\n</ul>"
    },
    "tags": [],
    "actions": [],
    "attackNotes": [],
    "effectNotes": [],
    "changes": [],
    "contextNotes": [],
    "links": {
      "children": [],
      "charges": []
    },
    "tag": "classFeat_portentsPatron",
    "useCustomTag": true,
    "armorProf": {
      "value": []
    },
    "weaponProf": {
      "value": []
    },
    "languages": {
      "value": []
    },
    "scriptCalls": [],
    "featType": "classFeat",
    "associations": {
      "classes": [["Witch"]]
    }
  },
  "ownership": {
    "default": 0
  },
  "_stats": {
    "systemId": "pf1",
    "systemVersion": "0.82.1",
    "coreVersion": "10.285",
    "createdTime": 1663018763932,
    "modifiedTime": 1663018778194,
    "lastModifiedBy": "DbeAbHwpEqczKjsD"
  }
}
