{
  "name": "Light Armours",
  "flags": {},
  "description": "",
  "results": [
    {
      "_id": "xnSy7QVd9YRiMZiJ",
      "flags": {},
      "type": 0,
      "text": "Haramaki",
      "weight": 1,
      "range": [1, 1],
      "drawn": false
    },
    {
      "_id": "f2QRmAQVkfSLKWjH",
      "flags": {},
      "type": 0,
      "text": "Padded",
      "weight": 1,
      "range": [2, 2],
      "drawn": false
    },
    {
      "_id": "BTw9snd81jbCQNvl",
      "flags": {},
      "type": 0,
      "text": "Quilted Cloth",
      "weight": 1,
      "range": [3, 3],
      "drawn": false
    },
    {
      "_id": "UIV8MpUoUjlFQO8x",
      "flags": {},
      "type": 0,
      "text": "Silken Ceremonial",
      "weight": 1,
      "range": [4, 4],
      "drawn": false
    },
    {
      "_id": "gI1jUGIGCndbBXl3",
      "flags": {},
      "type": 0,
      "text": "Lamellar Cuirass",
      "weight": 1,
      "range": [5, 5],
      "drawn": false
    },
    {
      "_id": "nrXAu0QiHz2MLaOK",
      "flags": {},
      "type": 0,
      "text": "Leather",
      "weight": 1,
      "range": [6, 6],
      "drawn": false
    },
    {
      "_id": "tRaatu147wUtoB0T",
      "flags": {},
      "type": 0,
      "text": "Parade",
      "weight": 1,
      "range": [7, 7],
      "drawn": false
    },
    {
      "_id": "hOYe0MLi2GEcSWQc",
      "flags": {},
      "type": 0,
      "text": "Studded Leather",
      "weight": 1,
      "range": [8, 8],
      "drawn": false
    },
    {
      "_id": "hiPvpVzXJihWAv6B",
      "flags": {},
      "type": 0,
      "text": "Wooden",
      "weight": 1,
      "range": [9, 9],
      "drawn": false
    },
    {
      "_id": "jzFFwhOtn8gQipc7",
      "flags": {},
      "type": 0,
      "text": "Chain Shirt",
      "weight": 1,
      "range": [10, 10],
      "drawn": false
    },
    {
      "_id": "D7EBqmyX0IuMnS3S",
      "flags": {},
      "type": 0,
      "text": "Lamellar (Leather)",
      "weight": 1,
      "range": [11, 11],
      "drawn": false
    }
  ],
  "formula": "1d11",
  "replacement": true,
  "displayRoll": true,
  "_id": "mEokGwFWW4lqg8MG",
  "ownership": {
    "default": 0
  }
}
