{
  "name": "Greater Major Specific Weapons",
  "flags": {},
  "description": "",
  "results": [
    {
      "_id": "9X693Bv3XkiO8FJl",
      "flags": {},
      "type": 0,
      "text": "Ghoul's Lament",
      "weight": 2,
      "range": [1, 2],
      "drawn": false
    },
    {
      "_id": "wLqeKTIZw18diHBk",
      "flags": {},
      "type": 0,
      "text": "Mace of Terror",
      "weight": 3,
      "range": [3, 5],
      "drawn": false
    },
    {
      "_id": "HBbnibFFcsCVTzm0",
      "flags": {},
      "type": 0,
      "text": "Hellscourge",
      "weight": 2,
      "range": [6, 7],
      "drawn": false
    },
    {
      "_id": "4JbLhwkyAVHe5izY",
      "flags": {},
      "type": 0,
      "text": "Dragon's Doom",
      "weight": 2,
      "range": [8, 9],
      "drawn": false
    },
    {
      "_id": "HC1I13H3d7eAErdN",
      "flags": {},
      "type": 0,
      "text": "Life-Drinker",
      "weight": 4,
      "range": [10, 13],
      "drawn": false
    },
    {
      "_id": "JNRm78LEr1XHX8HO",
      "flags": {},
      "type": 0,
      "text": "Valor's Minion",
      "weight": 3,
      "range": [14, 16],
      "drawn": false
    },
    {
      "_id": "o55hWhxVUxBLWsn0",
      "flags": {},
      "type": 0,
      "text": "Summoner's Sorrow",
      "weight": 2,
      "range": [17, 18],
      "drawn": false
    },
    {
      "_id": "KYGJ4YtYA5nqanqI",
      "flags": {},
      "type": 0,
      "text": "Sylvan Scimitar",
      "weight": 3,
      "range": [19, 21],
      "drawn": false
    },
    {
      "_id": "Hg39YOvcUio9EPqo",
      "flags": {},
      "type": 0,
      "text": "Spirit Blade",
      "weight": 2,
      "range": [22, 23],
      "drawn": false
    },
    {
      "_id": "58wSyIc9vW3PmEZO",
      "flags": {},
      "type": 0,
      "text": "Heartswood Spear",
      "weight": 3,
      "range": [24, 26],
      "drawn": false
    },
    {
      "_id": "tMiHkC2qiHLFCQAW",
      "flags": {},
      "type": 0,
      "text": "Rapier of Puncturing",
      "weight": 3,
      "range": [27, 29],
      "drawn": false
    },
    {
      "_id": "FMOqXmpduYmLShYc",
      "flags": {},
      "type": 0,
      "text": "Sun Blade",
      "weight": 3,
      "range": [30, 32],
      "drawn": false
    },
    {
      "_id": "97Z2uRHwgF6IrMHm",
      "flags": {},
      "type": 0,
      "text": "Blade of the Rising Sun",
      "weight": 5,
      "range": [33, 37],
      "drawn": false
    },
    {
      "_id": "d314LpuebwRjPl5e",
      "flags": {},
      "type": 0,
      "text": "Frost Brand",
      "weight": 3,
      "range": [38, 40],
      "drawn": false
    },
    {
      "_id": "4u6yondZfroYRSHq",
      "flags": {},
      "type": 0,
      "text": "Dwarven Thrower",
      "weight": 5,
      "range": [41, 45],
      "drawn": false
    },
    {
      "_id": "nQ2GV4w7SYW5KtnB",
      "flags": {},
      "type": 0,
      "text": "Bloodthirst Dagger",
      "weight": 5,
      "range": [46, 50],
      "drawn": false
    },
    {
      "_id": "oX3R8VTASTeSevsy",
      "flags": {},
      "type": 0,
      "text": "Warbringer",
      "weight": 3,
      "range": [51, 53],
      "drawn": false
    },
    {
      "_id": "MR3XA2GiD14VCTdP",
      "flags": {},
      "type": 0,
      "text": "Luck Blade (1 Wish)",
      "weight": 4,
      "range": [54, 57],
      "drawn": false
    },
    {
      "_id": "lsEbuKO7gjofyVJa",
      "flags": {},
      "type": 0,
      "text": "Guarding Blade",
      "weight": 4,
      "range": [58, 61],
      "drawn": false
    },
    {
      "_id": "w16sp259MtzwT50X",
      "flags": {},
      "type": 0,
      "text": "Pistol of the Infinite Sky",
      "weight": 3,
      "range": [62, 64],
      "drawn": false
    },
    {
      "_id": "vhiWJ6H8NF0ybiJK",
      "flags": {},
      "type": 0,
      "text": "Mace of Smiting",
      "weight": 5,
      "range": [65, 69],
      "drawn": false
    },
    {
      "_id": "VWAPtPkSb8h30R3L",
      "flags": {},
      "type": 0,
      "text": "Blade of the Sword-Saint",
      "weight": 4,
      "range": [70, 73],
      "drawn": false
    },
    {
      "_id": "3yxh1xLAgNBrYE8j",
      "flags": {},
      "type": 0,
      "text": "Scimitar of the Spellthief",
      "weight": 3,
      "range": [74, 76],
      "drawn": false
    },
    {
      "_id": "JiK9Emol4g0fMIVV",
      "flags": {},
      "type": 0,
      "text": "Spider's Fang",
      "weight": 3,
      "range": [77, 79],
      "drawn": false
    },
    {
      "_id": "cy1ab6nfbtcJZlv1",
      "flags": {},
      "type": 0,
      "text": "Demonsorrow Curve Blade",
      "weight": 3,
      "range": [80, 82],
      "drawn": false
    },
    {
      "_id": "TFCrhYC3oJcttkxf",
      "flags": {},
      "type": 0,
      "text": "Void Scythe",
      "weight": 3,
      "range": [83, 85],
      "drawn": false
    },
    {
      "_id": "mWj2HT49ToDBwxFh",
      "flags": {},
      "type": 0,
      "text": "Luck Blade (2 Wishes)",
      "weight": 4,
      "range": [86, 89],
      "drawn": false
    },
    {
      "_id": "xVCDxaSuzuf7gJbF",
      "flags": {},
      "type": 0,
      "text": "Holy Avenger",
      "weight": 3,
      "range": [90, 92],
      "drawn": false
    },
    {
      "_id": "OioGFtUE9u98jqU7",
      "flags": {},
      "type": 0,
      "text": "Bastard's Sting",
      "weight": 4,
      "range": [93, 96],
      "drawn": false
    },
    {
      "_id": "P6Hkp6v7y1WfrKJa",
      "flags": {},
      "type": 0,
      "text": "Luck Blade (3 Wishes)",
      "weight": 4,
      "range": [97, 100],
      "drawn": false
    }
  ],
  "formula": "1d100",
  "replacement": true,
  "displayRoll": true,
  "_id": "50pRVwnAdPkrhaFW",
  "ownership": {
    "default": 0
  }
}
