{
  "_id": "1fbwS4T5JTquFd7a",
  "name": "Master Tricks",
  "type": "feat",
  "img": "systems/pf1/icons/items/weapons/butterfly-knife.PNG",
  "effects": [],
  "folder": null,
  "sort": 0,
  "flags": {},
  "system": {
    "description": {
      "value": "<p>The rogue can select a ninja trick from the list of master tricks in place of a rogue talent. The rogue cannot select a ninja trick that has the same name as a rogue talent. The rogue can choose but cannot use tricks that require ki points, unless she has a ki pool.</p>"
    },
    "tags": [],
    "actions": [],
    "attackNotes": [],
    "effectNotes": [],
    "changes": [],
    "contextNotes": [],
    "links": {
      "children": [],
      "charges": []
    },
    "tag": "classFeat_masterTricks",
    "useCustomTag": true,
    "armorProf": {
      "value": []
    },
    "weaponProf": {
      "value": []
    },
    "languages": {
      "value": []
    },
    "scriptCalls": [],
    "featType": "classFeat",
    "associations": {
      "classes": [["Rogue"]]
    }
  },
  "ownership": {
    "default": 0
  },
  "_stats": {
    "systemId": "pf1",
    "systemVersion": "0.82.1",
    "coreVersion": "10.285",
    "createdTime": 1663018761973,
    "modifiedTime": 1663018778079,
    "lastModifiedBy": "DbeAbHwpEqczKjsD"
  }
}
