{
  "_id": "9FJz9ZJ1r4pbZBIU",
  "name": "Caltrops (Cold Iron)",
  "type": "loot",
  "img": "systems/pf1/icons/items/inventory/dice.jpg",
  "effects": [],
  "folder": null,
  "sort": 0,
  "flags": {},
  "system": {
    "description": {
      "value": "<p>Source&nbsp;<a href=\"http://paizo.com/products/btpy8ywa?Pathfinder-Player-Companion-Demon-Hunters-Handbook\" target=\"_blank\" rel=\"noopener\">Demon Hunter's Handbook pg. 18</a><br>Price&nbsp;2 gp;&nbsp;Weight&nbsp;2 lbs.<br>Category&nbsp;Adventuring Gear</p>\n<h3>Description</h3>\n<p>Cold iron caltrops function in all ways as ordinary caltrops (Pathfinder RPG Core Rulebook&nbsp;155) except that they are made of cold iron, and affect creatures with DR/cold iron accordingly.</p>"
    },
    "tags": [],
    "weight": {
      "value": 2
    },
    "price": 2,
    "equipped": false,
    "identifiedName": "Caltrops (Cold Iron)",
    "changes": [],
    "contextNotes": [],
    "links": {
      "children": []
    },
    "flags": {
      "boolean": [],
      "dictionary": []
    },
    "scriptCalls": [],
    "subType": "gear"
  },
  "ownership": {
    "default": 0
  },
  "_stats": {
    "systemId": "pf1",
    "systemVersion": "0.82.1",
    "coreVersion": "10.285",
    "createdTime": 1663018752754,
    "modifiedTime": 1663018755651,
    "lastModifiedBy": "DbeAbHwpEqczKjsD"
  }
}
