{
  "_id": "HzDH4boTsAk8bVsT",
  "name": "Marksman's Shot",
  "type": "feat",
  "img": "systems/pf1/icons/items/weapons/rhoka.PNG",
  "effects": [],
  "folder": null,
  "sort": 0,
  "flags": {},
  "system": {
    "description": {
      "value": "<p>Those who seek to slay with a single shot must have keen eyes and perfect poise. As an attack action, the slayer makes a single ranged attack at his highest attack bonus with a ranged weapon he wields. The target of the attack must be the slayer’s studied target. On a successful hit, the slayer doubles the number of sneak attack dice applied to the attack; if the attack was not a sneak attack, this benefit does not apply.</p>"
    },
    "tags": [],
    "actions": [],
    "attackNotes": [],
    "effectNotes": [],
    "changes": [],
    "contextNotes": [],
    "links": {
      "children": [],
      "charges": []
    },
    "tag": "classFeat_marksmansShot",
    "useCustomTag": true,
    "armorProf": {
      "value": []
    },
    "weaponProf": {
      "value": []
    },
    "languages": {
      "value": []
    },
    "scriptCalls": [],
    "featType": "classFeat",
    "associations": {
      "classes": [["Slayer"]]
    },
    "abilityType": "ex"
  },
  "ownership": {
    "default": 0
  },
  "_stats": {
    "systemId": "pf1",
    "systemVersion": "0.82.1",
    "coreVersion": "10.285",
    "createdTime": 1663018764258,
    "modifiedTime": 1663018778203,
    "lastModifiedBy": "DbeAbHwpEqczKjsD"
  }
}
