{
  "_id": "AGyMMdzKX3z8Xg06",
  "name": "Wild Charge",
  "type": "feat",
  "img": "systems/pf1/icons/items/inventory/banner-red.jpg",
  "effects": [],
  "folder": null,
  "sort": 0,
  "flags": {},
  "system": {
    "description": {
      "value": "<p>At 15th level, the cavalier and his mount can ignore difficult terrain for the purpose of making a charge attack. In addition, if the charge attack is successful and both he and his opponent are occupying squares with difficult terrain, the cavalier gains a +2 competence bonus when using his mighty charge ability to make a bull rush, disarm, sunder, or trip combat maneuver.</p>"
    },
    "tags": [],
    "actions": [],
    "attackNotes": [],
    "effectNotes": [],
    "changes": [],
    "contextNotes": [],
    "links": {
      "children": [],
      "charges": []
    },
    "tag": "classFeat_wildCharge",
    "useCustomTag": true,
    "armorProf": {
      "value": []
    },
    "weaponProf": {
      "value": []
    },
    "languages": {
      "value": []
    },
    "scriptCalls": [],
    "featType": "classFeat",
    "associations": {
      "classes": [["Cavalier"]]
    },
    "abilityType": "ex"
  },
  "ownership": {
    "default": 0
  },
  "_stats": {
    "systemId": "pf1",
    "systemVersion": "0.82.1",
    "coreVersion": "10.285",
    "createdTime": 1663018763097,
    "modifiedTime": 1663018778148,
    "lastModifiedBy": "DbeAbHwpEqczKjsD"
  }
}
