{
  "_id": "Bj5SK3Od9XVERFHm",
  "name": "Summer Rage",
  "type": "feat",
  "img": "systems/pf1/icons/feats/deafening-critical.jpg",
  "effects": [],
  "folder": null,
  "sort": 0,
  "flags": {},
  "system": {
    "description": {
      "value": "<p>The barbarian channels the heat of late summer, making the air around her hot and oppressive. A creature within the barbarian’s reach becomes fatigued as long as it remains within the barbarian’s reach unless it succeeds at a Fortitude save (DC = 10 + half the barbarian’s level + her Constitution modifier) to become immune for 24 hours.</p>\n<p>A barbarian can have only one season-themed rage power, choosing between spring, summer, autumn, or winter rage.</p>"
    },
    "tags": [],
    "actions": [],
    "attackNotes": [],
    "effectNotes": [],
    "changes": [],
    "contextNotes": [],
    "links": {
      "children": [],
      "charges": []
    },
    "tag": "classFeat_summerRage",
    "useCustomTag": true,
    "armorProf": {
      "value": []
    },
    "weaponProf": {
      "value": []
    },
    "languages": {
      "value": []
    },
    "scriptCalls": [],
    "featType": "classFeat",
    "associations": {
      "classes": [["Barbarian"], ["Skald"]]
    },
    "abilityType": "su"
  },
  "ownership": {
    "default": 0
  },
  "_stats": {
    "systemId": "pf1",
    "systemVersion": "0.82.1",
    "coreVersion": "10.285",
    "createdTime": 1663018763401,
    "modifiedTime": 1663018778156,
    "lastModifiedBy": "DbeAbHwpEqczKjsD"
  }
}
