{
  "_id": "ufgxrhfkgrmgfqgf",
  "name": "Wine, Sealord",
  "type": "loot",
  "img": "systems/pf1/icons/items/inventory/dice.jpg",
  "effects": [],
  "folder": null,
  "sort": 0,
  "flags": {},
  "system": {
    "description": {
      "value": "<h4><span id=\"Wine_Sealord\"><a name=\"TOC-Wine-Sealord\"></a>Wine, Sealord</span></h4>\r\n<p><b>Price</b> 15 gp; <b>Weight</b> 1/2 lb.</p>\r\n<p>These red and white wines grown in certain coastal vineyards have a sweet-tart flavor valued by nobles in many lands.</p>\r\n<h3><span id=\"Beverages_Nonalcoholic\"><a name=\"TOC-Beverages-Nonalcoholic-\"></a>Beverages (Nonalcoholic)</span></h3>\r\n"
    },
    "tags": [],
    "weight": {
      "value": 0.5
    },
    "price": 15,
    "equipped": false,
    "changes": [],
    "contextNotes": [],
    "links": {
      "children": []
    },
    "flags": {
      "boolean": [],
      "dictionary": []
    },
    "scriptCalls": [],
    "subType": "gear"
  },
  "ownership": {
    "default": 0
  },
  "_stats": {
    "systemId": "pf1",
    "systemVersion": "0.82.1",
    "coreVersion": "10.285",
    "createdTime": 1663018753558,
    "modifiedTime": 1663018755712,
    "lastModifiedBy": "DbeAbHwpEqczKjsD"
  }
}
