{
  "_id": "MjHk9UdpaiosqVMq",
  "name": "Law Domain",
  "type": "feat",
  "img": "systems/pf1/icons/skills/blue_18.jpg",
  "effects": [],
  "folder": null,
  "sort": 0,
  "flags": {},
  "system": {
    "description": {
      "value": "<p><strong>Granted Powers:</strong> You follow a strict and ordered code of laws, and in so doing, achieve enlightenment.</p>\n<p><strong>Domain Spells:</strong></p>\n<ul>\n<li>1st—@Compendium[pf1.spells.md6ltvqh9paadsm4]{Protection From Chaos}</li>\n<li>2nd—@Compendium[pf1.spells.zujht80bgjdk9cyb]{Align Weapon} (law only)</li>\n<li>3rd—@Compendium[pf1.spells.6ne7ot8lcaiva3f9]{Magic Circle against Chaos}</li>\n<li>4th—@Compendium[pf1.spells.8zeulunjetwrdgwj]{Order's Wrath}</li>\n<li>5th—@Compendium[pf1.spells.3lgy3s4h4087ojht]{Dispel Chaos}</li>\n<li>6th—@Compendium[pf1.spells.d8hypv6zdyan3rzr]{Hold Monster}</li>\n<li>7th—@Compendium[pf1.spells.7e22urxux6i2mua5]{Dictum}</li>\n<li>8th—@Compendium[pf1.spells.lzj5umxjvogvpg6b]{Shield of Law}</li>\n<li>9th—@Compendium[pf1.spells.mi52crelhwuy6bmp]{Summon Monster IX} (law spell only)</li>\n</ul>"
    },
    "tags": [],
    "actions": [],
    "attackNotes": [],
    "effectNotes": [],
    "changes": [],
    "contextNotes": [],
    "links": {
      "children": [],
      "charges": []
    },
    "tag": "classFeat_lawDomain",
    "useCustomTag": true,
    "armorProf": {
      "value": []
    },
    "weaponProf": {
      "value": []
    },
    "languages": {
      "value": []
    },
    "scriptCalls": [],
    "featType": "classFeat",
    "associations": {
      "classes": [["Cleric"]]
    }
  },
  "ownership": {
    "default": 0
  },
  "_stats": {
    "systemId": "pf1",
    "systemVersion": "0.82.1",
    "coreVersion": "10.285",
    "createdTime": 1663018764827,
    "modifiedTime": 1663018778232,
    "lastModifiedBy": "DbeAbHwpEqczKjsD"
  }
}
