{
  "_id": "TR0v1sRjKqftTdBN",
  "name": "Scorching Heat",
  "type": "feat",
  "img": "systems/pf1/icons/skills/red_05.jpg",
  "effects": [],
  "folder": null,
  "sort": 0,
  "flags": {},
  "system": {
    "description": {
      "value": "<p>At 12th level, your weapons conduct heat. You deal 1d6 additional points of fire damage with natural weapons and melee attacks made with metal weapons. You also deal 2d6 points of fire damage per round to any creature you grapple. This does not damage your equipment.</p>"
    },
    "tags": [],
    "actions": [],
    "attackNotes": [],
    "effectNotes": [],
    "changes": [],
    "contextNotes": [],
    "links": {
      "children": [],
      "charges": []
    },
    "tag": "classFeat_scorchingHeat",
    "useCustomTag": true,
    "armorProf": {
      "value": []
    },
    "weaponProf": {
      "value": []
    },
    "languages": {
      "value": []
    },
    "scriptCalls": [],
    "featType": "classFeat",
    "associations": {
      "classes": [["Bloodrager"]]
    },
    "abilityType": "su"
  },
  "ownership": {
    "default": 0
  },
  "_stats": {
    "systemId": "pf1",
    "systemVersion": "0.82.1",
    "coreVersion": "10.285",
    "createdTime": 1663018765691,
    "modifiedTime": 1663018778274,
    "lastModifiedBy": "DbeAbHwpEqczKjsD"
  }
}
