{
  "_id": "epzojqBeYIGA9ZkT",
  "name": "Armour Type",
  "flags": {},
  "description": "",
  "results": [
    {
      "_id": "e9pVp9pDW2m70Tko",
      "flags": {},
      "type": 2,
      "text": "Light Armours",
      "img": "icons/svg/d20-black.svg",
      "collection": "pf1.ultimate-equipment",
      "resultId": "mEokGwFWW4lqg8MG",
      "weight": 1,
      "range": [1, 25],
      "drawn": false
    },
    {
      "_id": "kDvWAatUntbxcgOS",
      "flags": {},
      "type": 2,
      "text": "Medium Armours",
      "img": "icons/svg/d20-black.svg",
      "collection": "pf1.ultimate-equipment",
      "resultId": "TpPETWczOodgPRXE",
      "weight": 1,
      "range": [26, 50],
      "drawn": false
    },
    {
      "_id": "nOiToXw9KSMgLKcU",
      "flags": {},
      "type": 2,
      "text": "Heavy Armours",
      "img": "icons/svg/d20-black.svg",
      "collection": "pf1.ultimate-equipment",
      "resultId": "9n9o2113Ew6lCHiI",
      "weight": 1,
      "range": [51, 75],
      "drawn": false
    },
    {
      "_id": "qKL8nLICdIqtkQP8",
      "flags": {},
      "type": 2,
      "text": "Armour and Shield Addons",
      "img": "icons/svg/d20-black.svg",
      "collection": "pf1.ultimate-equipment",
      "resultId": "BXxZdNZVUmDAAU2D",
      "weight": 1,
      "range": [96, 100],
      "drawn": false
    }
  ],
  "formula": "1d100",
  "replacement": true,
  "displayRoll": true,
  "ownership": {
    "default": 0
  }
}
