{
  "_id": "XmRtUuWv5FbbNbnZ",
  "name": "Spiritual Companion",
  "type": "feat",
  "img": "systems/pf1/icons/items/weapons/kunai.png",
  "effects": [],
  "folder": null,
  "sort": 0,
  "flags": {},
  "system": {
    "description": {
      "value": "<p>While ninjas are accustomed to solitude, some form pacts with magical beings to seek aid and advice. A ninja with this trick gains an improved familiar, treating her ninja level as her wizard level. The ninja can select any of the following as her familiar:&nbsp;<a href=\"https://www.aonprd.com/MonsterDisplay.aspx?ItemName=Calligraphy%20Wyrm\">calligraphy wyrm</a>,&nbsp;<a href=\"https://www.aonprd.com/MonsterDisplay.aspx?ItemName=Pipefox\">pipefox</a>,&nbsp;<a href=\"https://www.aonprd.com/MonsterDisplay.aspx?ItemName=Shikigami\">shikigami kami</a>, or&nbsp;<a href=\"https://www.aonprd.com/MonsterDisplay.aspx?ItemName=Spirit%20Oni\">spirit oni</a>.</p>\n<p>The ninja must have an alignment compatible with the chosen familiar.</p>"
    },
    "tags": [],
    "actions": [],
    "attackNotes": [],
    "effectNotes": [],
    "changes": [],
    "contextNotes": [],
    "links": {
      "children": [],
      "charges": []
    },
    "tag": "classFeat_spiritualCompanion",
    "useCustomTag": true,
    "armorProf": {
      "value": []
    },
    "weaponProf": {
      "value": []
    },
    "languages": {
      "value": []
    },
    "scriptCalls": [],
    "featType": "classFeat",
    "associations": {
      "classes": [["Ninja"]]
    },
    "abilityType": "ex"
  },
  "ownership": {
    "default": 0
  },
  "_stats": {
    "systemId": "pf1",
    "systemVersion": "0.82.1",
    "coreVersion": "10.285",
    "createdTime": 1663018766191,
    "modifiedTime": 1663018778309,
    "lastModifiedBy": "DbeAbHwpEqczKjsD"
  }
}
