{
  "_id": "xerhuoqgozcrkcfm",
  "name": "Ladder, Folding",
  "type": "loot",
  "img": "systems/pf1/icons/items/inventory/dice.jpg",
  "effects": [],
  "folder": null,
  "sort": 0,
  "flags": {},
  "system": {
    "description": {
      "value": "<h4><span id=\"Ladder_Folding\"><a id=\"TOC-Ladder\"></a>Ladder, Folding</span></h4>\r\n<p><b>Price</b> 2 gp; <b>Weight</b> 16 lbs.</p>\r\n<p>The hook, pole, and rungs of this 10-foot ladder are hinged, allowing you to fold it into a 3-foot-by-1-foot-by-1-foot bundle. Folding or unfolding it is a standard action.</p>\r\n"
    },
    "tags": [],
    "weight": {
      "value": 16
    },
    "price": 2,
    "equipped": false,
    "changes": [],
    "contextNotes": [],
    "links": {
      "children": []
    },
    "flags": {
      "boolean": [],
      "dictionary": []
    },
    "scriptCalls": [],
    "subType": "gear"
  },
  "ownership": {
    "default": 0
  },
  "_stats": {
    "systemId": "pf1",
    "systemVersion": "0.82.1",
    "coreVersion": "10.285",
    "createdTime": 1663018753649,
    "modifiedTime": 1663018755717,
    "lastModifiedBy": "DbeAbHwpEqczKjsD"
  }
}
