{
  "name": "Lesser Major Rods",
  "flags": {},
  "description": "",
  "results": [
    {
      "_id": "qhykx9WotFtftCbE",
      "flags": {},
      "type": 0,
      "text": "Suzerain Scepter",
      "weight": 4,
      "range": [1, 4],
      "drawn": false
    },
    {
      "_id": "PXh4QXuZjKEGhrrC",
      "flags": {},
      "type": 0,
      "text": "Fiery Nimbus Rod",
      "weight": 2,
      "range": [5, 6],
      "drawn": false
    },
    {
      "_id": "YfwfBzY9YHz6xPOX",
      "flags": {},
      "type": 0,
      "text": "Rod of Enemy Detection",
      "weight": 7,
      "range": [7, 13],
      "drawn": false
    },
    {
      "_id": "oLzM4yDgmGMYNzuA",
      "flags": {},
      "type": 0,
      "text": "Rod of Greater Extend Metamagic",
      "weight": 14,
      "range": [14, 27],
      "drawn": false
    },
    {
      "_id": "yJtDrrWfSEvdEQkL",
      "flags": {},
      "type": 0,
      "text": "Rod of Splendor",
      "weight": 9,
      "range": [28, 36],
      "drawn": false
    },
    {
      "_id": "Xj3JcmU04DW9ekZy",
      "flags": {},
      "type": 0,
      "text": "Rod of Withering",
      "weight": 8,
      "range": [37, 44],
      "drawn": false
    },
    {
      "_id": "MLGgefrl2QPrFTbD",
      "flags": {},
      "type": 0,
      "text": "Earthbind Rod",
      "weight": 6,
      "range": [45, 50],
      "drawn": false
    },
    {
      "_id": "n9TwXxsVobTiAjHD",
      "flags": {},
      "type": 0,
      "text": "Rod of the Aboleth",
      "weight": 6,
      "range": [51, 56],
      "drawn": false
    },
    {
      "_id": "zZa8EG0CuCvE7JXw",
      "flags": {},
      "type": 0,
      "text": "Liberator’S Rod",
      "weight": 7,
      "range": [57, 63],
      "drawn": false
    },
    {
      "_id": "XGQPsZ4m4A86qtL5",
      "flags": {},
      "type": 0,
      "text": "Rod of Thanatopic Metamagic",
      "weight": 7,
      "range": [64, 70],
      "drawn": false
    },
    {
      "_id": "ACHtjmFdZdZfva8q",
      "flags": {},
      "type": 0,
      "text": "Rod of Thunder and Lightning",
      "weight": 9,
      "range": [71, 79],
      "drawn": false
    },
    {
      "_id": "sn9JJ5pP8XWkiwh0",
      "flags": {},
      "type": 0,
      "text": "Rod of Lesser Quicken Metamagic",
      "weight": 4,
      "range": [80, 83],
      "drawn": false
    },
    {
      "_id": "46qZBTQjIZv78IkD",
      "flags": {},
      "type": 0,
      "text": "Rod of Negation",
      "weight": 11,
      "range": [84, 94],
      "drawn": false
    },
    {
      "_id": "EIxivjJSTbXQ4EgW",
      "flags": {},
      "type": 0,
      "text": "Rod of Steadfast Resolve",
      "weight": 6,
      "range": [95, 100],
      "drawn": false
    }
  ],
  "formula": "1d100",
  "replacement": true,
  "displayRoll": true,
  "_id": "x1iE81wAnyDfVCU3",
  "ownership": {
    "default": 0
  }
}
