{
  "_id": "1BuSzuaMzcrxfwmn",
  "name": "Intense Celebration",
  "type": "feat",
  "img": "systems/pf1/icons/spells/explosion-orange-2.jpg",
  "effects": [],
  "folder": null,
  "sort": 0,
  "flags": {},
  "system": {
    "description": {
      "value": "<p>At 8th level, spells you cast that confer a morale effect upon you or your allies are automatically affected as if by the @Compendium[pf1.feats.btXWioB3SKJv8YEG]{Extend Spell} metamagic feat, but with no increase in spell level.</p>\n<p>This power replaces the Chaos Blade power of the Chaos Domain.</p>"
    },
    "tags": [],
    "actions": [],
    "attackNotes": [],
    "effectNotes": [],
    "changes": [],
    "contextNotes": [],
    "links": {
      "children": [],
      "charges": []
    },
    "tag": "classFeat_intenseCelebration",
    "useCustomTag": true,
    "armorProf": {
      "value": []
    },
    "weaponProf": {
      "value": []
    },
    "languages": {
      "value": []
    },
    "scriptCalls": [],
    "featType": "classFeat",
    "associations": {
      "classes": [["Cleric"]]
    }
  },
  "ownership": {
    "default": 0
  },
  "_stats": {
    "systemId": "pf1",
    "systemVersion": "0.82.1",
    "coreVersion": "10.285",
    "createdTime": 1663018761942,
    "modifiedTime": 1663018778072,
    "lastModifiedBy": "DbeAbHwpEqczKjsD"
  }
}
