{
  "_id": "souIaOfEoh6j5d9y",
  "name": "Card Sharp",
  "type": "feat",
  "img": "systems/pf1/icons/items/weapons/dagger.PNG",
  "effects": [],
  "folder": null,
  "sort": 0,
  "flags": {},
  "system": {
    "description": {
      "value": "<p>The rogue gains Deadly Dealer as a bonus feat, even if she does not meet the prerequisites. Thrown cards are treated as darts, but the rogue cannot imbue cards with additional power unless she has the Arcane Strike feat. This talent otherwise functions as the Deadly Dealer feat.</p>"
    },
    "tags": [],
    "actions": [],
    "attackNotes": [],
    "effectNotes": [],
    "changes": [],
    "contextNotes": [],
    "links": {
      "children": [],
      "charges": []
    },
    "tag": "classFeat_cardSharp",
    "useCustomTag": true,
    "armorProf": {
      "value": []
    },
    "weaponProf": {
      "value": []
    },
    "languages": {
      "value": []
    },
    "scriptCalls": [],
    "featType": "classFeat",
    "associations": {
      "classes": [["Rogue"]]
    },
    "abilityType": "su"
  },
  "ownership": {
    "default": 0
  },
  "_stats": {
    "systemId": "pf1",
    "systemVersion": "0.82.1",
    "coreVersion": "10.285",
    "createdTime": 1663018769179,
    "modifiedTime": 1663018778533,
    "lastModifiedBy": "DbeAbHwpEqczKjsD"
  }
}
