{
  "name": "Greater Medium Body",
  "flags": {},
  "description": "",
  "results": [
    {
      "_id": "KdCgzB8N2XRKht3F",
      "flags": {},
      "type": 0,
      "text": "Xorn Robe",
      "weight": 25,
      "range": [1, 25],
      "drawn": false
    },
    {
      "_id": "yzVK73c2M4G9ICbh",
      "flags": {},
      "type": 0,
      "text": "Corset of Dire Witchcraft",
      "weight": 27,
      "range": [26, 52],
      "drawn": false
    },
    {
      "_id": "FLo1ED9B8kxez2xe",
      "flags": {},
      "type": 0,
      "text": "Bodywrap of Mighty Strikes +3",
      "weight": 24,
      "range": [53, 76],
      "drawn": false
    },
    {
      "_id": "1KRqLgef38XYSuDP",
      "flags": {},
      "type": 0,
      "text": "Robe of Scintillating Colors",
      "weight": 24,
      "range": [77, 100],
      "drawn": false
    }
  ],
  "formula": "1d100",
  "replacement": true,
  "displayRoll": true,
  "_id": "2CgrvHFVDX416H3Z",
  "ownership": {
    "default": 0
  }
}
