{
  "_id": "zwZnq5WCBCijev6o",
  "name": "Cruelty",
  "type": "feat",
  "img": "systems/pf1/icons/skills/affliction_04.jpg",
  "effects": [],
  "folder": null,
  "sort": 0,
  "flags": {},
  "system": {
    "description": {
      "value": "<p>At 3rd level, and every three levels thereafter, an antipaladin can select one cruelty. Each cruelty adds an effect to the antipaladin's touch of corruption ability. Whenever the antipaladin uses touch of corruption to deal damage to one target, the target also receives the additional effect from one of the cruelties possessed by the antipaladin. This choice is made when the touch is used. The target receives a Fortitude save to avoid this cruelty. If the save is successful, the target takes the damage as normal, but not the effects of the cruelty. The DC of this save is equal to 10 + 1/2 the antipaladin's level + the antipaladin's Charisma modifier. At 3rd level, the antipaladin can select from the following initial cruelties.</p>\n<ul>\n<li><em>Fatigued:</em> The target is fatigued.</li>\n<li><em>Shaken:</em> The target is shaken for 1 round per level of the antipaladin.</li>\n<li><em>Sickened:</em> The target is sickened for 1 round per level of the antipaladin.</li>\n</ul>\n<p>At 6th level, an antipaladin adds the following cruelties to the list of those that can be selected.</p>\n<ul>\n<li><em>Dazed</em>: The target is dazed for 1 round.</li>\n<li><em>Diseased: </em>The target contracts a disease, as if the antipaladin had cast @Compendium[pf1.spells.ppeb97nxg1rmdpme]{Contagion}, using his antipaladin level as his caster level.</li>\n<li><em>Staggered:</em> The target is staggered for 1 round per two levels of the antipaladin.</li>\n</ul>\n<p>At 9th level, an antipaladin adds the following cruelties to the list of those that can be selected.</p>\n<ul>\n<li><em>Cursed:</em> The target is cursed, as if the antipaladin had cast&nbsp;bestow curse, using his antipaladin level as his caster level.</li>\n<li><em>Exhausted:</em> The target is exhausted. The antipaladin must have the fatigue cruelty before selecting this cruelty.</li>\n<li><em>Frightened:</em> The target is frightened for 1 round per two levels of the antipaladin. The antipaladin must have the shaken cruelty before selecting this cruelty.</li>\n<li><em>Nauseated:</em> The target is nauseated for 1 round per three levels of the antipaladin. The antipaladin must have the sickened cruelty before selecting this cruelty.</li>\n<li><em>Poisoned:</em> The target is poisoned, as if the antipaladin had cast&nbsp;poison, using the antipaladin's level as the caster level.</li>\n</ul>\n<p>At 12th level, an antipaladin adds the following cruelties to the list of those that can be selected.</p>\n<ul>\n<li><em>Blinded:</em> The target is blinded for 1 round per level of the antipaladin.</li>\n<li><em>Deafened:</em> The target is deafened for 1 round per level of the antipaladin.</li>\n<li><em>Paralyzed:</em> The target is paralyzed for 1 round.</li>\n<li><em>Stunned:</em> The target is stunned for 1 round per four levels of the antipaladin.</li>\n</ul>\n<p>These abilities are not cumulative. For example, a 12th-level antipaladin's touch of corruption ability deals 6d6 points of damage and might also cause the target to become fatigued, dazed, poisoned, or diseased. Once a cruelty is chosen, it can't be changed.</p>"
    },
    "tags": [],
    "actions": [],
    "attackNotes": [],
    "effectNotes": [],
    "changes": [],
    "contextNotes": [],
    "links": {
      "children": [],
      "charges": []
    },
    "tag": "classFeat_cruelty",
    "useCustomTag": true,
    "armorProf": {
      "value": []
    },
    "weaponProf": {
      "value": []
    },
    "languages": {
      "value": []
    },
    "scriptCalls": [],
    "featType": "classFeat",
    "associations": {
      "classes": [["Antipaladin"]]
    },
    "abilityType": "su"
  },
  "ownership": {
    "default": 0
  },
  "_stats": {
    "systemId": "pf1",
    "systemVersion": "0.82.1",
    "coreVersion": "10.285",
    "createdTime": 1663018770129,
    "modifiedTime": 1663018778583,
    "lastModifiedBy": "DbeAbHwpEqczKjsD"
  }
}
