{
  "_id": "jaxzdishpxpvxu3t",
  "name": "Dazzling Blade",
  "type": "spell",
  "img": "systems/pf1/icons/misc/magic-swirl.png",
  "effects": [],
  "folder": null,
  "sort": 0,
  "flags": {},
  "system": {
    "tags": [],
    "actions": [
      {
        "_id": "f06ny66pl9l94uzi",
        "name": "Use",
        "img": "systems/pf1/icons/misc/magic-swirl.png",
        "description": "",
        "tag": "",
        "activation": {
          "cost": 1,
          "type": "swift"
        },
        "unchainedAction": {
          "activation": {
            "cost": 1,
            "type": "action"
          }
        },
        "duration": {
          "value": "1 minute/level",
          "units": ""
        },
        "target": {
          "value": "one metal weapon"
        },
        "range": {
          "value": null,
          "units": "touch",
          "maxIncrements": 1,
          "minValue": null,
          "minUnits": ""
        },
        "uses": {
          "autoDeductCharges": true,
          "autoDeductChargesCost": "1",
          "self": {
            "value": 0,
            "maxFormula": "",
            "per": null
          },
          "per": "",
          "value": 0,
          "maxFormula": ""
        },
        "measureTemplate": {
          "type": "",
          "size": "0",
          "overrideColor": false,
          "customColor": "",
          "overrideTexture": false,
          "customTexture": ""
        },
        "attackName": "",
        "actionType": "spellsave",
        "attackBonus": "",
        "critConfirmBonus": "",
        "damage": {
          "parts": [],
          "critParts": [],
          "nonCritParts": []
        },
        "attackParts": [],
        "formulaicAttacks": {
          "count": {
            "formula": ""
          },
          "bonus": {
            "formula": ""
          },
          "label": null
        },
        "formula": "",
        "ability": {
          "attack": "",
          "damage": "",
          "damageMult": 1,
          "critRange": 20,
          "critMult": 2
        },
        "save": {
          "dc": "0",
          "type": "will",
          "description": "Will negates (see text)"
        },
        "effectNotes": [],
        "attackNotes": [],
        "soundEffect": "",
        "powerAttack": {
          "multiplier": "",
          "damageBonus": 2,
          "critMultiplier": 1
        },
        "naturalAttack": {
          "primaryAttack": true,
          "secondary": {
            "attackBonus": "-5",
            "damageMult": 0.5
          }
        },
        "nonlethal": false,
        "usesAmmo": false,
        "spellEffect": "",
        "spellArea": "",
        "conditionals": [],
        "enh": {
          "value": null
        }
      }
    ],
    "uses": {
      "per": ""
    },
    "attackNotes": [],
    "effectNotes": [],
    "links": {
      "children": []
    },
    "flags": {
      "boolean": [],
      "dictionary": []
    },
    "scriptCalls": [],
    "learnedAt": {
      "class": [
        ["sorcerer/wizard", 1],
        ["bard", 1]
      ],
      "domain": [],
      "subDomain": [],
      "elementalSchool": [],
      "bloodline": []
    },
    "school": "ill",
    "subschool": "pattern",
    "components": {
      "verbal": true,
      "somatic": true
    },
    "shortDescription": "<p><i>Dazzling blade</i> makes a weapon appear dazzlingly shiny, as if crafted from pure silver and heavily polished. In combat, the flashing movements of a <i>dazzling blade</i> become almost hypnotic. The wielder of a weapon under the effects of <i>dazzling blade</i> gains a +1 competence bonus on all Bluff checks made to feint in combat. The wielder also gains a +1 competence bonus on all CMB checks made to disarm a foe, and a +1 competence bonus to his CMD against disarm attempts made against the weapon bearing the <i>dazzling blade</i> effect. This bonus increases by +1 for every 3 caster levels, to a maximum bonus of +5 at 12th level.</p><p>The wielder of a <i>dazzling blade</i> can discharge the spell into a blinding burst of silvery light as a free action. The wielder selects an adjacent opponent as the focal point of this burst of light-that creature must make a Will save to avoid being blinded for 1 round (with a successful save, the creature is instead dazzled for 1 round).</p><p>Despite its shiny appearance, a <i>dazzling blade</i> grants no extra benefit against creatures that are vulnerable to silver.</p>"
  },
  "ownership": {
    "default": 0
  },
  "_stats": {
    "systemId": "pf1",
    "systemVersion": "0.82.1",
    "coreVersion": "10.285",
    "createdTime": 1663018733555,
    "modifiedTime": 1663018744858,
    "lastModifiedBy": "DbeAbHwpEqczKjsD"
  }
}
