{
  "_id": "oixfsekzjhtysfrw",
  "name": "Hound's Blood",
  "type": "loot",
  "img": "systems/pf1/icons/items/inventory/dice.jpg",
  "effects": [],
  "folder": null,
  "sort": 0,
  "flags": {},
  "system": {
    "description": {
      "value": "\r\n<p class=\"source\"><b>Source</b> <a title=\"PZO1121\" href=\"http://www.amazon.com/gp/product/1601253907/ref=as_li_qf_sp_asin_il_tl?ie=UTF8&amp;camp=1789&amp;creative=9325&amp;creativeASIN=1601253907&amp;linkCode=as2&amp;tag=httpwwwd20pfs-20\" target=\"_blank\" rel=\"noopener\">PZO1121</a></p>\r\n<p>If you apply the thick, red paste known as hound's blood to your nostrils or upper lip, it greatly enhances your sense of smell. For most creatures, this grants a +2 <a href=\"https://www.d20pfsrd.com/basics-ability-scores/glossary#TOC-Alchemical-Bonus\">alchemical bonus</a> on <a href=\"https://www.d20pfsrd.com/skills/perception\">Perception</a> checks for 1 hour. For <a href=\"https://www.d20pfsrd.com/races/core-races/gnome\">gnomes</a>, it briefly grants a super-heightened sense of smell, granting the <a href=\"https://www.d20pfsrd.com/bestiary/rules-for-monsters/universal-monster-rules#TOC-Scent-Ex-\">scent</a> ability for 5 minutes, before the potency is reduced to a +2 <a href=\"https://www.d20pfsrd.com/basics-ability-scores/glossary#TOC-Alchemical-Bonus\">alchemical bonus</a> on <a href=\"https://www.d20pfsrd.com/skills/perception\">Perception</a> checks for an additional 1 hour.</p>\r\n"
    },
    "tags": [],
    "price": 110,
    "equipped": false,
    "changes": [],
    "contextNotes": [],
    "links": {
      "children": []
    },
    "flags": {
      "boolean": [],
      "dictionary": []
    },
    "scriptCalls": [],
    "subType": "gear"
  },
  "ownership": {
    "default": 0
  },
  "_stats": {
    "systemId": "pf1",
    "systemVersion": "0.82.1",
    "coreVersion": "10.285",
    "createdTime": 1663018753322,
    "modifiedTime": 1663018755700,
    "lastModifiedBy": "DbeAbHwpEqczKjsD"
  }
}
