{
  "name": "Common Level 5 Arcane Scrolls",
  "flags": {},
  "description": "",
  "results": [
    {
      "_id": "l2KSZcyDklrmBlkl",
      "flags": {},
      "type": 0,
      "text": "Scroll of Baleful Polymorph",
      "img": "icons/svg/d20-black.svg",
      "resultId": "",
      "weight": 3,
      "range": [1, 3],
      "drawn": false
    },
    {
      "_id": "ZcM2NT60wSfhPFyG",
      "flags": {},
      "type": 0,
      "text": "Scroll of Beast Shape III",
      "img": "icons/svg/d20-black.svg",
      "resultId": "",
      "weight": 4,
      "range": [4, 7],
      "drawn": false
    },
    {
      "_id": "4TPfXqoZ24Qjw3Ji",
      "flags": {},
      "type": 0,
      "text": "Scroll of Break Enchantment",
      "img": "icons/svg/d20-black.svg",
      "resultId": "",
      "weight": 3,
      "range": [8, 10],
      "drawn": false
    },
    {
      "_id": "RXqxYcWdJ8mB4iNA",
      "flags": {},
      "type": 0,
      "text": "Scroll of Cloudkill",
      "img": "icons/svg/d20-black.svg",
      "resultId": "",
      "weight": 5,
      "range": [11, 15],
      "drawn": false
    },
    {
      "_id": "fWDJg30wChmECiFb",
      "flags": {},
      "type": 0,
      "text": "Scroll of Cone of Cold",
      "img": "icons/svg/d20-black.svg",
      "resultId": "",
      "weight": 6,
      "range": [16, 21],
      "drawn": false
    },
    {
      "_id": "li9goXMOfn0TH51n",
      "flags": {},
      "type": 0,
      "text": "Scroll of Contact Other Plane",
      "img": "icons/svg/d20-black.svg",
      "resultId": "",
      "weight": 2,
      "range": [22, 23],
      "drawn": false
    },
    {
      "_id": "YYLni4kNOZ9rHunY",
      "flags": {},
      "type": 0,
      "text": "Scroll of Dismissal",
      "img": "icons/svg/d20-black.svg",
      "resultId": "",
      "weight": 3,
      "range": [24, 26],
      "drawn": false
    },
    {
      "_id": "OjtnMAcZ3dmKU9z0",
      "flags": {},
      "type": 0,
      "text": "Scroll of Dominate Person",
      "img": "icons/svg/d20-black.svg",
      "resultId": "",
      "weight": 5,
      "range": [27, 31],
      "drawn": false
    },
    {
      "_id": "caaamsFBffEReMvv",
      "flags": {},
      "type": 0,
      "text": "Scroll of Feeblemind",
      "img": "icons/svg/d20-black.svg",
      "resultId": "",
      "weight": 4,
      "range": [32, 35],
      "drawn": false
    },
    {
      "_id": "WHJZwOfKf1Ru8ZGT",
      "flags": {},
      "type": 0,
      "text": "Scroll of Hold Monster",
      "img": "icons/svg/d20-black.svg",
      "resultId": "",
      "weight": 5,
      "range": [36, 40],
      "drawn": false
    },
    {
      "_id": "EIuNhTsEJDbKHJEj",
      "flags": {},
      "type": 0,
      "text": "Scroll of Magic Jar",
      "img": "icons/svg/d20-black.svg",
      "resultId": "",
      "weight": 3,
      "range": [41, 43],
      "drawn": false
    },
    {
      "_id": "4j4fd44jiwvr0ab5",
      "flags": {},
      "type": 0,
      "text": "Scroll of Mind Fog",
      "img": "icons/svg/d20-black.svg",
      "resultId": "",
      "weight": 3,
      "range": [44, 46],
      "drawn": false
    },
    {
      "_id": "QO337WIuSJnZEqFQ",
      "flags": {},
      "type": 0,
      "text": "Scroll of Overland Flight",
      "img": "icons/svg/d20-black.svg",
      "resultId": "",
      "weight": 5,
      "range": [47, 51],
      "drawn": false
    },
    {
      "_id": "EQcGkbAPgmfn9b2d",
      "flags": {},
      "type": 0,
      "text": "Scroll of Passwall",
      "img": "icons/svg/d20-black.svg",
      "resultId": "",
      "weight": 3,
      "range": [52, 54],
      "drawn": false
    },
    {
      "_id": "8CUB06oaN3PRwyiF",
      "flags": {},
      "type": 0,
      "text": "Scroll of Permanency",
      "img": "icons/svg/d20-black.svg",
      "resultId": "",
      "weight": 2,
      "range": [55, 56],
      "drawn": false
    },
    {
      "_id": "0lfJUThXYK1e4z48",
      "flags": {},
      "type": 0,
      "text": "Scroll of Planar Binding, Lesser",
      "img": "icons/svg/d20-black.svg",
      "resultId": "",
      "weight": 2,
      "range": [57, 58],
      "drawn": false
    },
    {
      "_id": "V4IQELuyJU2emoBh",
      "flags": {},
      "type": 0,
      "text": "Scroll of Polymorph",
      "img": "icons/svg/d20-black.svg",
      "resultId": "",
      "weight": 4,
      "range": [59, 62],
      "drawn": false
    },
    {
      "_id": "5OIGw8epblU4PKBV",
      "flags": {},
      "type": 0,
      "text": "Scroll of Sending",
      "img": "icons/svg/d20-black.svg",
      "resultId": "",
      "weight": 3,
      "range": [63, 65],
      "drawn": false
    },
    {
      "_id": "TZhoGSyBW1UrQ6KY",
      "flags": {},
      "type": 0,
      "text": "Scroll of Shadow Evocation",
      "img": "icons/svg/d20-black.svg",
      "resultId": "",
      "weight": 4,
      "range": [66, 69],
      "drawn": false
    },
    {
      "_id": "cqDwiDs7jVA3nt7P",
      "flags": {},
      "type": 0,
      "text": "Scroll of Summon Monster V",
      "img": "icons/svg/d20-black.svg",
      "resultId": "",
      "weight": 4,
      "range": [70, 73],
      "drawn": false
    },
    {
      "_id": "fNUuaXl7yhoG65Av",
      "flags": {},
      "type": 0,
      "text": "Scroll of Telekinesis",
      "img": "icons/svg/d20-black.svg",
      "resultId": "",
      "weight": 3,
      "range": [74, 76],
      "drawn": false
    },
    {
      "_id": "3Pq4hHAmFtL36XM4",
      "flags": {},
      "type": 0,
      "text": "Scroll of Teleport",
      "img": "icons/svg/d20-black.svg",
      "resultId": "",
      "weight": 6,
      "range": [77, 82],
      "drawn": false
    },
    {
      "_id": "2uHrzSDMywPcUIyo",
      "flags": {},
      "type": 0,
      "text": "Scroll of Wall of Force",
      "img": "icons/svg/d20-black.svg",
      "resultId": "",
      "weight": 6,
      "range": [83, 88],
      "drawn": false
    },
    {
      "_id": "L6TFS6xURdEWRENK",
      "flags": {},
      "type": 0,
      "text": "Scroll of Wall of Stone",
      "img": "icons/svg/d20-black.svg",
      "resultId": "",
      "weight": 4,
      "range": [89, 92],
      "drawn": false
    },
    {
      "_id": "IVQ9Fxla2fbWiAi4",
      "flags": {},
      "type": 0,
      "text": "Scroll of Waves of Fatigue",
      "img": "icons/svg/d20-black.svg",
      "resultId": "",
      "weight": 3,
      "range": [93, 95],
      "drawn": false
    },
    {
      "_id": "bYsZHUNgIMnVk8xc",
      "flags": {},
      "type": 0,
      "text": "Scroll of Symbol of Pain",
      "img": "icons/svg/d20-black.svg",
      "resultId": "",
      "weight": 2,
      "range": [96, 97],
      "drawn": false
    },
    {
      "_id": "vvNbrI2BmprnHJdj",
      "flags": {},
      "type": 0,
      "text": "Scroll of Symbol of Sleep",
      "img": "icons/svg/d20-black.svg",
      "resultId": "",
      "weight": 3,
      "range": [98, 100],
      "drawn": false
    }
  ],
  "formula": "1d100",
  "replacement": true,
  "displayRoll": true,
  "_id": "Lqg6bl37KioIAjX0",
  "ownership": {
    "default": 0
  }
}
