{
  "_id": "6zjwZeZmhqmAFC82",
  "name": "Heavy Wooden Shield",
  "type": "equipment",
  "img": "systems/pf1/icons/items/armor/shield-heavy-wood.png",
  "effects": [],
  "folder": null,
  "sort": 0,
  "flags": {},
  "system": {
    "description": {
      "value": "<p><span id=\"ctl00_MainContent_DataListTypes_ctl00_LabelName\">A heavy wooden shield is essentially the same as a heavy steel shield, except that it responds differently to some spells and effects (such as <em>rusting grasp</em>). A druid can use a heavy wooden shield, but not a heavy steel shield.</span></p>"
    },
    "tags": [],
    "weight": {
      "value": 10
    },
    "price": 7,
    "hp": {
      "max": 15,
      "value": 15
    },
    "hardness": 5,
    "identifiedName": "Heavy Wooden Shield",
    "changes": [],
    "contextNotes": [],
    "actions": [],
    "attackNotes": [],
    "effectNotes": [],
    "links": {
      "children": [],
      "charges": []
    },
    "flags": {
      "boolean": [],
      "dictionary": []
    },
    "scriptCalls": [],
    "equipmentType": "shield",
    "equipmentSubtype": "heavyShield",
    "armor": {
      "value": 2,
      "acp": 2
    },
    "spellFailure": 15,
    "slot": "shield"
  },
  "ownership": {
    "default": 0
  },
  "_stats": {
    "systemId": "pf1",
    "systemVersion": "0.82.1",
    "coreVersion": "10.285",
    "createdTime": 1663018757771,
    "modifiedTime": 1663018757983,
    "lastModifiedBy": "DbeAbHwpEqczKjsD"
  }
}
