{
  "name": "Lesser Major Specific Weapons",
  "flags": {},
  "description": "",
  "results": [
    {
      "_id": "OsrSnellpt3Xr6u5",
      "flags": {},
      "type": 0,
      "text": "Nine Lives Stealer",
      "weight": 12,
      "range": [1, 12],
      "drawn": false
    },
    {
      "_id": "jlJqf9kFy3bURp45",
      "flags": {},
      "type": 0,
      "text": "Undercutting Axe",
      "weight": 14,
      "range": [13, 26],
      "drawn": false
    },
    {
      "_id": "BITZWQjfxSUmFHHs",
      "flags": {},
      "type": 0,
      "text": "Spirit Caller",
      "weight": 14,
      "range": [27, 40],
      "drawn": false
    },
    {
      "_id": "7yFIPP4S4YwCPng7",
      "flags": {},
      "type": 0,
      "text": "Dwarfbond Hammer",
      "weight": 15,
      "range": [41, 55],
      "drawn": false
    },
    {
      "_id": "yGz6sdwNgMi0aWeU",
      "flags": {},
      "type": 0,
      "text": "Oathbow",
      "weight": 15,
      "range": [56, 70],
      "drawn": false
    },
    {
      "_id": "ax7LoERhwQQL2tc0",
      "flags": {},
      "type": 0,
      "text": "Sword of Life Stealing",
      "weight": 15,
      "range": [71, 85],
      "drawn": false
    },
    {
      "_id": "obJqgVfNqz5lk8wr",
      "flags": {},
      "type": 0,
      "text": "Cutthroat's Apprentice",
      "weight": 15,
      "range": [86, 100],
      "drawn": false
    }
  ],
  "formula": "1d100",
  "replacement": true,
  "displayRoll": true,
  "_id": "5NFbry2UtIw1sc9S",
  "ownership": {
    "default": 0
  }
}
