{
  "_id": "U7sSTxmIUaF96hVY",
  "name": "Rot Patron",
  "type": "feat",
  "img": "systems/pf1/icons/feats/improved-familiar.jpg",
  "effects": [],
  "folder": null,
  "sort": 0,
  "flags": {},
  "system": {
    "description": {
      "value": "<ul>\n<li>2nd — @Compendium[pf1.spells.7mnhs4rmcv7lo1l6]{Decompose Corpse}</li>\n<li>4th — @Compendium[pf1.spells.mt3gozaeg6qqy180]{Warp Wood}</li>\n<li>6th — @Compendium[pf1.spells.26d575hwkhmftrbw]{Fungal Infestation}</li>\n<li>8th — @Compendium[pf1.spells.5ues51xy0x9yyapy]{Fleshworm Infestation}</li>\n<li>10th — @Compendium[pf1.spells.kvfggbo0tr5gklxu]{Plague Carrier}</li>\n<li>12th — @Compendium[pf1.spells.wueg9fxln3z761m1]{Epidemic}</li>\n<li>14th — @Compendium[pf1.spells.f828mjoo5afszqnk]{Creeping Doom}</li>\n<li>16th — @Compendium[pf1.spells.e8zen5nzixnt7bde]{Horrid Wilting}</li>\n<li>18th — @Compendium[pf1.spells.0rhghy2ft8l9buyt]{Cursed Earth}</li>\n</ul>"
    },
    "tags": [],
    "actions": [],
    "attackNotes": [],
    "effectNotes": [],
    "changes": [],
    "contextNotes": [],
    "links": {
      "children": [],
      "charges": []
    },
    "tag": "classFeat_rotPatron",
    "useCustomTag": true,
    "armorProf": {
      "value": []
    },
    "weaponProf": {
      "value": []
    },
    "languages": {
      "value": []
    },
    "scriptCalls": [],
    "featType": "classFeat",
    "associations": {
      "classes": [["Witch"]]
    }
  },
  "ownership": {
    "default": 0
  },
  "_stats": {
    "systemId": "pf1",
    "systemVersion": "0.82.1",
    "coreVersion": "10.285",
    "createdTime": 1663018765727,
    "modifiedTime": 1663018778278,
    "lastModifiedBy": "DbeAbHwpEqczKjsD"
  }
}
