{
  "_id": "0WEDRHec9z871p4t",
  "name": "Smoke Sling Bullet",
  "type": "loot",
  "img": "systems/pf1/icons/items/weapons/bullet.png",
  "effects": [],
  "folder": null,
  "sort": 0,
  "flags": {},
  "system": {
    "description": {
      "value": "<p>Smoke bullets require only a successful touch attack to release the smoke. When they strike a target, they burst, releasing a cloud of noxious gas that requires the creature struck to attempt a DC 13&nbsp;<a href=\"https://www.d20pfsrd.com/gamemastering/combat/#TOC-Fortitude\">Fortitude</a>&nbsp;save. If the save fails, the target is nauseated for 2 rounds.</p>"
    },
    "tags": [],
    "weight": {
      "value": 0.5
    },
    "price": 10,
    "equipped": false,
    "hp": {
      "max": "1",
      "value": "1"
    },
    "hardness": 1,
    "unidentified": {
      "price": 10
    },
    "identifiedName": "Smoke Sling Bullet",
    "changes": [],
    "contextNotes": [],
    "links": {
      "children": []
    },
    "flags": {
      "boolean": [],
      "dictionary": []
    },
    "scriptCalls": [],
    "subType": "ammo",
    "extraType": "slingBullet"
  },
  "ownership": {
    "default": 0
  },
  "_stats": {
    "systemId": "pf1",
    "systemVersion": "0.82.1",
    "coreVersion": "10.285",
    "createdTime": 1663018758217,
    "modifiedTime": 1663018759908,
    "lastModifiedBy": "DbeAbHwpEqczKjsD"
  }
}
