{
  "_id": "8vF0UoXribL1DOG2",
  "name": "Final Revelation",
  "type": "feat",
  "img": "systems/pf1/icons/skills/emerald_11.jpg",
  "effects": [],
  "folder": null,
  "sort": 0,
  "flags": {},
  "system": {
    "description": {
      "value": "<p>At 20th level, an oracle learns the final revelation about her mystery, granting her amazing powers and abilities. The nature of these bonuses depends upon the oracle’s mystery.</p>"
    },
    "tags": [],
    "actions": [],
    "attackNotes": [],
    "effectNotes": [],
    "changes": [],
    "contextNotes": [],
    "links": {
      "children": [],
      "charges": []
    },
    "tag": "classFeat_finalRevelation",
    "useCustomTag": true,
    "armorProf": {
      "value": []
    },
    "weaponProf": {
      "value": []
    },
    "languages": {
      "value": []
    },
    "scriptCalls": [],
    "featType": "classFeat",
    "associations": {
      "classes": [["Oracle"]]
    }
  },
  "ownership": {
    "default": 0
  },
  "_stats": {
    "systemId": "pf1",
    "systemVersion": "0.82.1",
    "coreVersion": "10.285",
    "createdTime": 1663018762964,
    "modifiedTime": 1663018778134,
    "lastModifiedBy": "DbeAbHwpEqczKjsD"
  }
}
