{
  "_id": "dmcdsjslcjpfayxg",
  "name": "Kit, Watchman's",
  "type": "loot",
  "img": "systems/pf1/icons/items/inventory/dice.jpg",
  "effects": [],
  "folder": null,
  "sort": 0,
  "flags": {},
  "system": {
    "description": {
      "value": "\r\n<p><b>Price</b> 3 gp; <b>Weight</b> 10 lbs.</p>\r\n<p>This kit includes a badge (tin <a href=\"https://www.d20pfsrd.com/equipment/goods-and-services/containers-bags-boxes-more#TOC-Brooch\">brooch</a> worth 5 sp), <a href=\"https://www.d20pfsrd.com/equipment/goods-and-services/tools-kits#TOC-Flint-and-Steel\">flint and steel</a>, a shield sconce, a <a href=\"https://www.d20pfsrd.com/equipment/goods-and-services/toys-games-puzzles#TOC-Whistle-Signal\">signal whistle</a>, and torches (10).</p>\r\n\r\n"
    },
    "tags": [],
    "weight": {
      "value": 10
    },
    "price": 3,
    "equipped": false,
    "changes": [],
    "contextNotes": [],
    "links": {
      "children": []
    },
    "flags": {
      "boolean": [],
      "dictionary": []
    },
    "scriptCalls": [],
    "subType": "gear"
  },
  "ownership": {
    "default": 0
  },
  "_stats": {
    "systemId": "pf1",
    "systemVersion": "0.82.1",
    "coreVersion": "10.285",
    "createdTime": 1663018752985,
    "modifiedTime": 1663018755676,
    "lastModifiedBy": "DbeAbHwpEqczKjsD"
  }
}
