{
  "_id": "jrQxe363H6QaWeSh",
  "name": "Turnabout",
  "type": "feat",
  "img": "systems/pf1/icons/feats/deceitful.jpg",
  "effects": [],
  "folder": null,
  "sort": 0,
  "flags": {},
  "system": {
    "description": {
      "value": "<p>A vigilante with this talent can capitalize on any opportunities in combat. Whenever a foe provokes an attack of opportunity from the vigilante by attacking or casting a spell, the vigilante can attempt a dirty trick&nbsp;combat maneuver check in place of the attack of opportunity. If he succeeds at the check, in addition to the usual options, the vigilante can redirect the attack or spell to a new target or area the foe could have chosen.</p>"
    },
    "tags": [],
    "actions": [],
    "attackNotes": [],
    "effectNotes": [],
    "changes": [],
    "contextNotes": [],
    "links": {
      "children": [],
      "charges": []
    },
    "tag": "classFeat_turnabout",
    "useCustomTag": true,
    "armorProf": {
      "value": []
    },
    "weaponProf": {
      "value": []
    },
    "languages": {
      "value": []
    },
    "scriptCalls": [],
    "featType": "classFeat",
    "associations": {
      "classes": [["Vigilante"]]
    },
    "abilityType": "ex"
  },
  "ownership": {
    "default": 0
  },
  "_stats": {
    "systemId": "pf1",
    "systemVersion": "0.82.1",
    "coreVersion": "10.285",
    "createdTime": 1663018767803,
    "modifiedTime": 1663018778476,
    "lastModifiedBy": "DbeAbHwpEqczKjsD"
  }
}
