{
  "_id": "2U4Brc6XSYEb6Azn",
  "name": "Spell Aid",
  "type": "feat",
  "img": "systems/pf1/icons/items/inventory/banner-red.jpg",
  "effects": [],
  "folder": null,
  "sort": 0,
  "flags": {},
  "system": {
    "description": {
      "value": "<p>At 2nd level, whenever the cavalier uses the aid another action to assist one of his allies, the ally receives a +2 competence bonus on the next concentration check, dispel check, or caster level check she makes (whichever comes first). At 8th level and every six levels thereafter, this bonus increases by an additional +1.</p>"
    },
    "tags": [],
    "actions": [],
    "attackNotes": [],
    "effectNotes": [],
    "changes": [],
    "contextNotes": [],
    "links": {
      "children": [],
      "charges": []
    },
    "tag": "classFeat_spellAid",
    "useCustomTag": true,
    "armorProf": {
      "value": []
    },
    "weaponProf": {
      "value": []
    },
    "languages": {
      "value": []
    },
    "scriptCalls": [],
    "featType": "classFeat",
    "associations": {
      "classes": [["Cavalier"]]
    },
    "abilityType": "ex"
  },
  "ownership": {
    "default": 0
  },
  "_stats": {
    "systemId": "pf1",
    "systemVersion": "0.82.1",
    "coreVersion": "10.285",
    "createdTime": 1663018762017,
    "modifiedTime": 1663018778084,
    "lastModifiedBy": "DbeAbHwpEqczKjsD"
  }
}
