{
  "_id": "T7YsL5WMkHP1ZXtJ",
  "name": "Shadow Mystery",
  "type": "feat",
  "img": "systems/pf1/icons/spells/light-magenta-2.jpg",
  "effects": [],
  "folder": null,
  "sort": 0,
  "flags": {},
  "system": {
    "description": {
      "value": "<p><strong>Class Skills:</strong> An oracle with this mystery adds Bluff, Disguise, Knowledge (dungeoneering), and Stealth to her list of class skills.<br><br><strong>Bonus Spells:</strong>&nbsp;</p>\n<ul>\n<li>@Compendium[pf1.spells.h4hrop7rq2c9phyi]{Blurred Movement} (2nd),&nbsp;</li>\n<li>@Compendium[pf1.spells.oylikodnyku2zewu]{Invisibility} (4th),&nbsp;</li>\n<li>@Compendium[pf1.spells.jdsvncnna6oy189a]{Deeper Darkness} (6th),&nbsp;</li>\n<li>@Compendium[pf1.spells.cmwcavfyc1vbehy8]{Shadow Step}&nbsp;(8th),&nbsp;</li>\n<li>@Compendium[pf1.spells.3idp5fjp62wpn4a4]{Vampiric Shadow Shield} (10th),&nbsp;</li>\n<li>@Compendium[pf1.spells.btoow6tyv39443gh]{Shadow Walk} (12th),&nbsp;</li>\n<li>@Compendium[pf1.spells.j2y1uga5fwg8deqq]{Invisibility, Mass} (14th),&nbsp;</li>\n<li>@Compendium[pf1.spells.967ur7a9xepd704y]{Shadow Evocation, Greater} (16th),&nbsp;</li>\n<li>@Compendium[pf1.spells.xxaycxbdsmalf5ov]{Shades} (18th).</li>\n</ul>"
    },
    "tags": [],
    "actions": [],
    "attackNotes": [],
    "effectNotes": [],
    "changes": [],
    "contextNotes": [],
    "links": {
      "children": [],
      "charges": []
    },
    "tag": "classFeat_shadowMystery",
    "useCustomTag": true,
    "armorProf": {
      "value": []
    },
    "weaponProf": {
      "value": []
    },
    "languages": {
      "value": []
    },
    "scriptCalls": [],
    "featType": "classFeat",
    "associations": {
      "classes": [["Oracle"]]
    }
  },
  "ownership": {
    "default": 0
  },
  "_stats": {
    "systemId": "pf1",
    "systemVersion": "0.82.1",
    "coreVersion": "10.285",
    "createdTime": 1663018765673,
    "modifiedTime": 1663018778273,
    "lastModifiedBy": "DbeAbHwpEqczKjsD"
  }
}
