{
  "name": "Uncommon Level 9 Divine Scrolls",
  "flags": {},
  "description": "",
  "results": [
    {
      "_id": "xdvz83K7mz54LP8m",
      "flags": {},
      "type": 0,
      "text": "Scroll of Antipathy",
      "img": "icons/svg/d20-black.svg",
      "resultId": "",
      "weight": 8,
      "range": [1, 8],
      "drawn": false
    },
    {
      "_id": "khz9bYHEdYHkyqxQ",
      "flags": {},
      "type": 0,
      "text": "Scroll of Clashing Rocks",
      "img": "icons/svg/d20-black.svg",
      "resultId": "",
      "weight": 7,
      "range": [9, 15],
      "drawn": false
    },
    {
      "_id": "dHFXNg6QYwdWmOXH",
      "flags": {},
      "type": 0,
      "text": "Scroll of Create Demiplane, Greater",
      "img": "icons/svg/d20-black.svg",
      "resultId": "",
      "weight": 7,
      "range": [16, 22],
      "drawn": false
    },
    {
      "_id": "fejuQOroaRHtlYZY",
      "flags": {},
      "type": 0,
      "text": "Scroll of Foresight",
      "img": "icons/svg/d20-black.svg",
      "resultId": "",
      "weight": 9,
      "range": [23, 31],
      "drawn": false
    },
    {
      "_id": "oTlcPxW9hoEofPys",
      "flags": {},
      "type": 0,
      "text": "Scroll of Overwhelming Presence",
      "img": "icons/svg/d20-black.svg",
      "resultId": "",
      "weight": 8,
      "range": [32, 39],
      "drawn": false
    },
    {
      "_id": "pYQOv3olFYwwewG2",
      "flags": {},
      "type": 0,
      "text": "Scroll of Polar Midnight",
      "img": "icons/svg/d20-black.svg",
      "resultId": "",
      "weight": 8,
      "range": [40, 47],
      "drawn": false
    },
    {
      "_id": "MYZuNhH9ufitYV3C",
      "flags": {},
      "type": 0,
      "text": "Scroll of Soul Bind",
      "img": "icons/svg/d20-black.svg",
      "resultId": "",
      "weight": 9,
      "range": [48, 56],
      "drawn": false
    },
    {
      "_id": "APxgZ2tM5x7AYp1F",
      "flags": {},
      "type": 0,
      "text": "Scroll of Spell Immunity, Greater Communal",
      "img": "icons/svg/d20-black.svg",
      "resultId": "",
      "weight": 8,
      "range": [57, 64],
      "drawn": false
    },
    {
      "_id": "hSudNrtfw2qC9j99",
      "flags": {},
      "type": 0,
      "text": "Scroll of Summon Froghemoth",
      "img": "icons/svg/d20-black.svg",
      "resultId": "",
      "weight": 7,
      "range": [65, 71],
      "drawn": false
    },
    {
      "_id": "cFMNwiwigMT1AqqX",
      "flags": {},
      "type": 0,
      "text": "Scroll of Winds of Vengeance",
      "img": "icons/svg/d20-black.svg",
      "resultId": "",
      "weight": 9,
      "range": [72, 80],
      "drawn": false
    },
    {
      "_id": "yhz62CRXYnOzqDzd",
      "flags": {},
      "type": 0,
      "text": "Scroll of World Wave",
      "img": "icons/svg/d20-black.svg",
      "resultId": "",
      "weight": 7,
      "range": [81, 87],
      "drawn": false
    },
    {
      "_id": "FkVePxXLDWJBTEbx",
      "flags": {},
      "type": 0,
      "text": "Scroll of Astral Projection",
      "img": "icons/svg/d20-black.svg",
      "resultId": "",
      "weight": 7,
      "range": [88, 94],
      "drawn": false
    },
    {
      "_id": "z7KtgD7I3MH6UD15",
      "flags": {},
      "type": 0,
      "text": "Scroll of Sympathy",
      "img": "icons/svg/d20-black.svg",
      "resultId": "",
      "weight": 6,
      "range": [95, 100],
      "drawn": false
    }
  ],
  "formula": "1d100",
  "replacement": true,
  "displayRoll": true,
  "_id": "d0uZrVr8nAkYn0Ph",
  "ownership": {
    "default": 0
  }
}
