{
  "_id": "ajttarrnkljnmayq",
  "name": "Kit, Pyramid Buster's",
  "type": "loot",
  "img": "systems/pf1/icons/items/inventory/dice.jpg",
  "effects": [],
  "folder": null,
  "sort": 0,
  "flags": {},
  "system": {
    "description": {
      "value": "\r\n<p class=\"source\"><b>Source</b>: <a title=\"PZO9444\" href=\"http://www.amazon.com/gp/product/1601256043/ref=as_li_qf_sp_asin_il_tl?ie=UTF8&amp;camp=1789&amp;creative=9325&amp;creativeASIN=1601256043&amp;linkCode=as2&amp;tag=httpwwwd20pfs-20&amp;linkId=RI56HP6FPZYWBQMM\" target=\"_blank\" rel=\"noopener\">USH</a></p>\r\n<p><b>Price</b> 310 gp; <b>Weight</b> 8 lbs.</p>\r\n<p>This kit contains items helpful in navigating the winding corridors of pyramids, but is also useful in other crypts and tombs. It contains three sticks of <a href=\"https://www.d20pfsrd.com/equipment/goods-and-services/books-paper-writing-supplies#TOC-Chalk\">chalk</a>, five sheets of <a href=\"https://www.d20pfsrd.com/equipment/goods-and-services/books-paper-writing-supplies#TOC-Parchment\">parchment</a>, 1 dose of synthetic mumia, a <a href=\"https://www.d20pfsrd.com/equipment/goods-and-services/containers-bags-boxes-more#TOC-Flask\">flask</a> of <a href=\"https://www.d20pfsrd.com/equipment/goods-and-services/herbs-oils-other-substances#TOC-Oil-Alchemist-s-Fire\">alchemist's fire</a>, a tangleburn bag, and a pair of sunrods.</p>\r\n\r\n"
    },
    "tags": [],
    "weight": {
      "value": 8
    },
    "price": 310,
    "equipped": false,
    "changes": [],
    "contextNotes": [],
    "links": {
      "children": []
    },
    "flags": {
      "boolean": [],
      "dictionary": []
    },
    "scriptCalls": [],
    "subType": "gear"
  },
  "ownership": {
    "default": 0
  },
  "_stats": {
    "systemId": "pf1",
    "systemVersion": "0.82.1",
    "coreVersion": "10.285",
    "createdTime": 1663018752907,
    "modifiedTime": 1663018755666,
    "lastModifiedBy": "DbeAbHwpEqczKjsD"
  }
}
