{
  "_id": "xMaOT7u5lzVD80h6",
  "name": "Linked Reaction",
  "type": "feat",
  "img": "systems/pf1/icons/skills/violet_26.jpg",
  "effects": [],
  "folder": null,
  "sort": 0,
  "flags": {},
  "system": {
    "description": {
      "value": "<p>A hive mind allows the mesmerist and an ally to share one another’s reaction times. The mesmerist can trigger this trick when either the subject or the mesmerist is surprised and the other isn’t (even if the mesmerist would normally be unable to take actions because of being surprised). Both the mesmerist and the subject can act in this surprise round.</p>\n<p>The mesmerist can’t implant this trick on himself.</p>"
    },
    "tags": [],
    "actions": [],
    "attackNotes": [],
    "effectNotes": [],
    "changes": [],
    "contextNotes": [],
    "links": {
      "children": [],
      "charges": []
    },
    "tag": "classFeat_linkedReaction",
    "useCustomTag": true,
    "armorProf": {
      "value": []
    },
    "weaponProf": {
      "value": []
    },
    "languages": {
      "value": []
    },
    "scriptCalls": [],
    "featType": "classFeat",
    "associations": {
      "classes": [["Mesmerist"]]
    }
  },
  "ownership": {
    "default": 0
  },
  "_stats": {
    "systemId": "pf1",
    "systemVersion": "0.82.1",
    "coreVersion": "10.285",
    "createdTime": 1663018769703,
    "modifiedTime": 1663018778566,
    "lastModifiedBy": "DbeAbHwpEqczKjsD"
  }
}
