{
  "_id": "zfZ7M3PGgvWeolOz",
  "name": "Degenerate (Quick)",
  "type": "feat",
  "img": "systems/pf1/icons/skills/violet_07.jpg",
  "effects": [],
  "folder": null,
  "sort": 0,
  "flags": {},
  "system": {
    "description": {
      "value": "<p><strong>Acquired/Inherited Template</strong>&nbsp;Acquired</p>\n<p><strong>Simple Template</strong>&nbsp;Yes<br><strong>Usable with Summons</strong>&nbsp;No<br><br>Degenerate creatures are weaker than their ordinary cousins.<br><br><strong>Quick Rules:</strong> -2 on all rolls (including damage rolls) and to special ability DCs; -2 to AC and CMD; -2 hp/HD.<br><br><strong>Rebuild Rules:</strong>&nbsp;Ability Scores&nbsp;-4 to all ability scores (minimum 1).</p>"
    },
    "tags": [],
    "actions": [],
    "attackNotes": [],
    "effectNotes": [],
    "changes": [
      {
        "_id": "fo7a8i2b",
        "formula": "-2",
        "operator": "+",
        "subTarget": "attack",
        "modifier": "untyped",
        "priority": 0,
        "value": 0,
        "target": "attack"
      },
      {
        "_id": "a1s71u71",
        "formula": "-2",
        "operator": "+",
        "subTarget": "wdamage",
        "modifier": "untyped",
        "priority": 0,
        "value": 0,
        "target": "damage"
      },
      {
        "_id": "bsizn2bg",
        "formula": "-2",
        "operator": "+",
        "subTarget": "allSavingThrows",
        "modifier": "untyped",
        "priority": 0,
        "value": 0,
        "target": "savingThrows"
      },
      {
        "_id": "qdi41w1u",
        "formula": "-2",
        "operator": "+",
        "subTarget": "skills",
        "modifier": "untyped",
        "priority": 0,
        "value": 0,
        "target": "skills"
      },
      {
        "_id": "q2i6pb89",
        "formula": "-2",
        "operator": "+",
        "subTarget": "allChecks",
        "modifier": "untyped",
        "priority": 0,
        "value": 0,
        "target": "abilityChecks"
      },
      {
        "_id": "hxx0uqfh",
        "formula": "-2",
        "operator": "+",
        "subTarget": "ac",
        "modifier": "untyped",
        "priority": 0,
        "value": 0,
        "target": "ac"
      },
      {
        "_id": "qy5ge54l",
        "formula": "-2",
        "operator": "+",
        "subTarget": "cmd",
        "modifier": "untyped",
        "priority": 0,
        "value": 0,
        "target": "misc"
      },
      {
        "_id": "so685yut",
        "formula": "@attributes.hd.total*-2",
        "operator": "+",
        "subTarget": "mhp",
        "modifier": "untyped",
        "priority": 0,
        "value": 0,
        "target": "misc"
      }
    ],
    "contextNotes": [],
    "links": {
      "children": [],
      "charges": []
    },
    "armorProf": {
      "value": []
    },
    "weaponProf": {
      "value": []
    },
    "languages": {
      "value": []
    },
    "flags": {
      "boolean": [],
      "dictionary": []
    },
    "scriptCalls": [],
    "featType": "template",
    "associations": {
      "classes": []
    },
    "crOffset": "-1"
  },
  "ownership": {
    "default": 0
  },
  "_stats": {
    "systemId": "pf1",
    "systemVersion": "0.82.1",
    "coreVersion": "10.285",
    "createdTime": 1663018786111,
    "modifiedTime": 1663018786852,
    "lastModifiedBy": "DbeAbHwpEqczKjsD"
  }
}
