{
  "_id": "9L6D7WcLuGX58Wc6",
  "name": "Rivers Subdomain",
  "type": "feat",
  "img": "systems/pf1/icons/skills/blue_06.jpg",
  "effects": [],
  "folder": null,
  "sort": 0,
  "flags": {},
  "system": {
    "description": {
      "value": "<p><strong>Replacement Domain Spells:</strong></p>\n<ul>\n<li>1st—@Compendium[pf1.spells.ohy0ty2dawfaaqwd]{Hydraulic Push}</li>\n<li>2nd—@Compendium[pf1.spells.7fvsn0gbv6ynlp63]{Slipstream}</li>\n<li>5th—@Compendium[pf1.spells.yldjnorgbx4jsldz]{Elemental Body II}</li>\n<li>6th—@Compendium[pf1.spells.h4nlrm44ubsyzuhz]{Fluid Form}</li>\n</ul>"
    },
    "tags": [],
    "actions": [],
    "attackNotes": [],
    "effectNotes": [],
    "changes": [],
    "contextNotes": [],
    "links": {
      "children": [],
      "charges": []
    },
    "tag": "classFeat_riversSubdomain",
    "useCustomTag": true,
    "armorProf": {
      "value": []
    },
    "weaponProf": {
      "value": []
    },
    "languages": {
      "value": []
    },
    "scriptCalls": [],
    "featType": "classFeat",
    "associations": {
      "classes": [["Cleric"]]
    }
  },
  "ownership": {
    "default": 0
  },
  "_stats": {
    "systemId": "pf1",
    "systemVersion": "0.82.1",
    "coreVersion": "10.285",
    "createdTime": 1663018763033,
    "modifiedTime": 1663018778137,
    "lastModifiedBy": "DbeAbHwpEqczKjsD"
  }
}
