{
  "_id": "fukX7UOOr7xTSBPv",
  "name": "Rivethun Discipline",
  "type": "feat",
  "img": "systems/pf1/icons/spells/slice-spirit-3.jpg",
  "effects": [],
  "folder": null,
  "sort": 0,
  "flags": {},
  "system": {
    "description": {
      "value": "<p>You have embraced those aspects of your body that cause you agony, respecting the perspective they grant you if not necessarily the roles they’ve condemned you to in life.<br><br><strong>Phrenic Pool Ability:</strong> Charisma<br><br><strong>Bonus Spells:</strong>&nbsp;</p>\n<ul>\n<li>@Compendium[pf1.spells.r8bhei88g6h26fp0]{Heightened Awareness} (1st),&nbsp;</li>\n<li>@Compendium[pf1.spells.usdv1eqvibmxun6x]{Bear's Endurance} (4th),&nbsp;</li>\n<li>@Compendium[pf1.spells.isrnyw9biluqoo80]{Aura Sight} (6th),&nbsp;</li>\n<li>@Compendium[pf1.spells.ev845glbl54em94v]{Persistent Vigor} (8th),&nbsp;</li>\n<li>@Compendium[pf1.spells.jbqo4o2b2tmdz7wv]{True Seeing} (10th),&nbsp;</li>\n<li>@Compendium[pf1.spells.37ubwx82nqaog3ib]{Thought Shield V} (12th),&nbsp;</li>\n<li>@Compendium[pf1.spells.blvetbc929cfx4m8]{Mind Blank} (14th),&nbsp;</li>\n<li>@Compendium[pf1.spells.mkrjbrp57yfdqrx0]{Iron Body} (16th),&nbsp;</li>\n<li>@Compendium[pf1.spells.au6p72aztjhtokwr]{Akashic Form} (18th).</li>\n</ul>"
    },
    "tags": [],
    "actions": [],
    "attackNotes": [],
    "effectNotes": [],
    "changes": [],
    "contextNotes": [],
    "links": {
      "children": [],
      "charges": []
    },
    "tag": "classFeat_rivethunDiscipline",
    "useCustomTag": true,
    "armorProf": {
      "value": []
    },
    "weaponProf": {
      "value": []
    },
    "languages": {
      "value": []
    },
    "scriptCalls": [],
    "featType": "classFeat",
    "associations": {
      "classes": [["Psychic"]]
    }
  },
  "ownership": {
    "default": 0
  },
  "_stats": {
    "systemId": "pf1",
    "systemVersion": "0.82.1",
    "coreVersion": "10.285",
    "createdTime": 1663018767206,
    "modifiedTime": 1663018778452,
    "lastModifiedBy": "DbeAbHwpEqczKjsD"
  }
}
