{
  "_id": "zLXBKnWXbZ2YKOBo",
  "name": "Counterstrike",
  "type": "feat",
  "img": "systems/pf1/icons/feats/channel-smite.jpg",
  "effects": [],
  "folder": null,
  "sort": 0,
  "flags": {},
  "system": {
    "description": {
      "value": "<p>At 16th level, whenever an enemy within reach of the magus successfully casts a spell defensively, that enemy provokes an attack of opportunity from the magus after the spell is complete. This attack of opportunity cannot disrupt the spell.</p>"
    },
    "tags": [],
    "actions": [],
    "attackNotes": [],
    "effectNotes": [],
    "changes": [],
    "contextNotes": [],
    "links": {
      "children": [],
      "charges": []
    },
    "tag": "classFeat_counterstrike",
    "useCustomTag": true,
    "armorProf": {
      "value": []
    },
    "weaponProf": {
      "value": []
    },
    "languages": {
      "value": []
    },
    "scriptCalls": [],
    "featType": "classFeat",
    "associations": {
      "classes": [["Magus"]]
    },
    "abilityType": "ex"
  },
  "ownership": {
    "default": 0
  },
  "_stats": {
    "systemId": "pf1",
    "systemVersion": "0.82.1",
    "coreVersion": "10.285",
    "createdTime": 1663018770097,
    "modifiedTime": 1663018778577,
    "lastModifiedBy": "DbeAbHwpEqczKjsD"
  }
}
