{
  "_id": "akrnqognxpokqnqz",
  "name": "Healy Myrrh",
  "type": "loot",
  "img": "systems/pf1/icons/items/inventory/dice.jpg",
  "effects": [],
  "folder": null,
  "sort": 0,
  "flags": {},
  "system": {
    "description": {
      "value": "\r\n<p class=\"source\"><b>Source</b> PZO9406</p>\r\n<p>When you burn this powerful resin, it fills 8,000 cubic feet with faint smoke that persists for 8 full hours. Any creatures resting or receiving long-term care in the area while the healy myrrh is active regain 1 additional hit point per level. Multiple uses of healy myrrh in a 24-hour period do not stack.</p>\r\n<p><b>Create</b>: <a href=\"https://www.d20pfsrd.com/skills/craft\">Craft</a> (alchemy) 5 ranks, <a href=\"https://www.d20pfsrd.com/skills/heal\">Heal</a> 5 ranks; <b>Cost</b> 25 gp</p>\r\n"
    },
    "tags": [],
    "price": 50,
    "equipped": false,
    "changes": [],
    "contextNotes": [],
    "links": {
      "children": []
    },
    "flags": {
      "boolean": [],
      "dictionary": []
    },
    "scriptCalls": [],
    "subType": "gear"
  },
  "ownership": {
    "default": 0
  },
  "_stats": {
    "systemId": "pf1",
    "systemVersion": "0.82.1",
    "coreVersion": "10.285",
    "createdTime": 1663018752912,
    "modifiedTime": 1663018755671,
    "lastModifiedBy": "DbeAbHwpEqczKjsD"
  }
}
