{
  "_id": "vyqvubccx5m8ie3r",
  "name": "Vision of Lamashtu",
  "type": "spell",
  "img": "systems/pf1/icons/misc/magic-swirl.png",
  "effects": [],
  "folder": null,
  "sort": 0,
  "flags": {},
  "system": {
    "tags": [],
    "actions": [
      {
        "_id": "hbz4l0a28u64og37",
        "name": "Use",
        "img": "systems/pf1/icons/misc/magic-swirl.png",
        "description": "",
        "tag": "",
        "activation": {
          "cost": 10,
          "type": "minute"
        },
        "unchainedAction": {
          "activation": {
            "cost": 10,
            "type": "minute"
          }
        },
        "duration": {
          "value": "instantaneous",
          "units": ""
        },
        "target": {
          "value": "one living creature"
        },
        "range": {
          "value": null,
          "units": "",
          "maxIncrements": 1,
          "minValue": null,
          "minUnits": ""
        },
        "uses": {
          "autoDeductCharges": true,
          "autoDeductChargesCost": "1",
          "self": {
            "value": 0,
            "maxFormula": "",
            "per": null
          },
          "per": "",
          "value": 0,
          "maxFormula": ""
        },
        "measureTemplate": {
          "type": "",
          "size": "0",
          "overrideColor": false,
          "customColor": "",
          "overrideTexture": false,
          "customTexture": ""
        },
        "attackName": "",
        "actionType": "spellsave",
        "attackBonus": "",
        "critConfirmBonus": "",
        "damage": {
          "parts": [],
          "critParts": [],
          "nonCritParts": []
        },
        "attackParts": [],
        "formulaicAttacks": {
          "count": {
            "formula": ""
          },
          "bonus": {
            "formula": ""
          },
          "label": null
        },
        "formula": "",
        "ability": {
          "attack": "",
          "damage": "",
          "damageMult": 1,
          "critRange": 20,
          "critMult": 2
        },
        "save": {
          "dc": "0",
          "type": "will",
          "description": "Will negates (see text)"
        },
        "effectNotes": [],
        "attackNotes": [],
        "soundEffect": "",
        "powerAttack": {
          "multiplier": "",
          "damageBonus": 2,
          "critMultiplier": 1
        },
        "naturalAttack": {
          "primaryAttack": true,
          "secondary": {
            "attackBonus": "-5",
            "damageMult": 0.5
          }
        },
        "nonlethal": false,
        "usesAmmo": false,
        "spellEffect": "",
        "spellArea": "",
        "conditionals": [],
        "enh": {
          "value": null
        }
      }
    ],
    "uses": {
      "per": ""
    },
    "attackNotes": [],
    "effectNotes": [],
    "links": {
      "children": []
    },
    "flags": {
      "boolean": [],
      "dictionary": []
    },
    "scriptCalls": [],
    "learnedAt": {
      "class": [
        ["cleric/oracle", 7],
        ["witch", 7],
        ["inquisitor", 6]
      ],
      "domain": [],
      "subDomain": [],
      "elementalSchool": [],
      "bloodline": []
    },
    "level": 7,
    "school": "ill",
    "subschool": "phantasm",
    "types": "mind-affecting, evil",
    "components": {
      "verbal": true,
      "somatic": true
    },
    "shortDescription": "<p>This spell functions exactly as the spell <i>nightmare</i>. In addition to the effects of that spell, you can cause a second spell to be delivered when the target wakes at the <i>nightmare</i>'s conclusion.</p><p>You must have this second spell prepared, and it must be cast immediately after <i>vision of Lamashtu</i> (effectively adding the two spells' casting times). This second spell \"rides along\" with the <i>nightmare</i>, affecting the target as soon as it wakes from its fitful sleep. Any spell can be sent along with the <i>nightmare</i>, so long as it is of 6th level or lower, affects one target (which is always the <i>nightmare</i>'s recipient), and does not deal hit point damage. The second spell's range is irrelevant for the purposes of <i>vision of Lamashtu</i>, and even touch attacks can be delivered in this manner (you must still make a successful touch attack in order to affect the target, though, with the act of touching occurring within the context of the victim's <i>nightmare</i>). The target is allowed to save against the second spell if a save is allowed. For example, a cleric of Lamashtu could send <i>bestow curse</i> along as part of a <i>vision of Lamashtu</i>, but not <i>blade barrier</i> (affects an area), <i>destruction</i> (too high level), or <i>inflict moderate wounds</i> (deals hit point damage).</p>"
  },
  "ownership": {
    "default": 0
  },
  "_stats": {
    "systemId": "pf1",
    "systemVersion": "0.82.1",
    "coreVersion": "10.285",
    "createdTime": 1663018735857,
    "modifiedTime": 1663018744985,
    "lastModifiedBy": "DbeAbHwpEqczKjsD"
  }
}
