{
  "_id": "TsVqYiOKJyrLT9pF",
  "name": "Blood Subdomain",
  "type": "feat",
  "img": "systems/pf1/icons/skills/red_19.jpg",
  "effects": [],
  "folder": null,
  "sort": 0,
  "flags": {},
  "system": {
    "description": {
      "value": "<p><strong>Replacement Domain Spells:</strong></p>\n<ul>\n<li>3rd—@Compendium[pf1.spells.3efy1ico48ccrzni]{Vampiric Touch}</li>\n<li>5th—@Compendium[pf1.spells.nqfoy30smshc3c6w]{Wall Of Thorns}</li>\n<li>7th—@Compendium[pf1.spells.szrnkq08163rjmup]{Inflict Serious Wounds, Mass}</li>\n</ul>"
    },
    "tags": [],
    "actions": [],
    "attackNotes": [],
    "effectNotes": [],
    "changes": [],
    "contextNotes": [],
    "links": {
      "children": [],
      "charges": []
    },
    "tag": "classFeat_bloodSubdomain",
    "useCustomTag": true,
    "armorProf": {
      "value": []
    },
    "weaponProf": {
      "value": []
    },
    "languages": {
      "value": []
    },
    "scriptCalls": [],
    "featType": "classFeat",
    "associations": {
      "classes": [["Cleric"]]
    }
  },
  "ownership": {
    "default": 0
  },
  "_stats": {
    "systemId": "pf1",
    "systemVersion": "0.82.1",
    "coreVersion": "10.285",
    "createdTime": 1663018765715,
    "modifiedTime": 1663018778276,
    "lastModifiedBy": "DbeAbHwpEqczKjsD"
  }
}
