{
  "_id": "cqh8Lq95zBNRj7DB",
  "name": "Vision of Blood",
  "type": "feat",
  "img": "systems/pf1/icons/skills/violet_26.jpg",
  "effects": [],
  "folder": null,
  "sort": 0,
  "flags": {},
  "system": {
    "description": {
      "value": "<p>When an enemy is struck by the subject, it believes its wound is far more severe, and the shock overwhelms it. The mesmerist can trigger this trick when the subject hits with an attack using a weapon, a natural weapon, or an unarmed strike. The attack’s target must succeed at a Will saving throw or be stunned for 1 round. If the triggering attack was a critical hit, the target doesn’t get a saving throw.</p>"
    },
    "tags": [],
    "actions": [],
    "attackNotes": [],
    "effectNotes": [],
    "changes": [],
    "contextNotes": [],
    "links": {
      "children": [],
      "charges": []
    },
    "tag": "classFeat_visionOfBlood",
    "useCustomTag": true,
    "armorProf": {
      "value": []
    },
    "weaponProf": {
      "value": []
    },
    "languages": {
      "value": []
    },
    "scriptCalls": [],
    "featType": "classFeat",
    "associations": {
      "classes": [["Mesmerist"]]
    }
  },
  "ownership": {
    "default": 0
  },
  "_stats": {
    "systemId": "pf1",
    "systemVersion": "0.82.1",
    "coreVersion": "10.285",
    "createdTime": 1663018767007,
    "modifiedTime": 1663018778423,
    "lastModifiedBy": "DbeAbHwpEqczKjsD"
  }
}
