{
  "_id": "apffcmcvexerzvup",
  "name": "Barding Stitches",
  "type": "loot",
  "img": "systems/pf1/icons/items/inventory/dice.jpg",
  "effects": [],
  "folder": null,
  "sort": 0,
  "flags": {},
  "system": {
    "description": {
      "value": "\r\n<p class=\"source\"><b>Source</b> <a href=\"http://www.amazon.com/gp/product/1601254881/ref=as_li_qf_sp_asin_il_tl?ie=UTF8&amp;camp=1789&amp;creative=9325&amp;creativeASIN=1601254881&amp;linkCode=as2&amp;tag=httpwwwd20pfs-20\" target=\"_blank\" rel=\"noopener\">PPZO9410</a></p>\r\n<p><b>Price</b> 50 gp; <b>Weight</b> 1 lb.</p>\r\n<p>This thin, specially treated wire can be used to attach barding to creatures whose body types cannot normally accommodate <a href=\"https://www.d20pfsrd.com/basics-ability-scores/glossary#TOC-Armor-Bonus\">armor</a>, such as piscine, serpentine, and verminous <a href=\"https://www.d20pfsrd.com/bestiary/rules-for-monsters/creature-types#TOC-Animal\">animals</a>, by delicately and thoroughly sewing the equipment directly to the creature's flesh. Equipping a creature with barding using barding stitches takes 10 times as long as normal barding, and a successful DC 25 <a href=\"https://www.d20pfsrd.com/skills/heal\">Heal</a> check is required to <a href=\"https://www.d20pfsrd.com/bestiary/rules-for-monsters/universal-monster-rules#TOC-Attach-Ex-\">attach</a> or remove the stitches. The creature must be <a href=\"https://www.d20pfsrd.com/gamemastering/conditions#TOC-Helpless\">helpless</a> or willing to be equipped with barding stitches, and must have at least a +1 <a href=\"https://www.d20pfsrd.com/basics-ability-scores/glossary#TOC-Natural-Armor-Bonus\">natural armor bonus</a> to AC. An armored creature with barding stitches takes a -2 penalty on <a href=\"https://www.d20pfsrd.com/basics-ability-scores/ability-scores#TOC-Strength-Str-\">Strength</a>&#8211; and <a href=\"https://www.d20pfsrd.com/basics-ability-scores/ability-scores#TOC-Dexterity-Dex-\">Dexterity</a>-based skill checks (in addition to any penalties from the barding itself), <a href=\"https://www.d20pfsrd.com/gamemastering/combat#TOC-Fortitude\">Fortitude</a> and <a href=\"https://www.d20pfsrd.com/gamemastering/combat#TOC-Reflex\">Reflex</a> saves, and saves against effects with the <a href=\"https://www.d20pfsrd.com/magic#TOC-Magic-Descriptor-Pain\">pain descriptor</a> (these penalties stack). These penalties persist for as long as the creature is equipped with barding stitches.</p>\r\n\r\n"
    },
    "tags": [],
    "weight": {
      "value": 1
    },
    "price": 50,
    "equipped": false,
    "changes": [],
    "contextNotes": [],
    "links": {
      "children": []
    },
    "flags": {
      "boolean": [],
      "dictionary": []
    },
    "scriptCalls": [],
    "subType": "gear"
  },
  "ownership": {
    "default": 0
  },
  "_stats": {
    "systemId": "pf1",
    "systemVersion": "0.82.1",
    "coreVersion": "10.285",
    "createdTime": 1663018752914,
    "modifiedTime": 1663018755671,
    "lastModifiedBy": "DbeAbHwpEqczKjsD"
  }
}
