{
  "_id": "7RxmCyoga9W3WADT",
  "name": "Riot Subdomain",
  "type": "feat",
  "img": "systems/pf1/icons/spells/haste-fire-2.jpg",
  "effects": [],
  "folder": null,
  "sort": 0,
  "flags": {},
  "system": {
    "description": {
      "value": "<p><strong>Replacement Domain Spells:</strong></p>\n<ul>\n<li>4th—@Compendium[pf1.spells.n0bsyxchnigkkuqo]{Confusion}</li>\n<li>7th—@Compendium[pf1.spells.1os71jpk7lrrl47b]{Song of Discord}</li>\n<li>9th—@Compendium[pf1.spells.kikowbnn4h6anegq]{Symbol of Strife}</li>\n</ul>"
    },
    "tags": [],
    "actions": [],
    "attackNotes": [],
    "effectNotes": [],
    "changes": [],
    "contextNotes": [],
    "links": {
      "children": [],
      "charges": []
    },
    "tag": "classFeat_riotSubdomain",
    "useCustomTag": true,
    "armorProf": {
      "value": []
    },
    "weaponProf": {
      "value": []
    },
    "languages": {
      "value": []
    },
    "scriptCalls": [],
    "featType": "classFeat",
    "associations": {
      "classes": [["Cleric"]]
    }
  },
  "ownership": {
    "default": 0
  },
  "_stats": {
    "systemId": "pf1",
    "systemVersion": "0.82.1",
    "coreVersion": "10.285",
    "createdTime": 1663018762886,
    "modifiedTime": 1663018778124,
    "lastModifiedBy": "DbeAbHwpEqczKjsD"
  }
}
