{
  "_id": "DnQK1UZ09ufe1Jmn",
  "name": "Speak with Master",
  "type": "feat",
  "img": "systems/pf1/icons/spells/wild-orange-1.jpg",
  "effects": [],
  "folder": null,
  "sort": 0,
  "flags": {},
  "system": {
    "description": {
      "value": "<p>At 11th level, a hunter and her animal companion can communicate verbally, as if they were using a common language. Other creatures cannot understand the communication without magical aid.</p>"
    },
    "tags": [],
    "actions": [],
    "attackNotes": [],
    "effectNotes": [],
    "changes": [],
    "contextNotes": [],
    "links": {
      "children": [],
      "charges": []
    },
    "tag": "classFeat_speakWithMaster",
    "useCustomTag": true,
    "armorProf": {
      "value": []
    },
    "weaponProf": {
      "value": []
    },
    "languages": {
      "value": []
    },
    "scriptCalls": [],
    "featType": "classFeat",
    "associations": {
      "classes": [["Hunter"]]
    },
    "abilityType": "ex"
  },
  "ownership": {
    "default": 0
  },
  "_stats": {
    "systemId": "pf1",
    "systemVersion": "0.82.1",
    "coreVersion": "10.285",
    "createdTime": 1663018763537,
    "modifiedTime": 1663018778171,
    "lastModifiedBy": "DbeAbHwpEqczKjsD"
  }
}
