{
  "_id": "xJitxeQ04f4ArSme",
  "name": "Cage (Small or medium)",
  "type": "loot",
  "img": "systems/pf1/icons/items/inventory/dice.jpg",
  "effects": [],
  "folder": null,
  "sort": 0,
  "flags": {},
  "system": {
    "description": {
      "value": "<p>Source&nbsp;<a href=\"http://paizo.com/products/btpy8tmc?Pathfinder-Roleplaying-Game-Ultimate-Equipment\" target=\"_blank\" rel=\"noopener\">Ultimate Equipment pg. 81</a>,&nbsp;<a href=\"http://paizo.com/pathfinderRPG/v5748btpy8fo1\" target=\"_blank\" rel=\"noopener\">Advanced Player's Guide pg. 185</a>,&nbsp;<a href=\"http://paizo.com/store/downloads/pathfinder/pathfinderCompanion/pathfinderRPG/v5748btpy8dmf\" target=\"_blank\" rel=\"noopener\">Adventurer's Armory pg. 19</a><br>Price&nbsp;10 gp (Diminutive or Fine), 60 gp (Huge), 30 gp (Large), 15 gp (Small or Medium), 2 gp (Tiny);&nbsp;Weight&nbsp;2 lbs. (Diminutive or Fine), 960 lbs. (Huge), 240 lbs. (Large), 60 lbs. (Small or Medium), 5 lbs. (Tiny)</p>\n<h3>Description</h3>\n<p>This secure, portable enclosure is used to hold creatures— generally animals, but a large enough cage can hold anything. Cages are made from iron, wood, or bamboo, depending on local customs and available materials. One cage holds one animal of that size, or five animals of a smaller size. The weight of the creature adds to the weight of the cage. Cages come in the following sizes: Diminutive or Fine, Tiny, Small, Medium, Large, and Huge. Cages for aquatic creatures cost twice as much, and weigh four times the normal weight when filled with water.</p>"
    },
    "tags": [],
    "weight": {
      "value": 60
    },
    "price": 15,
    "equipped": false,
    "identifiedName": "Cage (Small or medium)",
    "changes": [],
    "contextNotes": [],
    "links": {
      "children": []
    },
    "flags": {
      "boolean": [],
      "dictionary": []
    },
    "scriptCalls": [],
    "subType": "gear"
  },
  "ownership": {
    "default": 0
  },
  "_stats": {
    "systemId": "pf1",
    "systemVersion": "0.82.1",
    "coreVersion": "10.285",
    "createdTime": 1663018753646,
    "modifiedTime": 1663018755717,
    "lastModifiedBy": "DbeAbHwpEqczKjsD"
  }
}
