<svg xmlns='http://www.w3.org/2000/svg'>
	<symbol width='100%' height='100%' viewBox='0 0 109 149' id='machine'>
		<g transform='matrix(1,0,0,1,-1366.25,-1623.28)'>
			<g transform='matrix(4.16667,0,0,4.16667,0,0)'>
				<path
					d='M341.955,398.071L339.922,398.071C339.481,398.071 339.124,397.713 339.124,397.273C339.124,396.832 339.481,396.475 339.922,396.475L341.955,396.475C342.395,396.475 342.753,396.832 342.753,397.273C342.753,397.713 342.395,398.071 341.955,398.071Z' />
				<path
					d='M345.899,420.43C345.51,421.962 345.03,424.76 343.771,424.433C342.947,424.219 343.318,422.739 343.753,419.52C344.036,417.428 341.83,416.206 340.936,415.651L340.933,415.647L340.501,406.477C340.615,406.497 340.732,406.511 340.852,406.518L341.01,406.518C341.134,406.514 341.258,406.497 341.375,406.477C341.961,406.37 342.487,406.065 342.898,405.623C343.237,405.259 343.609,404.928 343.987,404.605C344.861,403.862 345.441,402.881 347.575,398.447C348.092,397.372 349.12,398.112 348.955,398.865C347.669,404.742 345.203,407.619 344.768,408.733C344.25,410.061 343.539,411.825 344.162,413.432C345.143,415.957 347.046,415.918 345.899,420.43Z' />
				<path
					d='M335.977,420.43C336.366,421.962 336.847,424.76 338.107,424.433C338.93,424.219 338.56,422.739 338.124,419.52C337.84,417.428 340.047,416.206 340.941,415.651L340.944,415.647L341.376,406.477C341.262,406.497 341.145,406.511 341.024,406.518L340.867,406.518C340.743,406.514 340.619,406.497 340.502,406.477C339.916,406.37 339.39,406.065 338.979,405.623C338.64,405.259 338.268,404.928 337.889,404.605C337.016,403.862 336.436,402.881 334.302,398.447C333.785,397.372 332.757,398.112 332.921,398.865C334.208,404.742 336.675,407.619 337.108,408.733C337.628,410.061 338.338,411.825 337.714,413.432C336.734,415.957 334.831,415.918 335.977,420.43Z' />
				<path
					d='M340.965,400.563L340.965,400.561L340.9,400.561L340.901,400.563C339.509,400.606 338.471,401.989 338.563,403.574C338.602,404.248 338.843,404.847 339.208,405.303C339.342,405.469 339.409,405.679 339.392,405.892L339.12,409.216L342.745,409.216L342.474,405.892C342.456,405.679 342.523,405.47 342.657,405.303C343.023,404.848 343.263,404.248 343.303,403.574C343.394,401.989 342.357,400.606 340.965,400.563Z' />
				<path
					d='M349.322,400.013L349.123,399.973L346.666,398.941C344.843,398.176 342.916,397.787 340.938,397.787C338.961,397.787 337.033,398.176 335.21,398.941L332.753,399.973C332.491,400.083 332.19,399.959 332.079,399.698C331.97,399.436 332.093,399.134 332.354,399.024L334.812,397.992C336.762,397.173 338.824,396.758 340.938,396.758C343.053,396.758 345.114,397.173 347.064,397.992L349.522,399.024C349.784,399.134 349.907,399.436 349.797,399.698C349.714,399.894 349.523,400.013 349.322,400.013Z' />
				<path
					d='M343.552,417.994L338.325,417.994C337.341,417.994 336.545,417.197 336.545,416.214C336.545,415.231 337.341,415.056 338.325,415.056L343.552,415.056C344.535,415.056 345.332,415.231 345.332,416.214C345.332,417.197 344.535,417.994 343.552,417.994Z' />
				<rect x='340.321' y='416.625' width='1.235' height='7.834' />
				<rect x='340.424' y='390.975' width='1.029' height='6.298' />
				<path
					d='M341.466,425.346L333.245,425.346C332.756,425.346 332.359,424.949 332.359,424.459C332.359,423.97 332.756,423.573 333.245,423.573L341.466,423.573C341.955,423.573 342.352,423.97 342.352,424.459C342.352,424.949 341.955,425.346 341.466,425.346Z' />
				<path
					d='M348.631,425.346L340.411,425.346C339.921,425.346 339.524,424.949 339.524,424.459C339.524,423.97 339.921,423.573 340.411,423.573L348.631,423.573C349.121,423.573 349.518,423.97 349.518,424.459C349.518,424.949 349.121,425.346 348.631,425.346Z' />
				<path
					d='M328.786,420.639C328.297,420.639 327.9,420.242 327.9,419.752L327.9,396.758C327.9,396.535 327.984,396.32 328.135,396.157L333.937,389.873C334.105,389.691 334.341,389.588 334.588,389.588L341.285,389.588C341.775,389.588 342.172,389.984 342.172,390.474C342.172,390.963 341.775,391.36 341.285,391.36L334.977,391.36L329.673,397.104L329.673,419.752C329.673,420.242 329.276,420.639 328.786,420.639Z' />
				<path
					d='M353.09,420.639C352.601,420.639 352.204,420.242 352.204,419.752L352.204,397.104L346.9,391.36L340.591,391.36C340.102,391.36 339.705,390.963 339.705,390.474C339.705,389.984 340.102,389.588 340.591,389.588L347.288,389.588C347.536,389.588 347.772,389.691 347.939,389.873L353.741,396.157C353.892,396.32 353.977,396.535 353.977,396.758L353.977,419.752C353.977,420.242 353.58,420.639 353.09,420.639Z' />
			</g>
		</g>
	</symbol>

	<symbol width='100%' height='100%' viewBox='0 0 151 66' id='exercise'>
		<g transform='matrix(1,0,0,1,-208.638,-268.808)'>
			<g transform='matrix(4.16667,0,0,4.16667,0,0)'>
				<path
					d='M50.862,70.428L51.76,70.428L51.76,74.371L50.862,74.371C50.426,74.371 50.073,74.019 50.073,73.583L50.073,71.217C50.073,70.781 50.426,70.428 50.862,70.428Z' />
				<path
					d='M85.385,70.428L84.487,70.428L84.487,74.371L85.385,74.371L85.526,74.359C85.895,74.293 86.174,73.971 86.174,73.583L86.174,71.217C86.174,70.781 85.821,70.428 85.385,70.428Z' />
				<rect x='61.489' y='70.428' width='13.269' height='3.943' />
				<path
					d='M82.948,66.387L80.754,66.387C80.606,66.387 80.467,66.428 80.35,66.499L80.203,66.615L80.203,78.188C80.345,78.327 80.539,78.413 80.754,78.413L82.948,78.413C83.094,78.413 83.232,78.373 83.35,78.303C83.581,78.166 83.736,77.913 83.736,77.625L83.736,67.176C83.736,66.74 83.383,66.387 82.948,66.387Z' />
				<path
					d='M78.663,64.514L76.297,64.514C76,64.514 75.742,64.678 75.608,64.92L75.607,64.921L75.607,64.922C75.544,65.035 75.509,65.164 75.509,65.303L75.509,79.498C75.509,79.933 75.862,80.286 76.297,80.286L78.663,80.286C79.099,80.286 79.452,79.933 79.452,79.498L79.452,65.303C79.452,64.867 79.099,64.514 78.663,64.514Z' />
				<path
					d='M53.299,66.387C53.129,66.387 52.973,66.44 52.844,66.531L52.842,66.533L52.73,66.63C52.594,66.771 52.511,66.963 52.511,67.176L52.511,77.625C52.511,77.719 52.527,77.81 52.558,77.894C52.668,78.197 52.958,78.413 53.299,78.413L55.492,78.413C55.707,78.413 55.902,78.327 56.044,78.188L56.044,66.612C55.902,66.473 55.707,66.387 55.492,66.387L53.299,66.387Z' />
				<path
					d='M59.949,64.514L57.584,64.514C57.294,64.514 57.041,64.67 56.904,64.901L56.904,64.902C56.835,65.019 56.795,65.156 56.795,65.303L56.795,79.498C56.795,79.933 57.148,80.286 57.584,80.286L59.949,80.286C60.385,80.286 60.738,79.933 60.738,79.498L60.738,65.303C60.738,64.867 60.385,64.514 59.949,64.514Z' />
			</g>
		</g>
	</symbol>

	<symbol width='100%' height='100%' viewBox='0 0 101 113' id='athlete'>
		<g transform='matrix(1,0,0,1,-606.724,-587.477)'>
			<g transform='matrix(4.16667,0,0,4.16667,0,0)'>
				<path
					d='M164.199,143.813L164.243,143.895L164.197,143.809L164.199,143.813ZM168.42,153.585C168.02,151.974 167.548,150.638 167.105,149.515C166.724,148.552 166.244,146.836 166.097,146.485C164.703,143.168 163.327,140.632 161.825,141.037C160.602,141.367 157.445,143.037 157.253,145.019C157.202,145.54 157.336,146.307 158.258,147.007C159.49,147.941 160.196,148.536 160.664,148.931C161.044,149.252 161.277,149.448 161.5,149.567C161.647,150.376 161.485,153.17 161.212,156.193L161.124,156.855C160.904,156.858 160.189,156.426 159.786,156.201C158.073,155.246 155.227,153.659 152.069,156.161C151.466,156.135 150.238,156.036 149.387,156.161C148.86,156.238 147.659,156.635 146.698,157.598C146.345,157.952 145.897,158.684 145.774,159.3C145.671,159.816 145.595,160.487 145.618,161.151L145.62,161.194C145.633,161.51 145.669,161.825 145.737,162.119C146.015,163.32 146.525,164.95 148.068,166.303C149.254,167.343 150.715,167.739 152.409,167.48C152.832,167.416 155.945,168.031 156.362,168.062C157.842,168.173 161.077,167.162 162.495,166.321C163.178,165.916 164.234,165.88 165.122,165.713C166.736,165.409 168.565,165.064 169.44,163.196C169.57,162.92 169.653,162.574 169.696,162.139C169.893,160.105 169.111,156.365 168.42,153.585Z' />
			</g>
		</g>
	</symbol>

	<symbol id='add-user' width='24' height='24' viewBox='0 0 24 24'>
		<path
			d='M15,14C12.33,14 7,15.33 7,18V20H23V18C23,15.33 17.67,14 15,14M6,10V7H4V10H1V12H4V15H6V12H9V10M15,12A4,4 0 0,0 19,8A4,4 0 0,0 15,4A4,4 0 0,0 11,8A4,4 0 0,0 15,12Z' />
	</symbol>

	<symbol id='plus' width='24' height='24' viewBox='0 0 24 24'>
		<path d='M19,13H13V19H11V13H5V11H11V5H13V11H19V13Z' />
	</symbol>

	<symbol id='plus-circle' width='24' height='24' viewBox='0 0 24 24'>
		<path
			d='M17,13H13V17H11V13H7V11H11V7H13V11H17M12,2A10,10 0 0,0 2,12A10,10 0 0,0 12,22A10,10 0 0,0 22,12A10,10 0 0,0 12,2Z' />
	</symbol>

	<symbol id='nutrition' enable-background='new 0 0 512 512' height='512' viewBox='0 0 512 512' width='512'>
		<path
			d='m293.396 151.209h-126.295c-4.151 0-7.515 3.365-7.515 7.515s3.364 7.515 7.515 7.515h126.295c4.151 0 7.515-3.365 7.515-7.515 0-4.151-3.364-7.515-7.515-7.515z' />
		<path
			d='m167.101 193.203h70.984c4.151 0 7.515-3.365 7.515-7.515s-3.364-7.515-7.515-7.515h-70.984c-4.151 0-7.515 3.365-7.515 7.515.001 4.15 3.365 7.515 7.515 7.515z' />
		<path
			d='m129.28 148.141-27.66 28.363-11.966-11.636c-2.975-2.894-7.733-2.826-10.626.148-2.893 2.976-2.827 7.733.149 10.627l17.345 16.868c2.932 2.853 7.763 2.786 10.618-.141l32.899-33.736c2.898-2.971 2.839-7.729-.133-10.627-2.974-2.898-7.729-2.836-10.626.134z' />
		<path
			d='m293.396 227.742h-126.295c-4.151 0-7.515 3.364-7.515 7.515 0 4.15 3.364 7.515 7.515 7.515h126.295c4.151 0 7.515-3.365 7.515-7.515s-3.364-7.515-7.515-7.515z' />
		<path
			d='m238.085 254.706h-70.984c-4.151 0-7.515 3.364-7.515 7.515s3.364 7.515 7.515 7.515h70.984c4.151 0 7.515-3.365 7.515-7.515s-3.364-7.515-7.515-7.515z' />
		<path
			d='m129.28 224.675-27.66 28.363-11.966-11.636c-2.977-2.894-7.733-2.826-10.626.149s-2.827 7.733.149 10.626l17.345 16.867c2.932 2.853 7.763 2.786 10.618-.141l32.899-33.735c2.898-2.971 2.839-7.729-.133-10.627s-7.729-2.837-10.626.134z' />
		<path
			d='m129.28 301.208-27.66 28.363-11.966-11.636c-2.975-2.894-7.733-2.826-10.626.149s-2.827 7.733.149 10.626l17.345 16.867c2.932 2.853 7.763 2.786 10.618-.141l32.899-33.735c2.898-2.971 2.839-7.729-.133-10.627-2.972-2.897-7.729-2.836-10.626.134z' />
		<path
			d='m129.28 377.742-27.66 28.363-11.966-11.636c-2.975-2.894-7.733-2.826-10.626.148-2.893 2.975-2.827 7.733.149 10.627l17.345 16.868c2.932 2.853 7.763 2.786 10.618-.141l32.899-33.735c2.898-2.971 2.839-7.729-.133-10.627-2.972-2.9-7.729-2.838-10.626.133z' />
		<path
			d='m439.411 261.963c15.895-23.915 12.319-56.822 12.138-58.378-.402-3.464-3.135-6.197-6.599-6.599-1.748-.202-43.095-4.696-66.772 18.982-1.284 1.284-2.464 2.633-3.587 4.012v-52.028c0-4.15-3.364-7.515-7.515-7.515s-7.515 3.364-7.515 7.515v71.69c-5.014-7.934-11.699-15.893-20.595-23.124v-131.434c0-4.15-3.364-7.515-7.515-7.515h-52.399v-21.012h68.559c6.589 0 11.949 5.361 11.949 11.949v69.387c0 4.15 3.364 7.515 7.515 7.515s7.515-3.365 7.515-7.515v-69.386c0-14.876-12.103-26.978-26.978-26.978h-70.029c-3.005-7.482-10.322-12.786-18.866-12.786h-24.872v-11.054c.002-9.754-7.934-17.689-17.687-17.689h-47.288c-9.754 0-17.69 7.935-17.69 17.689v11.053h-24.87c-8.545 0-15.861 5.303-18.866 12.786h-70.029c-14.876 0-26.978 12.102-26.978 26.978v416.316c0 14.876 12.103 26.978 26.978 26.978h294.589c12.687 1.049 24.697-2.738 35.071-11.198 9.218 7.525 19.73 11.396 30.95 11.396 2.182 0 4.392-.147 6.623-.441 25.154-3.322 50.412-24.822 69.298-58.988 2.008-3.632.692-8.204-2.941-10.212-3.63-2.007-8.204-.691-10.211 2.941-16.312 29.508-38.036 48.708-58.112 51.359-11.262 1.484-21.414-2.377-30.197-11.479-2.913-3.017-7.902-3.018-10.815 0-11.174 11.581-24.4 14.671-39.317 9.18-17.019-6.265-34.543-23.551-48.08-47.428-14.966-26.397-24.364-59.519-26.465-93.264-1.387-22.281 4.856-40.969 18.553-55.544 18.304-19.479 50.189-31.425 88.639-33.486.702 2.042 1.356 4.116 1.919 6.25 2.481 9.4 3.034 17.776 3.04 23.336-13.938-1.925-23.036-8.842-23.116-8.904-3.256-2.573-7.982-2.021-10.555 1.235s-2.021 7.982 1.236 10.555c.653.516 16.256 12.637 39.546 12.639.005 0 .011.001.016.001.013 0 .025-.002.038-.002 23.268-.017 38.853-12.123 39.505-12.639 3.731-2.948 3.732-8.757.033-11.732 7.626-2.39 15.276-6.014 21.93-11.444 50.586 17.823 59.416 53.007 57.753 79.733-1.423 22.852-5.979 44.81-13.542 65.263-1.365 3.692.443 7.926 4.051 9.496 3.906 1.7 8.57-.293 10.045-4.284 8.072-21.829 12.932-45.227 14.446-69.542 2.674-42.967-19.24-75.519-61.934-92.634zm-318.407-212.885c0-2.926 2.381-5.306 5.306-5.306h32.385c4.151 0 7.515-3.364 7.515-7.515v-18.568c0-1.467 1.194-2.66 2.66-2.66h47.288c1.467 0 2.66 1.193 2.66 2.66v18.568c0 4.15 3.364 7.515 7.515 7.515h32.386c2.926 0 5.306 2.38 5.306 5.306v35.288c0 2.926-2.381 5.307-5.306 5.307h-132.409c-2.926 0-5.306-2.381-5.306-5.307zm134.405 238.753c-4.784 5.091-8.795 10.586-12.08 16.445h-76.227c-4.151 0-7.515 3.364-7.515 7.515 0 4.15 3.364 7.515 7.515 7.515h69.706c-1.228 3.852-2.204 7.827-2.893 11.935h-66.813c-4.151 0-7.515 3.365-7.515 7.515s3.364 7.515 7.515 7.515h65.516c-.033 2.733.015 5.504.191 8.331.552 8.874 1.559 17.626 2.988 26.208h-68.695c-4.151 0-7.515 3.365-7.515 7.515s3.364 7.515 7.515 7.515h71.683c.931 4.027 1.952 8.009 3.077 11.935h-74.76c-4.151 0-7.515 3.365-7.515 7.515s3.364 7.515 7.515 7.515h79.651c4.028 11.086 8.844 21.659 14.447 31.541 1.238 2.183 2.507 4.309 3.799 6.387h-203.91v-157.284c0-4.15-3.364-7.515-7.515-7.515s-7.515 3.365-7.515 7.515v164.796c0 4.15 3.364 7.515 7.515 7.515h221.946c6.585 8.325 13.63 15.391 20.949 21.012h-259.054c-6.589 0-11.949-5.361-11.949-11.949v-416.316c0-6.589 5.36-11.949 11.949-11.949h68.559v21.012h-52.4c-4.151 0-7.515 3.364-7.515 7.515v188.305c0 4.15 3.364 7.515 7.515 7.515s7.515-3.365 7.515-7.515v-180.791h46.643c3.168 7.119 10.296 12.103 18.578 12.103h132.408c8.282 0 15.41-4.983 18.578-12.103h46.642v113.917c-3.296-1.07-7 .256-8.81 3.372-2.085 3.589-.867 8.188 2.721 10.273 2.113 1.228 4.131 2.528 6.089 3.874v29.39c-28.867 5.84-52.819 17.687-68.529 34.406zm83.559-36.84v-13.833c3.568 3.975 6.695 8.268 9.377 12.875-3.169.254-6.295.575-9.377.958zm36.027 43.12c-.002-1.322-.031-2.762-.099-4.311.264.002.511.007.784.007 4.394 0 9.941-.248 16.007-1.104-3.902 1.994-9.651 4.326-16.692 5.408zm-1.197-19.372c-.19-11.114 1.228-34.362 15.009-48.143 13.781-13.783 37.061-15.199 48.141-15.009.191 11.113-1.227 34.362-15.008 48.143-13.782 13.782-37.019 15.194-48.142 15.009z' />
	</symbol>

	<symbol width='100%' height='100%' viewBox='0 0 1783 1971' id='physical'>
		<path
			d='M1744.9,414.031c-21.583,-95.625 -97.583,-170.166 -193.625,-189.791c-16.959,-3.584 -33.417,7.416 -36.917,24.333c-3.458,16.958 7.5,33.458 24.375,36.958c72.042,14.708 129.042,70.584 145.167,142.25c3.333,14.542 16.166,24.417 30.458,24.417c2.292,-0.042 4.625,-0.25 6.917,-0.792c16.833,-3.792 27.416,-20.5 23.625,-37.375Z' />
		<path
			d='M1594.4,84.656c-0.167,-11.458 -6.667,-21.875 -16.792,-27.167c-10.167,-5.291 -22.375,-4.666 -31.875,1.709c-63.708,42.667 -146.292,66.167 -232.416,66.167c-117.167,-0 -225.338,-43.126 -289.38,-115.334c-11.829,-13.375 -34.87,-13.375 -46.704,0c-64,72.208 -172.154,115.334 -289.304,115.334c-73.954,-0 -144.442,-16.959 -203.934,-49c-9.637,-5.209 -21.295,-4.959 -30.754,0.541c-9.375,5.542 -15.249,15.667 -15.4,26.625c0,7.25 -0.054,14.542 -0.054,21.834c0,117.749 33.859,177.041 66.638,234.333c13.525,23.708 26.287,46.125 36.562,72.625c4.763,12.375 16.629,20 29.163,20c3.741,-0 7.533,-0.667 11.262,-2.125c16.121,-6.209 24.1,-24.334 17.896,-40.417c-11.954,-30.875 -26.512,-56.417 -40.571,-81.083c-27.141,-47.5 -52.966,-92.625 -57.662,-175.5c57.383,22.791 121.042,34.708 186.854,34.708c121.675,0 235.887,-41.541 312.633,-112.458c76.754,70.917 191.046,112.458 312.755,112.458c77.999,0 153.833,-17.125 218.666,-48.833c-2.458,92.042 -29.583,139.5 -58.25,189.625c-14.041,24.625 -28.541,50.041 -40.541,80.916c-6.167,16.084 1.833,34.209 17.916,40.417c16.125,6.209 34.209,-1.791 40.459,-17.875c10.249,-26.458 22.999,-48.75 36.499,-72.416c32.709,-57.334 66.626,-116.626 66.626,-234.375c-0,-13.667 -0.084,-27.251 -0.292,-40.709Z' />
		<path
			d='M1570.35,789.198c-10.25,-15.125 -20,-29.75 -29.375,-44.125c-9.375,-14.5 -28.833,-18.583 -43.25,-9.208c-14.5,9.375 -18.625,28.75 -9.25,43.249c9.5,14.626 19.542,29.501 29.875,44.959c89.708,133.792 201.458,300.333 201.458,614.583c0,169.625 -43.583,331.375 -126.041,469.084l-468.042,-0l0,-62.542c0,-17.25 -14.083,-31.25 -31.333,-31.25l-125.042,-0c-17.292,-0 -31.25,14 -31.25,31.25l-0,62.542l-468.117,-0c-82.475,-137.709 -126.066,-299.459 -126.066,-469.084c-0,-315.125 100.7,-481.833 181.579,-615.833l14.879,-24.708c8.858,-14.875 4.038,-34.084 -10.775,-42.959c-14.792,-8.833 -34.05,-4.041 -42.9,10.792l-14.762,24.542c-80.405,133.208 -190.529,315.666 -190.529,648.166c-0,187.459 50,366.167 144.587,516.959c5.729,9.125 15.729,14.625 26.517,14.625l516.796,-0c17.249,-0 31.245,-14 31.245,-31.292l0,-62.5l62.546,-0l-0,62.5c-0,17.292 13.996,31.292 31.292,31.292l516.791,-0c10.792,-0 20.792,-5.5 26.542,-14.625c94.583,-150.792 144.625,-329.5 144.625,-516.959c-0,-333.333 -122.583,-516.042 -212,-649.458Z' />
		<path
			d='M1168.85,1648.57c-31.125,53.958 -58.666,109.458 -82.041,165.333l-109.501,0c-23.333,-55.875 -50.916,-111.375 -82.083,-165.333c-140.304,-243.083 -337.346,-426 -520.8,-485.625c2.383,-9.708 4.854,-19.333 7.442,-28.917c185.808,56.167 398.9,85.75 618.733,85.75c242.417,0 473.833,-35.458 671.542,-102.666c5.083,15.416 9.75,31.125 14,47c-182.375,60.875 -378.042,243.333 -517.292,484.458Zm585.25,-470.209c-8.875,-38.166 -20.042,-75.833 -33.375,-111.958c-5.917,-16.208 -23.833,-24.458 -40.042,-18.625c-197.375,71.583 -432.583,109.458 -680.129,109.458c-225.55,0 -443.516,-31.958 -630.187,-92.333c-7.958,-2.583 -16.629,-1.833 -24.017,2c-7.442,3.834 -13.042,10.542 -15.488,18.5c-9.328,30.334 -17.433,61.542 -24.033,92.875c-3.433,16.375 6.659,32.584 22.934,36.709c175.704,44.791 371.629,222.958 511.308,464.875c33.321,57.708 62.363,117.208 86.196,176.916c4.75,11.834 16.291,19.625 29.041,19.625l151.459,0c12.791,0 24.25,-7.791 29.042,-19.666c23.916,-59.667 52.958,-119.209 86.208,-176.917c138.792,-240.292 333.667,-418.167 508.583,-464.167c16.417,-4.25 26.375,-20.791 22.5,-37.292Z' />
		<path
			d='M1404.52,750.739l-1341.99,0l-0,-281.458l1625.99,0c-1.375,155.417 -128.208,281.458 -284,281.458Zm315.291,-343.958l-1688.55,0c-17.259,0 -31.267,14 -31.267,31.25l0,344c0,17.209 14.008,31.25 31.267,31.25l1373.25,0c191.125,0 346.541,-155.458 346.541,-346.5l0,-28.75c0,-17.25 -14.041,-31.25 -31.25,-31.25Z' />
		<path
			d='M218.871,438.031c-17.288,0 -31.263,14 -31.263,31.25l0,125.083c0,17.251 13.975,31.292 31.263,31.292c17.258,0 31.241,-14.041 31.241,-31.292l0,-125.083c0,-17.25 -13.983,-31.25 -31.241,-31.25Z' />
		<path
			d='M375.217,438.031c-17.292,0 -31.296,14 -31.296,31.25l-0,187.625c-0,17.25 14.004,31.292 31.296,31.292c17.254,-0 31.241,-14.042 31.241,-31.292l0,-187.625c0,-17.25 -13.987,-31.25 -31.241,-31.25Z' />
		<path
			d='M531.592,438.031c-17.292,0 -31.279,14 -31.279,31.25l-0,125.083c-0,17.251 13.987,31.292 31.279,31.292c17.191,0 31.262,-14.041 31.262,-31.292l0,-125.083c0,-17.25 -14.071,-31.25 -31.262,-31.25Z' />
		<path
			d='M687.925,438.031c-17.263,0 -31.267,14 -31.267,31.25l0,187.625c0,17.25 14.004,31.292 31.267,31.292c17.267,-0 31.275,-14.042 31.275,-31.292l-0,-187.625c-0,-17.25 -14.008,-31.25 -31.275,-31.25Z' />
		<path
			d='M844.233,438.031c-17.258,0 -31.266,14 -31.266,31.25l-0,125.083c-0,17.251 14.008,31.292 31.266,31.292c17.3,0 31.275,-14.041 31.275,-31.292l0,-125.083c0,-17.25 -13.975,-31.25 -31.275,-31.25Z' />
		<path
			d='M1000.56,438.031c-17.246,0 -31.245,14 -31.245,31.25l-0,187.625c-0,17.25 13.999,31.292 31.245,31.292c17.296,-0 31.296,-14.042 31.296,-31.292l-0,-187.625c-0,-17.25 -14,-31.25 -31.296,-31.25Z' />
		<path
			d='M1156.94,438.031c-17.25,0 -31.208,14 -31.208,31.25l0,125.083c0,17.251 13.958,31.292 31.208,31.292c17.25,0 31.292,-14.041 31.292,-31.292l0,-125.083c0,-17.25 -14.042,-31.25 -31.292,-31.25Z' />
		<path
			d='M1313.31,438.031c-17.292,0 -31.292,14 -31.292,31.25l-0,187.625c-0,17.25 14,31.292 31.292,31.292c17.25,-0 31.25,-14.042 31.25,-31.292l-0,-187.625c-0,-17.25 -14,-31.25 -31.25,-31.25Z' />
		<path
			d='M1469.65,438.031c-17.292,0 -31.292,14 -31.292,31.25l0,125.083c0,17.251 14,31.292 31.292,31.292c17.25,0 31.25,-14.041 31.25,-31.292l-0,-125.083c-0,-17.25 -14,-31.25 -31.25,-31.25Z' />
	</symbol>

	<symbol id='repeat' viewBox='0 0 511.979 511.979'>
		<g>
			<g>
				<g>
					<path d='M341.552,85.334c-0.077-0.001-0.152-0.012-0.229-0.012H222.159l27.582-27.582c8.331-8.331,8.331-21.839,0-30.17
				c-8.331-8.331-21.839-8.331-30.17,0l-64,64c-0.497,0.497-0.967,1.02-1.413,1.563c-0.202,0.246-0.378,0.506-0.568,0.759
				c-0.228,0.304-0.463,0.601-0.674,0.917c-0.203,0.303-0.379,0.618-0.564,0.929c-0.171,0.286-0.351,0.566-0.509,0.861
				c-0.169,0.317-0.313,0.643-0.465,0.966c-0.145,0.308-0.299,0.611-0.43,0.926c-0.13,0.314-0.235,0.635-0.349,0.953
				c-0.122,0.338-0.251,0.672-0.356,1.018c-0.096,0.318-0.167,0.642-0.248,0.964c-0.089,0.353-0.188,0.701-0.259,1.061
				c-0.074,0.372-0.118,0.748-0.171,1.122c-0.045,0.314-0.104,0.622-0.136,0.94c-0.068,0.693-0.105,1.388-0.105,2.084
				c0,0.007-0.001,0.014-0.001,0.021c0,0.008,0.001,0.015,0.001,0.023c0.001,0.695,0.037,1.39,0.105,2.082
				c0.031,0.318,0.091,0.627,0.136,0.941c0.054,0.375,0.097,0.75,0.171,1.122c0.071,0.36,0.17,0.708,0.259,1.061
				c0.081,0.322,0.151,0.645,0.248,0.963c0.105,0.346,0.235,0.68,0.356,1.019c0.114,0.318,0.219,0.638,0.348,0.951
				c0.131,0.316,0.285,0.619,0.43,0.927c0.152,0.323,0.296,0.649,0.465,0.965c0.158,0.295,0.338,0.576,0.51,0.862
				c0.185,0.31,0.361,0.625,0.564,0.928c0.212,0.317,0.448,0.615,0.676,0.919c0.189,0.252,0.364,0.512,0.566,0.757
				c0.446,0.544,0.916,1.067,1.413,1.564l64,64c8.331,8.331,21.839,8.331,30.17,0c8.331-8.331,8.331-21.839,0-30.17l-27.582-27.582
				h118.984c0.057,0,0.112,0.009,0.169,0.009c70.778,0,128,57.222,128,128c0,31.068-12.408,60.299-34.121,82.031
				c-8.328,8.335-8.322,21.842,0.013,30.17c8.335,8.328,21.842,8.322,30.17-0.013c29.612-29.637,46.605-69.67,46.605-112.188
				C511.979,161.736,435.783,85.464,341.552,85.334z' />
					<path d='M358.39,418.083c0.227-0.303,0.462-0.6,0.673-0.915c0.203-0.304,0.379-0.619,0.565-0.931
				c0.171-0.286,0.35-0.565,0.507-0.859c0.17-0.318,0.314-0.645,0.467-0.97c0.145-0.306,0.298-0.608,0.428-0.922
				c0.13-0.315,0.236-0.637,0.35-0.957c0.121-0.337,0.25-0.669,0.354-1.013c0.097-0.32,0.168-0.646,0.249-0.969
				c0.089-0.351,0.187-0.698,0.258-1.055c0.074-0.375,0.118-0.753,0.173-1.13c0.044-0.311,0.104-0.617,0.135-0.932
				c0.138-1.4,0.138-2.811,0-4.211c-0.031-0.316-0.09-0.622-0.135-0.933c-0.054-0.377-0.098-0.755-0.172-1.13
				c-0.071-0.358-0.169-0.705-0.258-1.056c-0.081-0.323-0.152-0.648-0.249-0.968c-0.104-0.345-0.234-0.677-0.355-1.014
				c-0.115-0.32-0.22-0.642-0.35-0.957c-0.13-0.314-0.283-0.615-0.428-0.921c-0.153-0.325-0.297-0.653-0.468-0.971
				c-0.157-0.293-0.336-0.572-0.506-0.857c-0.186-0.312-0.363-0.628-0.566-0.932c-0.211-0.315-0.445-0.611-0.671-0.913
				c-0.191-0.255-0.368-0.516-0.571-0.764c-0.439-0.535-0.903-1.05-1.392-1.54c-0.007-0.008-0.014-0.016-0.021-0.023l-64-64
				c-8.331-8.331-21.839-8.331-30.17,0c-8.331,8.331-8.331,21.839,0,30.17l27.582,27.582H170.836c-0.057,0-0.112-0.009-0.169-0.009
				c-70.778,0-128-57.222-128-128c0-31.068,12.408-60.299,34.121-82.031c8.328-8.335,8.322-21.842-0.013-30.17
				c-8.335-8.328-21.842-8.322-30.17,0.013C16.993,173.43,0,213.463,0,255.981c0,94.262,76.196,170.534,170.427,170.664
				c0.077,0.001,0.152,0.012,0.229,0.012h119.163l-27.582,27.582c-8.331,8.331-8.331,21.839,0,30.17
				c8.331,8.331,21.839,8.331,30.17,0l64-64c0.004-0.004,0.007-0.008,0.011-0.012c0.492-0.493,0.959-1.012,1.402-1.551
				C358.024,418.597,358.2,418.337,358.39,418.083z' />
				</g>
			</g>
		</g>
		<g>
		</g>
		<g>
		</g>
		<g>
		</g>
		<g>
		</g>
		<g>
		</g>
		<g>
		</g>
		<g>
		</g>
		<g>
		</g>
		<g>
		</g>
		<g>
		</g>
		<g>
		</g>
		<g>
		</g>
		<g>
		</g>
		<g>
		</g>
		<g>
		</g>
	</symbol>
	<symbol height="512" viewBox="0 0 60 60" width="512" id="kcal">
		<g id="Page-1" fill="none" fill-rule="evenodd">
			<g id="028---Calorie-Counting" fill="rgb(0,0,0)" fill-rule="nonzero" transform="translate(-1)">
				<path id="Shape"
					d="m48.271 24.287c.2074862.505671.7825371.7510649 1.2911876.5509939.5086504-.200071.7624254-.7714728.5698124-1.2829939-3.846-9.789-13.4-15.183-23.252-13.126-.5406868.1132184-.8872184.6433132-.774 1.184s.6433132.8872184 1.184.774c7.257-1.519 16.917 1.557 20.981 11.9z" />
				<path id="Shape"
					d="m21 55c2.209139 0 4-1.790861 4-4 0-29 0-15.046 0-19v-21c0-1.1045695-.8954305-2-2-2-4.43 0-6 4.187-6 16v26c0 2.209139 1.790861 4 4 4zm0-2c-1.1045695 0-2-.8954305-2-2v-18h4v18c0 1.1045695-.8954305 2-2 2zm2-42c0 21.956.019 18.632-.045 20h-3.955v-6c0-14 2.5-14 4-14z" />
				<path id="Shape"
					d="m58.362 50.135c-.4771245-.2735823-1.0856239-.1105116-1.362.365-2.6811195 4.6417735-7.6345463 7.5010008-12.995 7.5010008s-10.3138805-2.8592273-12.995-7.5010008c-.2843876-.4596821-.882589-.61017-1.3506397-.3397768s-.6365131.8637835-.3803603 1.3397768c1.4757571 2.5392332 3.582051 4.6544827 6.115 6.141-8.0318917 1.2958656-16.2282113-.9935193-22.426-6.264.058-.611.037 2.165.037-23.8 1.8209544-.7928309 2.9975604-2.5909363 2.995-4.577v-11c-.0008847-.8953435-.4016309-1.7434968-1.0927404-2.31271419-.6911096-.56921734-1.6003409-.7999985-2.4792596-.62928581 5.5987895-4.97378781 12.9583321-7.49458832 20.4308423-6.99799983s14.4337661 3.96908307 19.3251577 9.63999983c5.3960604 6.2305042 7.7624687 14.5273916 6.465 22.667-3.0704039-5.2105581-8.6771085-8.3983875-14.7249686-8.372242-6.0478602.0261456-11.6267931 3.2623317-14.6520314 8.499242-.2561528.4759933-.0876904 1.0693836.3803603 1.3397768s1.0662521.1199053 1.3506397-.3397768c2.9078648-5.0405546 8.4686653-7.9444526 14.2668236-7.4502585 5.7981584.4941941 10.7873016 4.2972948 12.8001764 9.7572585.1526352.4053694.548898.666385.981598.6465719.4327001-.0198131.8034512-.3159499.918402-.7335719 3.5023609-13.1690117-2.3158123-27.0436553-14.1634962-33.77580117-11.847684-6.73214585-26.7450638-4.6285898-36.2655038 5.12080117-.06-.011-.121-.03-.182-.037-.21851735-.02977677-.43989944-.03212832-.659-.007-.63648987.06469044-1.2351328.33297506-1.707.765-.87831363-.78772617-2.13734737-.98619967-3.21539848-.50687392-1.0780511.47932575-1.77409556 1.54707092-1.77760152 2.72687392v10.212c-2.05074036 7.6791824-.97185004 15.8582498 3 22.743v6.045c.0011531 1.6169625.97570796 3.0741968 2.46965154 3.6928256 1.49394357.6186287 3.21340686.2769633 4.35734846-.8658256.1395313-.1460862.2682069-.3021681.385-.467 7.3484304 5.9434794 17.0766116 8.0575757 26.229 5.7 7.699597 2.6613748 16.2052525-.5085909 20.285-7.56.2757855-.4775341.112943-1.0881935-.364-1.365zm-54.362-38.135c0-.5522847.44771525-1 1-1s1 .4477153 1 1v8c0 .5522847.44771525 1 1 1s1-.4477153 1-1v-8c.00770083-.5221272.40885164-.9539365.929-1h.165c.51281216.0535412.90317758.4844081.906 1v8c0 .5522847.4477153 1 1 1s1-.4477153 1-1v-8c.0034062-.3856682.2282972-.7350008.577955-.8977614.3496577-.1627607.7617482-.1099339 1.059045.1357614.0241531.0239521.0495198.0466487.076.068.1854514.1830903.2889672.4334037.287.694v11c0 1.6568542-1.3431458 3-3 3h-4c-1.65685425 0-3-1.3431458-3-3zm-.754 14.286c.48031022.5573237 1.0797516.999557 1.754 1.294v12.81c-1.79373736-4.4707446-2.39805434-9.330087-1.754-14.104zm5.754 26.714c-1.1045695 0-2-.8954305-2-2v-23h4v23c0 1.1045695-.8954305 2-2 2z" />
				<path id="Shape"
					d="m35.781 38.375c-.1657145-.2072013-.4069781-.3400545-.670678-.3693128-.2636998-.0292583-.5282179.0474769-.735322.2133128l-3.375 2.7v-1.919c0-.5522847-.4477153-1-1-1s-1 .4477153-1 1v8c0 .5522847.4477153 1 1 1s1-.4477153 1-1v-1.919l3.375 2.7c.2790244.223291.655978.2807626.9888658.1507659.3328879-.1299968.5711366-.4277123.625-.781.0538635-.3532878-.0848414-.7084749-.3638658-.9317659l-4.025-3.219 4.024-3.219c.2073518-.1655696.3403985-.406761.369845-.6704672.0294466-.2637061-.0471215-.528304-.212845-.7355328z" />
				<path id="Shape"
					d="m40 40h1c.5522847 0 1 .4477153 1 1s.4477153 1 1 1 1-.4477153 1-1c0-1.6568542-1.3431458-3-3-3h-1c-1.6568542 0-3 1.3431458-3 3v4c0 1.6568542 1.3431458 3 3 3h1c1.6568542 0 3-1.3431458 3-3 0-.5522847-.4477153-1-1-1s-1 .4477153-1 1-.4477153 1-1 1h-1c-.5522847 0-1-.4477153-1-1v-4c0-.5522847.4477153-1 1-1z" />
				<path id="Shape"
					d="m49 38c-.4171213-.0002605-.7905905.2584177-.937.649l-3 8c-.125043.3347579-.0619962.7107965.1653911.9864658s.5845697.4090886.937.35c.3524303-.0590885.6465659-.3017079.7716089-.6364658l.506-1.349h3.114l.506 1.351c.1932997.5174908.7695092.7802996 1.287.5869999.5174908-.1932996.7802996-.7695091.587-1.2869999l-3-8c-.1457526-.3913699-.5193707-.6509487-.937-.651zm-.807 6 .807-2.152.807 2.152z" />
				<path id="Shape"
					d="m60 46h-4v-7c0-.5522847-.4477153-1-1-1s-1 .4477153-1 1v8c0 .5522847.4477153 1 1 1h5c.5522847 0 1-.4477153 1-1s-.4477153-1-1-1z" />
			</g>
		</g>
	</symbol>

</svg>