<?xml version="1.0" encoding="UTF-8" standalone="no"?>
<!-- Created with Inkscape (http://www.inkscape.org/) -->

<svg
   xmlns:dc="http://purl.org/dc/elements/1.1/"
   xmlns:cc="http://creativecommons.org/ns#"
   xmlns:rdf="http://www.w3.org/1999/02/22-rdf-syntax-ns#"
   xmlns:svg="http://www.w3.org/2000/svg"
   xmlns="http://www.w3.org/2000/svg"
   xmlns:xlink="http://www.w3.org/1999/xlink"
   xmlns:sodipodi="http://sodipodi.sourceforge.net/DTD/sodipodi-0.dtd"
   xmlns:inkscape="http://www.inkscape.org/namespaces/inkscape"
   width="242.782"
   height="345.16873"
   id="svg2"
   sodipodi:version="0.32"
   inkscape:version="0.91 r13725"
   sodipodi:docname="fig1F.svg"
   inkscape:output_extension="org.inkscape.output.svg.inkscape"
   version="1.0">
  <defs
     id="defs4">
    <marker
       inkscape:stockid="Arrow2Mend"
       orient="auto"
       refY="0"
       refX="0"
       id="Arrow2Mend"
       style="overflow:visible">
      <path
         id="path3869"
         style="font-size:12px;fill-rule:evenodd;stroke-width:0.625;stroke-linejoin:round"
         d="M 8.7185878,4.0337352 L -2.2072895,0.016013256 L 8.7185884,-4.0017078 C 6.97309,-1.6296469 6.9831476,1.6157441 8.7185878,4.0337352 z"
         transform="scale(-0.6,-0.6)" />
    </marker>
    <marker
       inkscape:stockid="Arrow2Lend"
       orient="auto"
       refY="0"
       refX="0"
       id="Arrow2Lend"
       style="overflow:visible">
      <path
         id="path3185"
         style="font-size:12px;fill-rule:evenodd;stroke-width:0.625;stroke-linejoin:round"
         d="M 8.7185878,4.0337352 L -2.2072895,0.016013256 L 8.7185884,-4.0017078 C 6.97309,-1.6296469 6.9831476,1.6157441 8.7185878,4.0337352 z"
         transform="matrix(-1.1,0,0,-1.1,-1.1,0)" />
    </marker>
    <marker
       inkscape:stockid="Arrow2Mstart"
       orient="auto"
       refY="0"
       refX="0"
       id="Arrow2Mstart"
       style="overflow:visible">
      <path
         id="path3188"
         style="font-size:12px;fill-rule:evenodd;stroke-width:0.625;stroke-linejoin:round"
         d="M 8.7185878,4.0337352 L -2.2072895,0.016013256 L 8.7185884,-4.0017078 C 6.97309,-1.6296469 6.9831476,1.6157441 8.7185878,4.0337352 z"
         transform="scale(0.6,0.6)" />
    </marker>
    <marker
       inkscape:stockid="Arrow2Lstart"
       orient="auto"
       refY="0"
       refX="0"
       id="Arrow2Lstart"
       style="overflow:visible">
      <path
         id="path3182"
         style="font-size:12px;fill-rule:evenodd;stroke-width:0.625;stroke-linejoin:round"
         d="M 8.7185878,4.0337352 L -2.2072895,0.016013256 L 8.7185884,-4.0017078 C 6.97309,-1.6296469 6.9831476,1.6157441 8.7185878,4.0337352 z"
         transform="matrix(1.1,0,0,1.1,1.1,0)" />
    </marker>
    <marker
       inkscape:stockid="Arrow1Lstart"
       orient="auto"
       refY="0"
       refX="0"
       id="Arrow1Lstart"
       style="overflow:visible">
      <path
         id="path3164"
         d="M 0,0 L 5,-5 L -12.5,0 L 5,5 L 0,0 z"
         style="fill-rule:evenodd;stroke:#000000;stroke-width:1pt;marker-start:none"
         transform="matrix(0.8,0,0,0.8,10,0)" />
    </marker>
    <marker
       inkscape:stockid="Arrow1Mstart"
       orient="auto"
       refY="0"
       refX="0"
       id="Arrow1Mstart"
       style="overflow:visible">
      <path
         id="path3170"
         d="M 0,0 L 5,-5 L -12.5,0 L 5,5 L 0,0 z"
         style="fill-rule:evenodd;stroke:#000000;stroke-width:1pt;marker-start:none"
         transform="matrix(0.4,0,0,0.4,4,0)" />
    </marker>
    <marker
       inkscape:stockid="Arrow1Send"
       orient="auto"
       refY="0"
       refX="0"
       id="Arrow1Send"
       style="overflow:visible">
      <path
         id="path3179"
         d="M 0,0 L 5,-5 L -12.5,0 L 5,5 L 0,0 z"
         style="fill-rule:evenodd;stroke:#000000;stroke-width:1pt;marker-start:none"
         transform="matrix(-0.2,0,0,-0.2,-1.2,0)" />
    </marker>
    <marker
       inkscape:stockid="Arrow1Lend"
       orient="auto"
       refY="0"
       refX="0"
       id="Arrow1Lend"
       style="overflow:visible">
      <path
         id="path3167"
         d="M 0,0 L 5,-5 L -12.5,0 L 5,5 L 0,0 z"
         style="fill-rule:evenodd;stroke:#000000;stroke-width:1pt;marker-start:none"
         transform="matrix(-0.8,0,0,-0.8,-10,0)" />
    </marker>
    <pattern
       inkscape:collect="always"
       xlink:href="#pattern6780"
       id="pattern6799"
       patternTransform="matrix(1.7613378,0,0,1.7613378,130,608.36218)" />
    <pattern
       inkscape:collect="always"
       xlink:href="#pattern6769"
       id="pattern6783"
       patternTransform="matrix(3.0683044e-2,-3.1001006e-2,1.771486e-2,5.3695328e-2,-41.02041,1.6071374)" />
    <pattern
       inkscape:collect="always"
       xlink:href="#Strips1_4"
       id="pattern6772"
       patternTransform="matrix(10,0,0,10,-85,-577.36218)" />
    <pattern
       inkscape:stockid="Stripes 1:4"
       id="Strips1_4"
       patternTransform="translate(0,0) scale(10,10)"
       height="1"
       width="5"
       patternUnits="userSpaceOnUse"
       inkscape:collect="always">
      <rect
         id="rect5721"
         height="2"
         width="1"
         y="-0.5"
         x="0"
         style="fill:black;stroke:none" />
    </pattern>
    <pattern
       inkscape:collect="always"
       xlink:href="#pattern6752"
       id="pattern6757"
       patternTransform="matrix(10,0,0,10,-130,-602.36218)" />
    <pattern
       inkscape:collect="always"
       xlink:href="#Strips1_1"
       id="pattern6752"
       patternTransform="matrix(10,0,0,10,-45,-24.999997)" />
    <pattern
       inkscape:stockid="Stripes 1:1"
       id="Strips1_1"
       patternTransform="translate(0,0) scale(10,10)"
       height="1"
       width="2"
       patternUnits="userSpaceOnUse"
       inkscape:collect="always">
      <rect
         id="rect5697"
         height="2"
         width="1"
         y="-0.5"
         x="0"
         style="fill:black;stroke:none" />
    </pattern>
    <marker
       inkscape:stockid="EmptyDiamondLend"
       orient="auto"
       refY="0"
       refX="0"
       id="EmptyDiamondLend"
       style="overflow:visible">
      <path
         id="path3289"
         d="M 0,-7.0710768 L -7.0710894,0 L 0,7.0710589 L 7.0710462,0 L 0,-7.0710768 z"
         style="fill:#ffffff;fill-rule:evenodd;stroke:#000000;stroke-width:1pt;marker-start:none"
         transform="matrix(0.8,0,0,0.8,-5.6,0)" />
    </marker>
    <inkscape:perspective
       sodipodi:type="inkscape:persp3d"
       inkscape:vp_x="0 : 526.18109 : 1"
       inkscape:vp_y="0 : 1000 : 0"
       inkscape:vp_z="744.09448 : 526.18109 : 1"
       inkscape:persp3d-origin="372.04724 : 350.78739 : 1"
       id="perspective10" />
    <pattern
       patternUnits="userSpaceOnUse"
       width="50"
       height="10.00001"
       patternTransform="matrix(0.1233561,7.1219678e-2,-7.1219678e-2,0.1233561,88.571429,584.86218)"
       id="pattern6754">
      <path
         sodipodi:nodetypes="ccccc"
         id="rect4975"
         d="M 0,1e-05 L 50,0 L 50,10.00001 L 0,10 L 0,1e-05 z"
         style="fill:url(#pattern6757);fill-opacity:1;fill-rule:evenodd;stroke:none;stroke-width:4;stroke-miterlimit:4;stroke-dashoffset:0;stroke-opacity:1" />
    </pattern>
    <pattern
       patternUnits="userSpaceOnUse"
       width="45"
       height="5"
       patternTransform="matrix(3.0683044e-2,-3.1001006e-2,1.771486e-2,5.3695328e-2,-171.02041,608.96932)"
       id="pattern6769">
      <rect
         id="rect6759"
         y="0"
         x="0"
         height="5"
         width="45"
         style="fill:url(#pattern6772);fill-opacity:1;stroke:none" />
    </pattern>
    <pattern
       patternUnits="userSpaceOnUse"
       width="40"
       height="5"
       patternTransform="matrix(1.7613378,0,0,1.7613378,130,607.36218)"
       id="pattern6780">
      <rect
         transform="scale(-1,1)"
         ry="0"
         id="rect6774"
         y="0"
         x="-40"
         height="5"
         width="40"
         style="fill:url(#pattern6783);stroke:none" />
    </pattern>
  </defs>
  <sodipodi:namedview
     id="base"
     pagecolor="#ffffff"
     bordercolor="#666666"
     borderopacity="1.0"
     gridtolerance="10000"
     guidetolerance="10"
     objecttolerance="10"
     inkscape:pageopacity="0.0"
     inkscape:pageshadow="2"
     inkscape:zoom="1.4142136"
     inkscape:cx="-115.51996"
     inkscape:cy="179.62908"
     inkscape:document-units="px"
     inkscape:current-layer="layer1"
     showgrid="true"
     showguides="false"
     inkscape:snap-global="true"
     inkscape:window-width="1855"
     inkscape:window-height="1056"
     inkscape:window-x="65"
     inkscape:window-y="24"
     inkscape:window-maximized="1">
    <inkscape:grid
       type="xygrid"
       id="grid2383"
       visible="true"
       enabled="true" />
  </sodipodi:namedview>
  <metadata
     id="metadata7">
    <rdf:RDF>
      <cc:Work
         rdf:about="">
        <dc:format>image/svg+xml</dc:format>
        <dc:type
           rdf:resource="http://purl.org/dc/dcmitype/StillImage" />
        <dc:title></dc:title>
      </cc:Work>
    </rdf:RDF>
  </metadata>
  <g
     inkscape:label="Layer 1"
     inkscape:groupmode="layer"
     id="layer1"
     transform="translate(-444.54975,-277.56201)">
    <rect
       style="fill:none;fill-opacity:1;fill-rule:evenodd;stroke:#000000;stroke-width:4;stroke-linecap:round;stroke-miterlimit:4;stroke-dasharray:none;stroke-dashoffset:0;stroke-opacity:1"
       id="rect2434"
       width="250"
       height="100"
       x="-581.88586"
       y="-614.49976"
       ry="0"
       transform="matrix(0,-1,-1,0,0,0)" />
    <rect
       style="fill:#ffffff;fill-opacity:1;fill-rule:evenodd;stroke:#ffffff;stroke-width:0.9481442;stroke-linecap:round;stroke-miterlimit:4;stroke-dasharray:none;stroke-dashoffset:0;stroke-opacity:1"
       id="rect3269"
       width="80.051857"
       height="26.951853"
       x="-525.07568"
       y="452.40991"
       rx="5"
       ry="5"
       transform="scale(-1,1)" />
    <path
       sodipodi:type="arc"
       style="fill:none;fill-opacity:1;fill-rule:evenodd;stroke:#000000;stroke-width:0.32030451;stroke-linecap:round;stroke-miterlimit:4;stroke-dasharray:none;stroke-dashoffset:0;stroke-opacity:1"
       id="path2443"
       sodipodi:cx="595"
       sodipodi:cy="213.76767"
       sodipodi:rx="15"
       sodipodi:ry="20"
       d="M 608.61017,205.35993 A 15,20 0 0 1 610,213.76767 l -15,0 z"
       transform="matrix(0,-3.3334653,-2.9239935,0,1085.8921,2364.7977)"
       sodipodi:start="5.8493133"
       sodipodi:end="6.2831853" />
    <path
       style="fill:none;fill-rule:evenodd;stroke:#000000;stroke-width:1;stroke-linecap:butt;stroke-linejoin:miter;stroke-miterlimit:4;stroke-dasharray:none;stroke-dashoffset:0;stroke-opacity:1"
       d="M 460.49975,381.38585 C 460.49975,291.38585 460.49975,291.38585 460.49975,291.38585"
       id="path14411" />
    <path
       style="fill:none;stroke:#000000;stroke-width:1.85129476;stroke-linecap:round;stroke-linejoin:miter;stroke-miterlimit:4;stroke-dasharray:none;stroke-opacity:1;marker-start:url(#Arrow2Mstart);marker-mid:none;marker-end:none"
       d="m 664.54975,582.73074 c -48.94463,0 -48.94463,0 -48.94463,0"
       id="path6821"
       sodipodi:nodetypes="cc"
       inkscape:connector-curvature="0" />
    <path
       style="fill:none;fill-rule:evenodd;stroke:#000000;stroke-width:1.5;stroke-linecap:butt;stroke-linejoin:miter;marker-start:url(#Arrow2Lstart);marker-mid:none;marker-end:url(#Arrow2Lend);stroke-miterlimit:4;stroke-dasharray:none;stroke-opacity:1"
       d="M 644.49975,580.86354 C 644.49975,331.90542 644.49975,331.90542 644.49975,331.90542"
       id="path11075" />
    <path
       style="fill:none;fill-rule:evenodd;stroke:#000000;stroke-width:1.48855603;stroke-linecap:butt;stroke-linejoin:miter;marker-start:url(#Arrow2Lstart);marker-mid:none;marker-end:url(#Arrow2Lend);stroke-miterlimit:4;stroke-dasharray:none;stroke-opacity:1"
       d="M 614.43412,616.12586 C 516.40739,616.12586 516.40739,616.12586 516.40739,616.12586"
       id="path14379" />
    <text
       xml:space="preserve"
       style="font-style:normal;font-variant:normal;font-weight:normal;font-stretch:normal;font-size:24px;line-height:100%;font-family:'sans-serif';-inkscape-font-specification:'sans-serif';text-align:start;writing-mode:lr-tb;text-anchor:start;fill:#000000;fill-opacity:1;stroke:none"
       x="650.38"
       y="467.01385"
       id="text14387"
       sodipodi:linespacing="100%"><tspan
         sodipodi:role="line"
         id="tspan4681"
         x="650.38"
         y="467.01385">6 m</tspan></text>
    <text
       xml:space="preserve"
       style="font-style:normal;font-variant:normal;font-weight:normal;font-stretch:normal;font-size:24px;line-height:100%;font-family:'sans-serif';-inkscape-font-specification:'sans-serif';text-align:center;writing-mode:lr-tb;text-anchor:middle;fill:#000000;fill-opacity:1;stroke:none"
       x="642.70172"
       y="607.73071"
       id="text14401"
       sodipodi:linespacing="100%"><tspan
         sodipodi:role="line"
         id="tspan4667"
         x="642.70172"
         y="607.73071">24 kN</tspan></text>
    <text
       xml:space="preserve"
       style="font-size:24px;font-style:normal;font-variant:normal;font-weight:normal;font-stretch:normal;text-align:start;line-height:100%;writing-mode:lr-tb;text-anchor:start;fill:#000000;fill-opacity:1;stroke:none;font-family:sans-serif;-inkscape-font-specification:sans-serif"
       x="465.50778"
       y="308.89383"
       id="text14417"
       sodipodi:linespacing="100%"><tspan
         sodipodi:role="line"
         id="tspan14423"
         x="465.50778"
         y="308.89383">$30^\circ$</tspan></text>
    <g
       id="g3260"
       transform="matrix(0.5,-0.8660254,-0.8660254,-0.5,740.46779,1088.5334)">
      <path
         transform="matrix(-1,0,0,-1,1012.292,827.78552)"
         d="m 470,253.76767 -8.66025,-15 17.3205,0 z"
         inkscape:randomized="0"
         inkscape:rounded="0"
         inkscape:flatsided="true"
         sodipodi:arg2="2.6179939"
         sodipodi:arg1="1.5707963"
         sodipodi:r2="8.1161652"
         sodipodi:r1="10"
         sodipodi:cy="243.76767"
         sodipodi:cx="470"
         sodipodi:sides="3"
         id="path2438"
         style="opacity:1;fill:none;fill-opacity:1;fill-rule:evenodd;stroke:#000000;stroke-width:2;stroke-linecap:round;stroke-miterlimit:4;stroke-dasharray:none;stroke-dashoffset:0;stroke-opacity:1"
         sodipodi:type="star" />
      <path
         id="path3258"
         d="M 531.63175,595.01785 C 551.63175,595.01785 551.63175,595.01785 551.63175,595.01785"
         style="fill:none;fill-rule:evenodd;stroke:#000000;stroke-width:2;stroke-linecap:butt;stroke-linejoin:miter;stroke-miterlimit:4;stroke-dasharray:none;stroke-opacity:1" />
    </g>
    <path
       sodipodi:type="star"
       style="fill:none;stroke:#000000;stroke-width:2;stroke-linecap:round;stroke-miterlimit:4;stroke-opacity:1;stroke-dasharray:none;stroke-dashoffset:0"
       id="path3266"
       sodipodi:sides="3"
       sodipodi:cx="470"
       sodipodi:cy="243.76767"
       sodipodi:r1="10"
       sodipodi:r2="8.1161652"
       sodipodi:arg1="1.5707963"
       sodipodi:arg2="2.6179939"
       inkscape:flatsided="true"
       inkscape:rounded="0"
       inkscape:randomized="0"
       d="m 470,253.76767 -8.66025,-15 17.3205,0 z"
       transform="matrix(-0.5,0.8660254,0.8660254,0.5,538.44076,62.814969)" />
    <path
       style="fill:none;fill-rule:evenodd;stroke:#000000;stroke-width:1;stroke-linecap:butt;stroke-linejoin:miter;stroke-miterlimit:4;stroke-dasharray:none;stroke-dashoffset:0;stroke-opacity:1"
       d="M 459.99975,381.38585 C 504.99975,303.44357 504.99975,303.44357 504.99975,303.44357"
       id="path4683" />
    <text
       xml:space="preserve"
       style="font-style:normal;font-variant:normal;font-weight:normal;font-stretch:normal;font-size:24px;line-height:100%;font-family:'sans-serif';-inkscape-font-specification:'sans-serif';text-align:start;writing-mode:lr-tb;text-anchor:start;fill:#000000;fill-opacity:1;stroke:none"
       x="443.64587"
       y="473.52982"
       id="text4669"
       sodipodi:linespacing="100%"><tspan
         sodipodi:role="line"
         id="tspan4677"
         x="443.64587"
         y="473.52982">30 kNm</tspan></text>
    <text
       xml:space="preserve"
       style="font-style:normal;font-variant:normal;font-weight:normal;font-stretch:normal;font-size:24px;line-height:100%;font-family:'sans-serif';-inkscape-font-specification:'sans-serif';text-align:end;writing-mode:lr-tb;text-anchor:end;fill:#000000;fill-opacity:1;stroke:none"
       x="585.85339"
       y="609.88983"
       id="text3271"
       sodipodi:linespacing="100%"><tspan
         sodipodi:role="line"
         id="tspan3279"
         x="585.85339"
         y="609.88983">3 m</tspan></text>
    <text
       xml:space="preserve"
       style="font-style:normal;font-variant:normal;font-weight:normal;font-stretch:normal;font-size:24px;line-height:100%;font-family:'sans-serif';-inkscape-font-specification:'sans-serif';text-align:end;writing-mode:lr-tb;text-anchor:end;fill:#000000;fill-opacity:1;stroke:none"
       x="504.54974"
       y="582.73071"
       id="text9765"
       sodipodi:linespacing="100%"><tspan
         sodipodi:role="line"
         id="tspan9773"
         x="504.54974"
         y="582.73071">a</tspan></text>
    <text
       xml:space="preserve"
       style="font-style:normal;font-variant:normal;font-weight:normal;font-stretch:normal;font-size:24px;line-height:100%;font-family:'sans-serif';-inkscape-font-specification:'sans-serif';text-align:end;writing-mode:lr-tb;text-anchor:end;fill:#000000;fill-opacity:1;stroke:none;stroke-width:1px;stroke-linecap:butt;stroke-linejoin:miter;stroke-opacity:1"
       x="531.10114"
       y="325.91321"
       id="text9775"
       sodipodi:linespacing="100%"><tspan
         sodipodi:role="line"
         id="tspan9783"
         x="531.10114"
         y="325.91321">b</tspan></text>
    <path
       style="fill:none;stroke:#000000;stroke-width:2;stroke-linecap:butt;stroke-linejoin:miter;stroke-miterlimit:4;stroke-dasharray:none;stroke-opacity:1;marker-start:url(#Arrow2Mstart)"
       d="m 579.43318,468.12586 c 0,0 0,20 -20,20 -15,0 -20,-13.81534 -20,-20 0,-20 20,-20 20,-20"
       id="path3657"
       sodipodi:nodetypes="cssz"
       inkscape:connector-curvature="0" />
    <path
       style="fill:none;stroke:#000000;stroke-width:1.88807487;stroke-linecap:round;stroke-linejoin:miter;stroke-miterlimit:4;stroke-dasharray:none;stroke-opacity:1;marker-start:url(#Arrow2Mstart);marker-mid:none;marker-end:none"
       d="m 614.74573,280.04908 c 0,51.15019 0,51.15019 0,51.15019"
       id="path3839"
       sodipodi:nodetypes="cc"
       inkscape:connector-curvature="0" />
    <text
       xml:space="preserve"
       style="font-style:normal;font-variant:normal;font-weight:normal;font-stretch:normal;font-size:24px;line-height:100%;font-family:'sans-serif';-inkscape-font-specification:'sans-serif';text-align:end;writing-mode:lr-tb;text-anchor:end;fill:#000000;fill-opacity:1;stroke:none"
       x="610.83313"
       y="308.27789"
       id="text3841"
       sodipodi:linespacing="100%"><tspan
         sodipodi:role="line"
         id="tspan3845"
         x="610.83313"
         y="308.27789">36 kN</tspan></text>
    <flowRoot
       xml:space="preserve"
       id="flowRoot9298"
       style="font-size:12px;font-style:normal;font-variant:normal;font-weight:normal;font-stretch:normal;text-align:start;line-height:125%;writing-mode:lr-tb;text-anchor:start;fill:#000000;fill-opacity:1;stroke:none;stroke-width:1px;stroke-linecap:butt;stroke-linejoin:miter;stroke-opacity:1;font-family:sans-serif;-inkscape-font-specification:sans-serif"><flowRegion
         id="flowRegion9300"><rect
           id="rect9302"
           width="1"
           height="35"
           x="206"
           y="-123.48801" /></flowRegion><flowPara
         id="flowPara9304" /></flowRoot>  </g>
</svg>
