<?xml version="1.0" encoding="UTF-8" standalone="no"?>
<!-- Created with Inkscape (http://www.inkscape.org/) -->

<svg
   xmlns:dc="http://purl.org/dc/elements/1.1/"
   xmlns:cc="http://creativecommons.org/ns#"
   xmlns:rdf="http://www.w3.org/1999/02/22-rdf-syntax-ns#"
   xmlns:svg="http://www.w3.org/2000/svg"
   xmlns="http://www.w3.org/2000/svg"
   xmlns:xlink="http://www.w3.org/1999/xlink"
   xmlns:sodipodi="http://sodipodi.sourceforge.net/DTD/sodipodi-0.dtd"
   xmlns:inkscape="http://www.inkscape.org/namespaces/inkscape"
   width="568.22021"
   height="223.77301"
   id="svg2"
   sodipodi:version="0.32"
   inkscape:version="0.92.4 (f8dce91, 2019-08-02)"
   sodipodi:docname="cviceni04-priklad3.svg"
   inkscape:output_extension="org.inkscape.output.svg.inkscape"
   version="1.0">
  <defs
     id="defs4">
    <marker
       inkscape:stockid="Arrow1Mend"
       orient="auto"
       refY="0"
       refX="0"
       id="Arrow1Mend"
       style="overflow:visible">
      <path
         id="path4151"
         d="M 0,0 5,-5 -12.5,0 5,5 Z"
         style="fill-rule:evenodd;stroke:#000000;stroke-width:1.00000003pt;marker-start:none"
         transform="matrix(-0.4,0,0,-0.4,-4,0)"
         inkscape:connector-curvature="0" />
    </marker>
    <marker
       inkscape:stockid="Arrow2Lend"
       orient="auto"
       refY="0"
       refX="0"
       id="Arrow2Lend"
       style="overflow:visible">
      <path
         id="path3185"
         style="font-size:12px;fill-rule:evenodd;stroke-width:0.625;stroke-linejoin:round"
         d="M 8.7185878,4.0337352 -2.2072895,0.01601326 8.7185884,-4.0017078 c -1.7454984,2.3720609 -1.7354408,5.6174519 -6e-7,8.035443 z"
         transform="matrix(-1.1,0,0,-1.1,-1.1,0)"
         inkscape:connector-curvature="0" />
    </marker>
    <marker
       inkscape:stockid="Arrow2Mstart"
       orient="auto"
       refY="0"
       refX="0"
       id="Arrow2Mstart"
       style="overflow:visible">
      <path
         id="path3188"
         style="font-size:12px;fill-rule:evenodd;stroke-width:0.625;stroke-linejoin:round"
         d="M 8.7185878,4.0337352 -2.2072895,0.01601326 8.7185884,-4.0017078 c -1.7454984,2.3720609 -1.7354408,5.6174519 -6e-7,8.035443 z"
         transform="scale(0.6)"
         inkscape:connector-curvature="0" />
    </marker>
    <marker
       inkscape:stockid="Arrow2Lstart"
       orient="auto"
       refY="0"
       refX="0"
       id="Arrow2Lstart"
       style="overflow:visible">
      <path
         id="path3182"
         style="font-size:12px;fill-rule:evenodd;stroke-width:0.625;stroke-linejoin:round"
         d="M 8.7185878,4.0337352 -2.2072895,0.01601326 8.7185884,-4.0017078 c -1.7454984,2.3720609 -1.7354408,5.6174519 -6e-7,8.035443 z"
         transform="matrix(1.1,0,0,1.1,1.1,0)"
         inkscape:connector-curvature="0" />
    </marker>
    <marker
       inkscape:stockid="Arrow1Lstart"
       orient="auto"
       refY="0"
       refX="0"
       id="Arrow1Lstart"
       style="overflow:visible">
      <path
         id="path3164"
         d="M 0,0 5,-5 -12.5,0 5,5 Z"
         style="fill-rule:evenodd;stroke:#000000;stroke-width:1.00000003pt;marker-start:none"
         transform="matrix(0.8,0,0,0.8,10,0)"
         inkscape:connector-curvature="0" />
    </marker>
    <marker
       inkscape:stockid="Arrow1Mstart"
       orient="auto"
       refY="0"
       refX="0"
       id="Arrow1Mstart"
       style="overflow:visible">
      <path
         id="path3170"
         d="M 0,0 5,-5 -12.5,0 5,5 Z"
         style="fill-rule:evenodd;stroke:#000000;stroke-width:1.00000003pt;marker-start:none"
         transform="matrix(0.4,0,0,0.4,4,0)"
         inkscape:connector-curvature="0" />
    </marker>
    <marker
       inkscape:stockid="Arrow1Send"
       orient="auto"
       refY="0"
       refX="0"
       id="Arrow1Send"
       style="overflow:visible">
      <path
         id="path3179"
         d="M 0,0 5,-5 -12.5,0 5,5 Z"
         style="fill-rule:evenodd;stroke:#000000;stroke-width:1.00000003pt;marker-start:none"
         transform="matrix(-0.2,0,0,-0.2,-1.2,0)"
         inkscape:connector-curvature="0" />
    </marker>
    <marker
       inkscape:stockid="Arrow1Lend"
       orient="auto"
       refY="0"
       refX="0"
       id="Arrow1Lend"
       style="overflow:visible">
      <path
         id="path3167"
         d="M 0,0 5,-5 -12.5,0 5,5 Z"
         style="fill-rule:evenodd;stroke:#000000;stroke-width:1.00000003pt;marker-start:none"
         transform="matrix(-0.8,0,0,-0.8,-10,0)"
         inkscape:connector-curvature="0" />
    </marker>
    <pattern
       inkscape:collect="always"
       xlink:href="#pattern6780"
       id="pattern6799"
       patternTransform="matrix(1.7613378,0,0,1.7613378,130,608.36218)" />
    <pattern
       inkscape:collect="always"
       xlink:href="#pattern6769"
       id="pattern6783"
       patternTransform="matrix(3.0683044e-2,-3.1001006e-2,1.771486e-2,5.3695328e-2,-41.02041,1.6071374)" />
    <pattern
       inkscape:collect="always"
       xlink:href="#Strips1_4"
       id="pattern6772"
       patternTransform="matrix(10,0,0,10,-85,-577.36218)" />
    <pattern
       inkscape:stockid="Stripes 1:4"
       id="Strips1_4"
       patternTransform="translate(0,0) scale(10,10)"
       height="1"
       width="5"
       patternUnits="userSpaceOnUse"
       inkscape:collect="always">
      <rect
         id="rect5721"
         height="2"
         width="1"
         y="-0.5"
         x="0"
         style="fill:black;stroke:none" />
    </pattern>
    <pattern
       inkscape:collect="always"
       xlink:href="#pattern6752"
       id="pattern6757"
       patternTransform="matrix(10,0,0,10,-130,-602.36218)" />
    <pattern
       inkscape:collect="always"
       xlink:href="#Strips1_1"
       id="pattern6752"
       patternTransform="matrix(10,0,0,10,-45,-24.999997)" />
    <pattern
       inkscape:stockid="Stripes 1:1"
       id="Strips1_1"
       patternTransform="translate(0,0) scale(10,10)"
       height="1"
       width="2"
       patternUnits="userSpaceOnUse"
       inkscape:collect="always">
      <rect
         id="rect5697"
         height="2"
         width="1"
         y="-0.5"
         x="0"
         style="fill:black;stroke:none" />
    </pattern>
    <marker
       inkscape:stockid="EmptyDiamondLend"
       orient="auto"
       refY="0"
       refX="0"
       id="EmptyDiamondLend"
       style="overflow:visible">
      <path
         id="path3289"
         d="M 0,-7.0710768 -7.0710894,0 0,7.0710589 7.0710462,0 Z"
         style="fill:#ffffff;fill-rule:evenodd;stroke:#000000;stroke-width:1.00000003pt;marker-start:none"
         transform="matrix(0.8,0,0,0.8,-5.6,0)"
         inkscape:connector-curvature="0" />
    </marker>
    <inkscape:perspective
       sodipodi:type="inkscape:persp3d"
       inkscape:vp_x="0 : 526.18109 : 1"
       inkscape:vp_y="0 : 1000 : 0"
       inkscape:vp_z="744.09448 : 526.18109 : 1"
       inkscape:persp3d-origin="372.04724 : 350.78739 : 1"
       id="perspective10" />
    <pattern
       patternUnits="userSpaceOnUse"
       width="50"
       height="10.00001"
       patternTransform="matrix(0.1233561,7.1219678e-2,-7.1219678e-2,0.1233561,88.571429,584.86218)"
       id="pattern6754">
      <path
         sodipodi:nodetypes="ccccc"
         id="rect4975"
         d="M 0,1e-05 L 50,0 L 50,10.00001 L 0,10 L 0,1e-05 z"
         style="fill:url(#pattern6757);fill-opacity:1;fill-rule:evenodd;stroke:none;stroke-width:4;stroke-miterlimit:4;stroke-dashoffset:0;stroke-opacity:1" />
    </pattern>
    <pattern
       patternUnits="userSpaceOnUse"
       width="45"
       height="5"
       patternTransform="matrix(3.0683044e-2,-3.1001006e-2,1.771486e-2,5.3695328e-2,-171.02041,608.96932)"
       id="pattern6769">
      <rect
         id="rect6759"
         y="0"
         x="0"
         height="5"
         width="45"
         style="fill:url(#pattern6772);fill-opacity:1;stroke:none" />
    </pattern>
    <pattern
       patternUnits="userSpaceOnUse"
       width="40"
       height="5"
       patternTransform="matrix(1.7613378,0,0,1.7613378,130,607.36218)"
       id="pattern6780">
      <rect
         transform="scale(-1,1)"
         ry="0"
         id="rect6774"
         y="0"
         x="-40"
         height="5"
         width="40"
         style="fill:url(#pattern6783);stroke:none" />
    </pattern>
  </defs>
  <sodipodi:namedview
     id="base"
     pagecolor="#ffffff"
     bordercolor="#666666"
     borderopacity="1.0"
     gridtolerance="10000"
     guidetolerance="10"
     objecttolerance="10"
     inkscape:pageopacity="0.0"
     inkscape:pageshadow="2"
     inkscape:zoom="2"
     inkscape:cx="365.65217"
     inkscape:cy="130.20616"
     inkscape:document-units="px"
     inkscape:current-layer="layer1"
     showgrid="true"
     showguides="true"
     inkscape:snap-global="true"
     inkscape:window-width="3322"
     inkscape:window-height="2193"
     inkscape:window-x="134"
     inkscape:window-y="55"
     fit-margin-top="0"
     fit-margin-left="0"
     fit-margin-right="0"
     fit-margin-bottom="0"
     inkscape:window-maximized="1"
     inkscape:guide-bbox="true">
    <inkscape:grid
       type="xygrid"
       id="grid2383"
       visible="true"
       enabled="true"
       empspacing="5"
       snapvisiblegridlinesonly="true"
       originx="-3.1835937e-06"
       originy="14.986025" />
  </sodipodi:namedview>
  <metadata
     id="metadata7">
    <rdf:RDF>
      <cc:Work
         rdf:about="">
        <dc:format>image/svg+xml</dc:format>
        <dc:type
           rdf:resource="http://purl.org/dc/dcmitype/StillImage" />
        <dc:title></dc:title>
      </cc:Work>
    </rdf:RDF>
  </metadata>
  <g
     inkscape:label="Layer 1"
     inkscape:groupmode="layer"
     id="layer1"
     transform="translate(-613.84451,-299.15051)">
    <path
       style="fill:#000000;stroke:#000000;stroke-width:2;stroke-linecap:butt;stroke-linejoin:miter;stroke-miterlimit:4;stroke-dasharray:none;stroke-opacity:1;marker-start:url(#Arrow1Mstart);marker-mid:url(#Arrow2Lstart);marker-end:none"
       d="m 702.39571,454.8863 c -47.1024,0 -47.1024,0 -47.1024,0"
       id="path3368"
       inkscape:connector-curvature="0" />
    <path
       sodipodi:type="star"
       style="fill:none;stroke:#000000;stroke-width:2.5;stroke-linecap:round;stroke-miterlimit:4;stroke-dasharray:none;stroke-dashoffset:0;stroke-opacity:1"
       id="path3364"
       sodipodi:sides="3"
       sodipodi:cx="490"
       sodipodi:cy="199.25668"
       sodipodi:r1="9.2566833"
       sodipodi:r2="4.6283417"
       sodipodi:arg1="-1.5707963"
       sodipodi:arg2="-0.52359878"
       inkscape:flatsided="true"
       inkscape:rounded="0"
       inkscape:randomized="0"
       d="m 490,190 8.01652,13.88503 -16.03304,-1e-5 z"
       transform="translate(400.11661,268.92352)" />
    <path
       sodipodi:type="star"
       style="fill:none;stroke:#000000;stroke-width:2.5;stroke-linecap:round;stroke-miterlimit:4;stroke-dasharray:none;stroke-dashoffset:0;stroke-opacity:1"
       id="path3346"
       sodipodi:sides="3"
       sodipodi:cx="490"
       sodipodi:cy="199.25668"
       sodipodi:r1="9.2566833"
       sodipodi:r2="4.6283417"
       sodipodi:arg1="-1.5707963"
       sodipodi:arg2="-0.52359878"
       inkscape:flatsided="true"
       inkscape:rounded="0"
       inkscape:randomized="0"
       d="m 490,190 8.01652,13.88503 -16.03304,-1e-5 z"
       transform="rotate(-90,873.08581,-19.14577)" />
    <path
       id="path3334"
       d="m 1077.4887,454.09853 c 0,-90 0,-90 0,-90"
       style="fill:none;stroke:#000000;stroke-width:3;stroke-linecap:butt;stroke-linejoin:miter;stroke-miterlimit:4;stroke-dasharray:none;stroke-opacity:1"
       inkscape:connector-curvature="0" />
    <path
       style="fill:none;stroke:#000000;stroke-width:3;stroke-linecap:butt;stroke-linejoin:miter;stroke-miterlimit:4;stroke-dasharray:none;stroke-opacity:1"
       d="m 987.48873,454.09853 c 89.99997,0 89.99997,0 89.99997,0"
       id="path3324"
       inkscape:connector-curvature="0" />
    <path
       style="fill:none;stroke:#000000;stroke-width:3.08850169;stroke-linecap:butt;stroke-linejoin:miter;stroke-miterlimit:4;stroke-dasharray:none;stroke-opacity:1"
       d="m 1075.6224,364.14124 c -90.23069,89.86681 -90.23069,89.86681 -90.23069,89.86681"
       id="path3342"
       inkscape:connector-curvature="0" />
    <path
       style="fill:none;stroke:#000000;stroke-width:3;stroke-linecap:butt;stroke-linejoin:miter;stroke-miterlimit:4;stroke-dasharray:none;stroke-opacity:1"
       d="m 985.48873,454.09853 c 0,-90 0,-90 0,-90"
       id="path3328"
       inkscape:connector-curvature="0" />
    <path
       id="path3318"
       d="m 892.48873,454.09853 c 90,0 90,0 90,0"
       style="fill:none;stroke:#000000;stroke-width:3;stroke-linecap:butt;stroke-linejoin:miter;stroke-miterlimit:4;stroke-dasharray:none;stroke-opacity:1"
       inkscape:connector-curvature="0" />
    <path
       id="path3320"
       d="m 890.48873,364.09853 c 90,0 90,0 90,0"
       style="fill:none;stroke:#000000;stroke-width:3;stroke-linecap:butt;stroke-linejoin:miter;stroke-miterlimit:4;stroke-dasharray:none;stroke-opacity:1"
       inkscape:connector-curvature="0" />
    <path
       style="fill:none;stroke:#000000;stroke-width:3;stroke-linecap:butt;stroke-linejoin:miter;stroke-miterlimit:4;stroke-dasharray:none;stroke-opacity:1"
       d="m 985.37667,364.0606 c -94.92588,90.07587 -94.92588,90.07587 -94.92588,90.07587"
       id="path3340"
       inkscape:connector-curvature="0" />
    <path
       id="path3330"
       d="m 890.48873,454.09853 c 0,-90 0,-90 0,-90"
       style="fill:none;stroke:#000000;stroke-width:3;stroke-linecap:butt;stroke-linejoin:miter;stroke-miterlimit:4;stroke-dasharray:none;stroke-opacity:1"
       inkscape:connector-curvature="0" />
    <path
       style="fill:none;stroke:#000000;stroke-width:3;stroke-linecap:butt;stroke-linejoin:miter;stroke-miterlimit:4;stroke-dasharray:none;stroke-opacity:1"
       d="m 800.48873,364.09853 c 90,0 90,0 90,0"
       id="path3314"
       inkscape:connector-curvature="0" />
    <path
       style="fill:none;stroke:#000000;stroke-width:3;stroke-linecap:butt;stroke-linejoin:miter;stroke-miterlimit:4;stroke-dasharray:none;stroke-opacity:1"
       d="m 800.48873,364.09853 c 90,90 90,90 90,90"
       id="path3338"
       inkscape:connector-curvature="0" />
    <path
       style="fill:none;stroke:#000000;stroke-width:3;stroke-linecap:butt;stroke-linejoin:miter;stroke-miterlimit:4;stroke-dasharray:none;stroke-opacity:1"
       d="m 800.48873,454.09853 c 0,-90 0,-90 0,-90"
       id="path3332"
       inkscape:connector-curvature="0" />
    <path
       id="path3316"
       d="m 800.48873,454.09853 c 90,0 90,0 90,0"
       style="fill:none;stroke:#000000;stroke-width:3;stroke-linecap:butt;stroke-linejoin:miter;stroke-miterlimit:4;stroke-dasharray:none;stroke-opacity:1"
       inkscape:connector-curvature="0" />
    <path
       id="path3312"
       d="m 710.48873,454.09853 c 90,0 90,0 90,0"
       style="fill:none;stroke:#000000;stroke-width:3;stroke-linecap:butt;stroke-linejoin:miter;stroke-miterlimit:4;stroke-dasharray:none;stroke-opacity:1"
       inkscape:connector-curvature="0" />
    <path
       style="fill:none;stroke:#000000;stroke-width:3;stroke-linecap:butt;stroke-linejoin:miter;stroke-miterlimit:4;stroke-dasharray:none;stroke-opacity:1"
       d="m 710.48873,364.09853 c 90,0 90,0 90,0"
       id="path3310"
       inkscape:connector-curvature="0" />
    <path
       style="fill:none;stroke:#000000;stroke-width:3;stroke-linecap:butt;stroke-linejoin:miter;stroke-miterlimit:4;stroke-dasharray:none;stroke-opacity:1"
       d="m 710.48873,454.09853 c 90,-90 90,-90 90,-90"
       id="path3336"
       inkscape:connector-curvature="0" />
    <path
       transform="translate(310.48873,339.84185)"
       id="path3326"
       d="m 400,114.25668 c 0,-89.999997 0,-89.999997 0,-89.999997"
       style="fill:none;stroke:#000000;stroke-width:3;stroke-linecap:butt;stroke-linejoin:miter;stroke-miterlimit:4;stroke-dasharray:none;stroke-opacity:1"
       inkscape:connector-curvature="0" />
    <path
       style="fill:none;stroke:#000000;stroke-width:3;stroke-linecap:butt;stroke-linejoin:miter;stroke-miterlimit:4;stroke-dasharray:none;stroke-opacity:1"
       d="m 400,114.25668 c 0,-89.999997 0,-89.999997 0,-89.999997"
       id="path2490"
       transform="translate(310.48873,339.84185)"
       inkscape:connector-curvature="0" />
    <circle
       style="fill:#ffffff;fill-opacity:1;fill-rule:evenodd;stroke:#000000;stroke-width:2.5;stroke-miterlimit:4;stroke-dasharray:none;stroke-dashoffset:0;stroke-opacity:1"
       id="path4973"
       transform="matrix(0.8,0,0,0.8,514.48873,47.208787)"
       cx="245"
       cy="397.36218"
       r="5" />
    <circle
       style="fill:#ffffff;fill-opacity:1;fill-rule:evenodd;stroke:#000000;stroke-width:2.5;stroke-miterlimit:4;stroke-dasharray:none;stroke-dashoffset:0;stroke-opacity:1"
       id="path2458"
       transform="matrix(0.8,0,0,0.8,514.48873,137.20879)"
       cx="245"
       cy="397.36218"
       r="5" />
    <circle
       transform="matrix(0.8,0,0,0.8,514.48873,47.208787)"
       id="path2466"
       style="fill:#ffffff;fill-opacity:1;fill-rule:evenodd;stroke:#000000;stroke-width:2.5;stroke-miterlimit:4;stroke-dasharray:none;stroke-dashoffset:0;stroke-opacity:1"
       cx="245"
       cy="397.36218"
       r="5" />
    <circle
       transform="matrix(0.8,0,0,0.8,514.48873,137.20879)"
       id="path2468"
       style="fill:#ffffff;fill-opacity:1;fill-rule:evenodd;stroke:#000000;stroke-width:2.5;stroke-miterlimit:4;stroke-dasharray:none;stroke-dashoffset:0;stroke-opacity:1"
       cx="245"
       cy="397.36218"
       r="5" />
    <circle
       style="fill:#ffffff;fill-opacity:1;fill-rule:evenodd;stroke:#000000;stroke-width:2.5;stroke-miterlimit:4;stroke-dasharray:none;stroke-dashoffset:0;stroke-opacity:1"
       id="path2472"
       transform="matrix(0.8,0,0,0.8,514.48873,137.20879)"
       cx="245"
       cy="397.36218"
       r="5" />
    <circle
       transform="matrix(0.8,0,0,0.8,694.48873,135.20879)"
       id="path2474"
       style="fill:#ffffff;fill-opacity:1;fill-rule:evenodd;stroke:#000000;stroke-width:2.5;stroke-miterlimit:4;stroke-dasharray:none;stroke-dashoffset:0;stroke-opacity:1"
       cx="245"
       cy="397.36218"
       r="5" />
    <circle
       style="fill:#ffffff;fill-opacity:1;fill-rule:evenodd;stroke:#000000;stroke-width:2.5;stroke-miterlimit:4;stroke-dasharray:none;stroke-dashoffset:0;stroke-opacity:1"
       id="path2480"
       transform="matrix(0.8,0,0,0.8,881.48873,136.20879)"
       cx="245"
       cy="397.36218"
       r="5" />
    <circle
       style="fill:#ffffff;fill-opacity:1;fill-rule:evenodd;stroke:#000000;stroke-width:2.5;stroke-miterlimit:4;stroke-dasharray:none;stroke-dashoffset:0;stroke-opacity:1"
       id="path2486"
       transform="matrix(0.8,0,0,0.8,604.48873,47.208787)"
       cx="245"
       cy="397.36218"
       r="5" />
    <circle
       style="fill:#ffffff;fill-opacity:1;fill-rule:evenodd;stroke:#000000;stroke-width:2.5;stroke-miterlimit:4;stroke-dasharray:none;stroke-dashoffset:0;stroke-opacity:1"
       id="path2488"
       transform="matrix(0.8,0,0,0.8,604.48873,137.20879)"
       cx="245"
       cy="397.36218"
       r="5" />
    <path
       style="fill:none;stroke:#000000;stroke-width:3;stroke-linecap:butt;stroke-linejoin:miter;stroke-miterlimit:4;stroke-dasharray:none;stroke-opacity:1"
       d="m 988.48873,364.09853 c 89.99997,0 89.99997,0 89.99997,0"
       id="path3322"
       inkscape:connector-curvature="0" />
    <circle
       transform="matrix(0.8,0,0,0.8,880.48873,47.208787)"
       id="path2484"
       style="fill:#ffffff;fill-opacity:1;fill-rule:evenodd;stroke:#000000;stroke-width:2.5;stroke-miterlimit:4;stroke-dasharray:none;stroke-dashoffset:0;stroke-opacity:1"
       cx="245"
       cy="397.36218"
       r="5" />
    <circle
       style="fill:#ffffff;fill-opacity:1;fill-rule:evenodd;stroke:#000000;stroke-width:2.5;stroke-miterlimit:4;stroke-dasharray:none;stroke-dashoffset:0;stroke-opacity:1"
       id="path2478"
       transform="matrix(0.8,0,0,0.8,788.48873,46.208787)"
       cx="245"
       cy="397.36218"
       r="5" />
    <circle
       style="fill:#ffffff;fill-opacity:1;fill-rule:evenodd;stroke:#000000;stroke-width:2.5;stroke-miterlimit:4;stroke-dasharray:none;stroke-dashoffset:0;stroke-opacity:1"
       id="path2470"
       transform="matrix(0.8,0,0,0.8,789.48873,135.20879)"
       cx="245"
       cy="397.36218"
       r="5" />
    <circle
       transform="matrix(0.8,0,0,0.8,694.48873,45.208787)"
       id="path2482"
       style="fill:#ffffff;fill-opacity:1;fill-rule:evenodd;stroke:#000000;stroke-width:2.5;stroke-miterlimit:4;stroke-dasharray:none;stroke-dashoffset:0;stroke-opacity:1"
       cx="245"
       cy="397.36218"
       r="5" />
    <rect
       style="fill:none;stroke:#000000;stroke-width:2;stroke-linecap:round;stroke-miterlimit:4;stroke-dasharray:none;stroke-dashoffset:0;stroke-opacity:1"
       id="rect3372"
       width="0"
       height="0"
       x="680"
       y="9.2566833"
       transform="translate(310.48873,339.84185)" />
    <text
       xml:space="preserve"
       style="font-style:normal;font-variant:normal;font-weight:normal;font-stretch:normal;line-height:0%;font-family:'Nimbus Roman No9 L';-inkscape-font-specification:'Nimbus Roman No9 L';text-align:center;writing-mode:lr-tb;text-anchor:middle;fill:#000000;fill-opacity:1;stroke:none"
       x="1077.9623"
       y="355.09851"
       id="text6535"><tspan
         sodipodi:role="line"
         id="tspan6537"
         x="1077.9623"
         y="355.09851"
         style="font-size:24px;line-height:1">\S{j}</tspan><tspan
         sodipodi:role="line"
         id="tspan6539"
         x="1080.9623"
         y="379.09851"
         style="font-size:24px;line-height:1"> </tspan></text>
    <text
       id="text6541"
       y="353.09851"
       x="984.96228"
       style="font-style:normal;font-variant:normal;font-weight:normal;font-stretch:normal;line-height:0%;font-family:'Nimbus Roman No9 L';-inkscape-font-specification:'Nimbus Roman No9 L';text-align:center;writing-mode:lr-tb;text-anchor:middle;fill:#000000;fill-opacity:1;stroke:none"
       xml:space="preserve"><tspan
         y="353.09851"
         x="984.96228"
         id="tspan6543"
         sodipodi:role="line"
         style="font-size:24px;line-height:1">\S{i}</tspan><tspan
         y="377.09851"
         x="987.96228"
         id="tspan6545"
         sodipodi:role="line"
         style="font-size:24px;line-height:1"> </tspan></text>
    <text
       xml:space="preserve"
       style="font-style:normal;font-variant:normal;font-weight:normal;font-stretch:normal;line-height:0%;font-family:'Nimbus Roman No9 L';-inkscape-font-specification:'Nimbus Roman No9 L';text-align:center;writing-mode:lr-tb;text-anchor:middle;fill:#000000;fill-opacity:1;stroke:none"
       x="892.63416"
       y="355.09851"
       id="text6547"><tspan
         sodipodi:role="line"
         id="tspan6549"
         x="892.63416"
         y="355.09851"
         style="font-size:24px;line-height:1">\S{h}</tspan><tspan
         sodipodi:role="line"
         id="tspan6551"
         x="895.63416"
         y="379.09851"
         style="font-size:24px;line-height:1"> </tspan></text>
    <text
       id="text6553"
       y="355.09851"
       x="800.63416"
       style="font-style:normal;font-variant:normal;font-weight:normal;font-stretch:normal;line-height:0%;font-family:'Nimbus Roman No9 L';-inkscape-font-specification:'Nimbus Roman No9 L';text-align:center;writing-mode:lr-tb;text-anchor:middle;fill:#000000;fill-opacity:1;stroke:none"
       xml:space="preserve"><tspan
         y="355.09851"
         x="800.63416"
         id="tspan6555"
         sodipodi:role="line"
         style="font-size:24px;line-height:1">\S{g}</tspan><tspan
         y="379.09851"
         x="803.63416"
         id="tspan6557"
         sodipodi:role="line"
         style="font-size:24px;line-height:1"> </tspan></text>
    <text
       xml:space="preserve"
       style="font-style:normal;font-variant:normal;font-weight:normal;font-stretch:normal;line-height:0%;font-family:'Nimbus Roman No9 L';-inkscape-font-specification:'Nimbus Roman No9 L';text-align:start;writing-mode:lr-tb;text-anchor:start;fill:#000000;fill-opacity:1;stroke:none"
       x="716.19269"
       y="387.09851"
       id="text6559"><tspan
         sodipodi:role="line"
         id="tspan6561"
         x="716.19269"
         y="387.09851"
         style="font-size:24px;line-height:1">\S{f}</tspan><tspan
         sodipodi:role="line"
         id="tspan6563"
         x="716.19269"
         y="411.09851"
         style="font-size:24px;line-height:1"> </tspan></text>
    <text
       id="text6565"
       y="476.09851"
       x="1069.7162"
       style="font-style:normal;font-variant:normal;font-weight:normal;font-stretch:normal;line-height:0%;font-family:'Nimbus Roman No9 L';-inkscape-font-specification:'Nimbus Roman No9 L';text-align:end;writing-mode:lr-tb;text-anchor:end;fill:#000000;fill-opacity:1;stroke:none"
       xml:space="preserve"><tspan
         y="476.09851"
         x="1069.7162"
         id="tspan6567"
         sodipodi:role="line"
         style="font-size:24px;line-height:1">\S{e}</tspan><tspan
         y="500.09851"
         x="1075.7162"
         id="tspan6569"
         sodipodi:role="line"
         style="font-size:24px;line-height:1"> </tspan></text>
    <text
       xml:space="preserve"
       style="font-style:normal;font-variant:normal;font-weight:normal;font-stretch:normal;line-height:0%;font-family:'Nimbus Roman No9 L';-inkscape-font-specification:'Nimbus Roman No9 L';text-align:center;writing-mode:lr-tb;text-anchor:middle;fill:#000000;fill-opacity:1;stroke:none"
       x="985.63422"
       y="475.09851"
       id="text6571"><tspan
         sodipodi:role="line"
         id="tspan6573"
         x="985.63422"
         y="475.09851"
         style="font-size:24px;line-height:1">\S{d}</tspan><tspan
         sodipodi:role="line"
         id="tspan6575"
         x="988.63422"
         y="499.09851"
         style="font-size:24px;line-height:1"> </tspan></text>
    <text
       id="text6577"
       y="475.09851"
       x="908.19269"
       style="font-style:normal;font-variant:normal;font-weight:normal;font-stretch:normal;line-height:0%;font-family:'Nimbus Roman No9 L';-inkscape-font-specification:'Nimbus Roman No9 L';text-align:center;writing-mode:lr-tb;text-anchor:middle;fill:#000000;fill-opacity:1;stroke:none"
       xml:space="preserve"><tspan
         y="475.09851"
         x="908.19269"
         id="tspan6579"
         sodipodi:role="line"
         style="font-size:24px;line-height:1;text-align:start;text-anchor:start">\S{c}</tspan><tspan
         y="499.09851"
         x="911.19269"
         id="tspan6581"
         sodipodi:role="line"
         style="font-size:24px;line-height:1"> </tspan></text>
    <text
       xml:space="preserve"
       style="font-style:normal;font-variant:normal;font-weight:normal;font-stretch:normal;line-height:0%;font-family:'Nimbus Roman No9 L';-inkscape-font-specification:'Nimbus Roman No9 L';text-align:center;writing-mode:lr-tb;text-anchor:middle;fill:#000000;fill-opacity:1;stroke:none"
       x="802.11664"
       y="477.92352"
       id="text6583"><tspan
         sodipodi:role="line"
         id="tspan6585"
         x="802.11664"
         y="477.92352"
         style="font-size:24px;line-height:1">\S{b}</tspan><tspan
         sodipodi:role="line"
         id="tspan6587"
         x="805.11664"
         y="501.92352"
         style="font-size:24px;line-height:1"> </tspan></text>
    <text
       id="text6589"
       y="476.92352"
       x="719.59314"
       style="font-style:normal;font-variant:normal;font-weight:normal;font-stretch:normal;line-height:0%;font-family:'Nimbus Roman No9 L';-inkscape-font-specification:'Nimbus Roman No9 L';text-align:start;writing-mode:lr-tb;text-anchor:start;fill:#000000;fill-opacity:1;stroke:none"
       xml:space="preserve"><tspan
         y="476.92352"
         x="719.59314"
         id="tspan6591"
         sodipodi:role="line"
         style="font-size:24px;line-height:1">\S{a}</tspan><tspan
         y="500.92352"
         x="719.59314"
         id="tspan6593"
         sodipodi:role="line"
         style="font-size:24px;line-height:1"> </tspan></text>
    <text
       id="text6595"
       y="414.82251"
       x="1082.1927"
       style="font-style:normal;font-variant:normal;font-weight:normal;font-stretch:normal;line-height:0%;font-family:'Nimbus Roman No9 L';-inkscape-font-specification:'Nimbus Roman No9 L';text-align:start;writing-mode:lr-tb;text-anchor:start;fill:#000000;fill-opacity:1;stroke:none"
       xml:space="preserve"><tspan
         sodipodi:role="line"
         id="tspan2563"
         x="1082.1927"
         y="414.82251"
         style="font-size:16px;line-height:1">17</tspan><tspan
         sodipodi:role="line"
         id="tspan2565"
         x="1082.1927"
         y="430.82251"
         style="font-size:16px;line-height:1"> </tspan></text>
    <text
       xml:space="preserve"
       style="font-style:normal;font-variant:normal;font-weight:normal;font-stretch:normal;line-height:0%;font-family:'Nimbus Roman No9 L';-inkscape-font-specification:'Nimbus Roman No9 L';text-align:start;writing-mode:lr-tb;text-anchor:start;fill:#000000;fill-opacity:1;stroke:none"
       x="989.19269"
       y="414.25851"
       id="text6601"><tspan
         sodipodi:role="line"
         id="tspan6731"
         x="989.19269"
         y="414.25851"
         style="font-size:16px;line-height:1">15</tspan><tspan
         sodipodi:role="line"
         id="tspan6733"
         x="989.19269"
         y="430.25851"
         style="font-size:16px;line-height:1"> </tspan></text>
    <text
       id="text6607"
       y="414.73853"
       x="1039.1927"
       style="font-style:normal;font-variant:normal;font-weight:normal;font-stretch:normal;line-height:0%;font-family:'Nimbus Roman No9 L';-inkscape-font-specification:'Nimbus Roman No9 L';text-align:start;writing-mode:lr-tb;text-anchor:start;fill:#000000;fill-opacity:1;stroke:none"
       xml:space="preserve"><tspan
         sodipodi:role="line"
         id="tspan6735"
         x="1039.1927"
         y="414.73853"
         style="font-size:16px;line-height:1">16</tspan><tspan
         sodipodi:role="line"
         id="tspan6737"
         x="1039.1927"
         y="430.73853"
         style="font-size:16px;line-height:1"> </tspan></text>
    <text
       xml:space="preserve"
       style="font-style:normal;font-variant:normal;font-weight:normal;font-stretch:normal;line-height:0%;font-family:'Nimbus Roman No9 L';-inkscape-font-specification:'Nimbus Roman No9 L';text-align:start;writing-mode:lr-tb;text-anchor:start;fill:#000000;fill-opacity:1;stroke:none"
       x="943.19269"
       y="414.4025"
       id="text6613"><tspan
         sodipodi:role="line"
         id="tspan6729"
         x="943.19269"
         y="414.4025"
         style="font-size:16px;line-height:1">14</tspan></text>
    <text
       id="text6619"
       y="415.54251"
       x="894.19269"
       style="font-style:normal;font-variant:normal;font-weight:normal;font-stretch:normal;line-height:0%;font-family:'Nimbus Roman No9 L';-inkscape-font-specification:'Nimbus Roman No9 L';text-align:start;writing-mode:lr-tb;text-anchor:start;fill:#000000;fill-opacity:1;stroke:none"
       xml:space="preserve"><tspan
         sodipodi:role="line"
         id="tspan6727"
         x="894.19269"
         y="415.54251"
         style="font-size:16px;line-height:1">13</tspan></text>
    <text
       xml:space="preserve"
       style="font-style:normal;font-variant:normal;font-weight:normal;font-stretch:normal;line-height:0%;font-family:'Nimbus Roman No9 L';-inkscape-font-specification:'Nimbus Roman No9 L';text-align:start;writing-mode:lr-tb;text-anchor:start;fill:#000000;fill-opacity:1;stroke:none"
       x="851.19269"
       y="415.87851"
       id="text6625"><tspan
         sodipodi:role="line"
         id="tspan6723"
         x="851.19269"
         y="415.87851"
         style="font-size:16px;line-height:1">12</tspan><tspan
         sodipodi:role="line"
         id="tspan6725"
         x="851.19269"
         y="431.87851"
         style="font-size:16px;line-height:1"> </tspan></text>
    <text
       id="text6631"
       y="414.4025"
       x="804.19269"
       style="font-style:normal;font-variant:normal;font-weight:normal;font-stretch:normal;line-height:0%;font-family:'Nimbus Roman No9 L';-inkscape-font-specification:'Nimbus Roman No9 L';text-align:start;writing-mode:lr-tb;text-anchor:start;fill:#000000;fill-opacity:1;stroke:none"
       xml:space="preserve"><tspan
         sodipodi:role="line"
         id="tspan6721"
         x="804.19269"
         y="414.4025"
         style="font-size:16px;line-height:1">11</tspan></text>
    <text
       xml:space="preserve"
       style="font-style:normal;font-variant:normal;font-weight:normal;font-stretch:normal;line-height:0%;font-family:'Nimbus Roman No9 L';-inkscape-font-specification:'Nimbus Roman No9 L';text-align:start;writing-mode:lr-tb;text-anchor:start;fill:#000000;fill-opacity:1;stroke:none"
       x="761.19269"
       y="415.09851"
       id="text6637"><tspan
         sodipodi:role="line"
         id="tspan6719"
         x="761.19269"
         y="415.09851"
         style="font-size:16px;line-height:1">10</tspan></text>
    <text
       id="text6643"
       y="415.5665"
       x="715.19269"
       style="font-style:normal;font-variant:normal;font-weight:normal;font-stretch:normal;line-height:0%;font-family:'Nimbus Roman No9 L';-inkscape-font-specification:'Nimbus Roman No9 L';text-align:start;writing-mode:lr-tb;text-anchor:start;fill:#000000;fill-opacity:1;stroke:none"
       xml:space="preserve"><tspan
         sodipodi:role="line"
         id="tspan6717"
         x="715.19269"
         y="415.5665"
         style="font-size:16px;line-height:1">9</tspan></text>
    <text
       xml:space="preserve"
       style="font-style:normal;font-variant:normal;font-weight:normal;font-stretch:normal;line-height:0%;font-family:'Nimbus Roman No9 L';-inkscape-font-specification:'Nimbus Roman No9 L';text-align:start;writing-mode:lr-tb;text-anchor:start;fill:#000000;fill-opacity:1;stroke:none"
       x="1024.1927"
       y="359.09851"
       id="text6649"><tspan
         sodipodi:role="line"
         id="tspan6715"
         x="1024.1927"
         y="359.09851"
         style="font-size:16px;line-height:1">8</tspan></text>
    <text
       id="text6655"
       y="360.09851"
       x="934.19269"
       style="font-style:normal;font-variant:normal;font-weight:normal;font-stretch:normal;line-height:0%;font-family:'Nimbus Roman No9 L';-inkscape-font-specification:'Nimbus Roman No9 L';text-align:start;writing-mode:lr-tb;text-anchor:start;fill:#000000;fill-opacity:1;stroke:none"
       xml:space="preserve"><tspan
         sodipodi:role="line"
         id="tspan6713"
         x="934.19269"
         y="360.09851"
         style="font-size:16px;line-height:1">7</tspan></text>
    <text
       xml:space="preserve"
       style="font-style:normal;font-variant:normal;font-weight:normal;font-stretch:normal;line-height:0%;font-family:'Nimbus Roman No9 L';-inkscape-font-specification:'Nimbus Roman No9 L';text-align:start;writing-mode:lr-tb;text-anchor:start;fill:#000000;fill-opacity:1;stroke:none"
       x="839.19269"
       y="360.09851"
       id="text6661"><tspan
         sodipodi:role="line"
         id="tspan6711"
         x="839.19269"
         y="360.09851"
         style="font-size:16px;line-height:1">6</tspan></text>
    <text
       id="text6667"
       y="360.09851"
       x="749.19269"
       style="font-style:normal;font-variant:normal;font-weight:normal;font-stretch:normal;line-height:0%;font-family:'Nimbus Roman No9 L';-inkscape-font-specification:'Nimbus Roman No9 L';text-align:start;writing-mode:lr-tb;text-anchor:start;fill:#000000;fill-opacity:1;stroke:none"
       xml:space="preserve"><tspan
         sodipodi:role="line"
         id="tspan6707"
         x="749.19269"
         y="360.09851"
         style="font-size:16px;line-height:1">5</tspan><tspan
         sodipodi:role="line"
         id="tspan6709"
         x="749.19269"
         y="376.09851"
         style="font-size:16px;line-height:1"> </tspan></text>
    <text
       xml:space="preserve"
       style="font-style:normal;font-variant:normal;font-weight:normal;font-stretch:normal;line-height:0%;font-family:'Nimbus Roman No9 L';-inkscape-font-specification:'Nimbus Roman No9 L';text-align:start;writing-mode:lr-tb;text-anchor:start;fill:#000000;fill-opacity:1;stroke:none"
       x="1029.1927"
       y="449.09851"
       id="text6673"><tspan
         sodipodi:role="line"
         id="tspan6705"
         x="1029.1927"
         y="449.09851"
         style="font-size:16px;line-height:1">4</tspan></text>
    <text
       id="text6679"
       y="450.09851"
       x="929.19269"
       style="font-style:normal;font-variant:normal;font-weight:normal;font-stretch:normal;line-height:0%;font-family:'Nimbus Roman No9 L';-inkscape-font-specification:'Nimbus Roman No9 L';text-align:start;writing-mode:lr-tb;text-anchor:start;fill:#000000;fill-opacity:1;stroke:none"
       xml:space="preserve"><tspan
         sodipodi:role="line"
         id="tspan6703"
         x="929.19269"
         y="450.09851"
         style="font-size:16px;line-height:1">3</tspan></text>
    <text
       xml:space="preserve"
       style="font-style:normal;font-variant:normal;font-weight:normal;font-stretch:normal;line-height:0%;font-family:'Nimbus Roman No9 L';-inkscape-font-specification:'Nimbus Roman No9 L';text-align:start;writing-mode:lr-tb;text-anchor:start;fill:#000000;fill-opacity:1;stroke:none"
       x="846.19269"
       y="449.09851"
       id="text6685"><tspan
         sodipodi:role="line"
         id="tspan6701"
         x="846.19269"
         y="449.09851"
         style="font-size:16px;line-height:1">2</tspan></text>
    <text
       id="text6691"
       y="450.09851"
       x="749.19269"
       style="font-style:normal;font-variant:normal;font-weight:normal;font-stretch:normal;line-height:0%;font-family:'Nimbus Roman No9 L';-inkscape-font-specification:'Nimbus Roman No9 L';text-align:start;writing-mode:lr-tb;text-anchor:start;fill:#000000;fill-opacity:1;stroke:none"
       xml:space="preserve"><tspan
         sodipodi:role="line"
         id="tspan6697"
         x="749.19269"
         y="450.09851"
         style="font-size:16px;line-height:1">1</tspan><tspan
         sodipodi:role="line"
         id="tspan6699"
         x="749.19269"
         y="466.09851"
         style="font-size:16px;line-height:1"> </tspan></text>
    <path
       style="fill:none;stroke:#000000;stroke-width:1.5;stroke-linecap:butt;stroke-linejoin:miter;stroke-miterlimit:4;stroke-dasharray:none;stroke-opacity:1;marker-start:url(#Arrow2Mstart);marker-end:url(#Arrow1Mend)"
       d="m 712.19271,324.59852 h 90"
       id="path3125"
       inkscape:connector-curvature="0" />
    <path
       inkscape:connector-curvature="0"
       id="path4599"
       d="m 802.19271,324.59852 h 90"
       style="fill:none;stroke:#000000;stroke-width:1.5;stroke-linecap:butt;stroke-linejoin:miter;stroke-miterlimit:4;stroke-dasharray:none;stroke-opacity:1;marker-start:url(#Arrow2Mstart);marker-end:url(#Arrow1Mend)" />
    <path
       style="fill:none;stroke:#000000;stroke-width:1.5;stroke-linecap:butt;stroke-linejoin:miter;stroke-miterlimit:4;stroke-dasharray:none;stroke-opacity:1;marker-start:url(#Arrow2Mstart);marker-end:url(#Arrow1Mend)"
       d="m 892.19271,324.59852 h 90"
       id="path4601"
       inkscape:connector-curvature="0" />
    <path
       inkscape:connector-curvature="0"
       id="path4603"
       d="m 986.19271,324.59852 h 89.99999"
       style="fill:none;stroke:#000000;stroke-width:1.5;stroke-linecap:butt;stroke-linejoin:miter;stroke-miterlimit:4;stroke-dasharray:none;stroke-opacity:1;marker-start:url(#Arrow2Mstart);marker-end:url(#Arrow1Mend)" />
    <path
       inkscape:connector-curvature="0"
       id="path4611"
       d="m 1109.1927,361.59852 v 90"
       style="fill:none;stroke:#000000;stroke-width:1.5;stroke-linecap:butt;stroke-linejoin:miter;stroke-miterlimit:4;stroke-dasharray:none;stroke-opacity:1;marker-start:url(#Arrow2Mstart);marker-end:url(#Arrow1Mend)" />
    <text
       id="text4613"
       y="484.9375"
       x="703.84448"
       style="font-style:normal;font-variant:normal;font-weight:normal;font-stretch:normal;line-height:0%;font-family:'Nimbus Roman No9 L';-inkscape-font-specification:'Nimbus Roman No9 L';text-align:end;writing-mode:lr-tb;text-anchor:end;fill:#000000;fill-opacity:1;stroke:none"
       xml:space="preserve"><tspan
         y="484.9375"
         x="703.84448"
         id="tspan4615"
         sodipodi:role="line"
         style="font-size:24px;line-height:1">$70$~kN</tspan><tspan
         y="508.9375"
         x="709.84448"
         id="tspan4617"
         sodipodi:role="line"
         style="font-size:24px;line-height:1"> </tspan></text>
    <text
       id="text4625"
       y="316.59851"
       x="753.74451"
       style="font-style:normal;font-variant:normal;font-weight:normal;font-stretch:normal;line-height:0%;font-family:'Nimbus Roman No9 L';-inkscape-font-specification:'Nimbus Roman No9 L';text-align:center;writing-mode:lr-tb;text-anchor:middle;fill:#000000;fill-opacity:1;stroke:none"
       xml:space="preserve"><tspan
         y="316.59851"
         x="753.74451"
         id="tspan4627"
         sodipodi:role="line"
         style="font-size:24px;line-height:1">$3$~m</tspan><tspan
         y="340.59851"
         x="756.74451"
         id="tspan4629"
         sodipodi:role="line"
         style="font-size:24px;line-height:1"> </tspan></text>
    <text
       xml:space="preserve"
       style="font-style:normal;font-variant:normal;font-weight:normal;font-stretch:normal;line-height:0%;font-family:'Nimbus Roman No9 L';-inkscape-font-specification:'Nimbus Roman No9 L';text-align:center;writing-mode:lr-tb;text-anchor:middle;fill:#000000;fill-opacity:1;stroke:none"
       x="843.74451"
       y="316.59851"
       id="text4631"><tspan
         sodipodi:role="line"
         id="tspan4633"
         x="843.74451"
         y="316.59851"
         style="font-size:24px;line-height:1">$3$~m</tspan><tspan
         sodipodi:role="line"
         id="tspan4635"
         x="846.74451"
         y="340.59851"
         style="font-size:24px;line-height:1"> </tspan></text>
    <text
       id="text4637"
       y="316.59851"
       x="935.74451"
       style="font-style:normal;font-variant:normal;font-weight:normal;font-stretch:normal;line-height:0%;font-family:'Nimbus Roman No9 L';-inkscape-font-specification:'Nimbus Roman No9 L';text-align:center;writing-mode:lr-tb;text-anchor:middle;fill:#000000;fill-opacity:1;stroke:none"
       xml:space="preserve"><tspan
         y="316.59851"
         x="935.74451"
         id="tspan4639"
         sodipodi:role="line"
         style="font-size:24px;line-height:1">$3$~m</tspan><tspan
         y="340.59851"
         x="938.74451"
         id="tspan4641"
         sodipodi:role="line"
         style="font-size:24px;line-height:1"> </tspan></text>
    <text
       xml:space="preserve"
       style="font-style:normal;font-variant:normal;font-weight:normal;font-stretch:normal;line-height:0%;font-family:'Nimbus Roman No9 L';-inkscape-font-specification:'Nimbus Roman No9 L';text-align:center;writing-mode:lr-tb;text-anchor:middle;fill:#000000;fill-opacity:1;stroke:none"
       x="1027.7445"
       y="316.59851"
       id="text4643"><tspan
         sodipodi:role="line"
         id="tspan4645"
         x="1027.7445"
         y="316.59851"
         style="font-size:24px;line-height:1">$3$~m</tspan><tspan
         sodipodi:role="line"
         id="tspan4647"
         x="1030.7445"
         y="340.59851"
         style="font-size:24px;line-height:1"> </tspan></text>
    <text
       id="text4649"
       y="414.59851"
       x="1114.4803"
       style="font-style:normal;font-variant:normal;font-weight:normal;font-stretch:normal;line-height:0%;font-family:'Nimbus Roman No9 L';-inkscape-font-specification:'Nimbus Roman No9 L';text-align:start;writing-mode:lr-tb;text-anchor:start;fill:#000000;fill-opacity:1;stroke:none"
       xml:space="preserve"><tspan
         y="414.59851"
         x="1114.4803"
         id="tspan4651"
         sodipodi:role="line"
         style="font-size:24px;line-height:1">$3$~m</tspan><tspan
         y="438.59851"
         x="1114.4803"
         id="tspan4653"
         sodipodi:role="line"
         style="font-size:24px;line-height:1"> </tspan></text>
    <path
       id="path3155"
       d="m 1101.1166,353.92352 c 0,20 0,20 0,20"
       style="fill:none;stroke:#000000;stroke-width:2;stroke-linecap:butt;stroke-linejoin:miter;stroke-miterlimit:4;stroke-dasharray:none;stroke-opacity:1"
       inkscape:connector-curvature="0" />
    <path
       inkscape:connector-curvature="0"
       id="path3157"
       d="m 1078.1166,461.14115 c 0,47.1024 0,47.1024 0,47.1024"
       style="fill:none;stroke:#000000;stroke-width:2;stroke-linecap:butt;stroke-linejoin:miter;stroke-miterlimit:4;stroke-dasharray:none;stroke-opacity:1;marker-start:url(#Arrow1Mstart);marker-mid:url(#Arrow2Lstart);marker-end:none" />
    <text
       id="text3159"
       y="498.92352"
       x="1084.1166"
       style="font-style:normal;font-variant:normal;font-weight:normal;font-stretch:normal;line-height:0%;font-family:'Nimbus Roman No9 L';-inkscape-font-specification:'Nimbus Roman No9 L';text-align:start;writing-mode:lr-tb;text-anchor:start;fill:#000000;fill-opacity:1;stroke:none"
       xml:space="preserve"><tspan
         y="498.92352"
         x="1084.1166"
         id="tspan3161"
         sodipodi:role="line"
         style="font-size:24px;line-height:1">$80$~kN</tspan><tspan
         y="522.92352"
         x="1084.1166"
         id="tspan3163"
         sodipodi:role="line"
         style="font-size:24px;line-height:1"> </tspan></text>
    <path
       inkscape:connector-curvature="0"
       id="path3156"
       d="m 703.94691,365.9375 c -47.1024,0 -47.1024,0 -47.1024,0"
       style="fill:#000000;stroke:#000000;stroke-width:2;stroke-linecap:butt;stroke-linejoin:miter;stroke-miterlimit:4;stroke-dasharray:none;stroke-opacity:1;marker-start:url(#Arrow1Mstart);marker-mid:url(#Arrow2Lstart);marker-end:none" />
    <text
       xml:space="preserve"
       style="font-style:normal;font-variant:normal;font-weight:normal;font-stretch:normal;line-height:0%;font-family:'Nimbus Roman No9 L';-inkscape-font-specification:'Nimbus Roman No9 L';text-align:end;writing-mode:lr-tb;text-anchor:end;fill:#000000;fill-opacity:1;stroke:none"
       x="703.11664"
       y="353.92352"
       id="text3158"><tspan
         sodipodi:role="line"
         id="tspan3160"
         x="703.11664"
         y="353.92352"
         style="font-size:24px;line-height:1">$50$~kN</tspan><tspan
         sodipodi:role="line"
         id="tspan3162"
         x="709.11664"
         y="377.92352"
         style="font-size:24px;line-height:1"> </tspan></text>
    <flowRoot
       xml:space="preserve"
       id="flowRoot4146"
       style="font-style:normal;font-weight:normal;line-height:0.01%;font-family:sans-serif;text-align:start;letter-spacing:0px;word-spacing:0px;text-anchor:start;fill:#000000;fill-opacity:1;stroke:none"
       transform="translate(613.11661,299.15051)"><flowRegion
         id="flowRegion4148"
         style="font-family:sans-serif"><rect
           id="rect4150"
           width="192.5"
           height="93.5"
           x="27"
           y="51.77301"
           style="font-family:sans-serif" /></flowRegion><flowPara
         id="flowPara4152"
         style="font-size:40px;line-height:1.25;font-family:sans-serif"> </flowPara></flowRoot>  </g>
</svg>
