{
  "name": "Send Notification - Microsoft - Teams - REST",
  "tasks": {
    "workflow_start": {
      "name": "workflow_start",
      "groups": [],
      "x": -0.470335339638865,
      "y": 0.6465968586387435
    },
    "workflow_end": {
      "name": "workflow_end",
      "groups": [],
      "x": -0.00357653791130186,
      "y": 0.6606896551724138
    },
    "47cf": {
      "name": "createNotification",
      "canvasName": "createNotification",
      "summary": "Create Notification In MS Teams",
      "description": "Create a notification in MS teams using webhook key",
      "location": "Adapter",
      "locationType": "Msteams",
      "app": "Msteams",
      "type": "automatic",
      "displayName": "Msteams",
      "variables": {
        "incoming": {
          "text": "$var.job.text",
          "title": "$var.job.title",
          "webhookKey": "$var.job.webhookKey",
          "adapter_id": "$var.job.adapterId"
        },
        "outgoing": {
          "result": null
        },
        "error": "$var.job.errorMessage",
        "decorators": []
      },
      "groups": [],
      "actor": "Pronghorn",
      "x": -0.26655202063628547,
      "y": 0.6518324607329843,
      "scheduled": false
    }
  },
  "transitions": {
    "4971": {},
    "workflow_start": {
      "47cf": {
        "type": "standard",
        "state": "success"
      }
    },
    "workflow_end": {},
    "47cf": {
      "workflow_end": {
        "type": "standard",
        "state": "success"
      }
    },
    "d30a": {}
  },
  "inputSchema": {
    "type": "object",
    "properties": {
      "text": {
        "title": "text",
        "type": "string"
      },
      "title": {
        "title": "title",
        "type": "string"
      },
      "webhookKey": {
        "title": "webhookKey",
        "type": "string"
      },
      "adapterId": {
        "type": [
          "array",
          "boolean",
          "null",
          "number",
          "object",
          "string"
        ]
      }
    },
    "required": [
      "text",
      "title",
      "webhookKey",
      "adapterId"
    ]
  },
  "outputSchema": {
    "type": "object",
    "properties": {
      "text": {
        "title": "text",
        "type": "string"
      },
      "title": {
        "title": "title",
        "type": "string"
      },
      "webhookKey": {
        "title": "webhookKey",
        "type": "string"
      },
      "adapterId": {
        "type": [
          "array",
          "boolean",
          "null",
          "number",
          "object",
          "string"
        ]
      },
      "_id": {
        "type": "string",
        "pattern": "^[0-9a-f]{24}$"
      },
      "initiator": {
        "type": "string"
      },
      "errorMessage": {
        "type": [
          "array",
          "boolean",
          "null",
          "number",
          "object",
          "string"
        ]
      }
    }
  },
  "font_size": 12,
  "created": "2020-12-16T22:04:24.265Z",
  "created_by": {
    "provenance": "LDAP Server",
    "username": "abhansali",
    "firstname": "Ankit",
    "inactive": true
  },
  "createdVersion": "5.10.4-2020.1.22.0",
  "last_updated": "2023-08-11T15:12:16.230Z",
  "last_updated_by": {
    "provenance": "local_aaa",
    "username": "admin@pronghorn",
    "firstname": "admin",
    "inactive": false
  },
  "lastUpdatedVersion": "5.46.0-2023.1.9.0",
  "type": "automation",
  "preAutomationTime": 0,
  "sla": 0,
  "canvasVersion": 1.5,
  "tags": [],
  "groups": [],
  "migrationVersion": 2
}