{
  "tags": [],
  "name": "JunOS File Transfer Prechecks",
  "os": "",
  "passRule": true,
  "ignoreWarnings": false,
  "commands": [
    {
      "command": "rpc rpc-request-shell-execute request-shell-execute command \"ls -ltr <!localPath!><!fileName!>\"",
      "passRule": true,
      "rules": [
        {
          "rule": "No such file or directory",
          "eval": "contains",
          "severity": "error"
        }
      ]
    },
    {
      "command": "rpc rpc-request-shell-execute request-shell-execute command \"md5 <!localPath!><!fileName!>\"",
      "passRule": true,
      "rules": [
        {
          "rule": "No such file or directory",
          "eval": "contains",
          "severity": "error"
        }
      ]
    },
    {
      "command": "rpc rpc-request-shell-execute request-shell-execute command \"df <!localPath!>\"",
      "passRule": true,
      "rules": [
        {
          "rule": "/\\/\\S+\\s+\\d+\\s+\\d+\\s+(\\d+)/",
          "eval": "#comparison",
          "severity": "error",
          "ruleB": "<!FILESIZE!>",
          "evaluator": ">"
        }
      ]
    }
  ],
  "created": 1594066470087,
  "createdBy": "itential-artifacts",
  "lastUpdated": 1595446699693,
  "lastUpdatedBy": "itential-artifacts"
}