{
  "_id": "61bb6f46ea8dd201ecc4e60a",
  "name": "JunOS File Transfer",
  "description": "",
  "componentName": "JunOS File Transfer",
  "componentType": "workflows",
  "gbac": {
    "write": [],
    "read": []
  },
  "created": "2021-12-16T16:54:30.201Z",
  "createdBy": "zach.baskin@itential.com",
  "lastUpdated": "2021-12-16T16:54:30.201Z",
  "lastUpdatedBy": "zach.baskin@itential.com",
  "triggers": [
    {
      "_id": "61bb6f46ea8dd201ecc4e60b",
      "created": "2021-12-16T16:54:30.262Z",
      "createdBy": "zach.baskin@itential.com",
      "lastUpdated": "2021-12-16T16:54:30.262Z",
      "lastUpdatedBy": "zach.baskin@itential.com",
      "name": "Manual Trigger (migrated from JunOS File Transfer)",
      "type": "manual",
      "enabled": true,
      "actionType": "automations",
      "actionId": "61bb6f46ea8dd201ecc4e60a",
      "formId": "JunOS File Transfer",
      "formData": {
        "zeroTouch": true,
        "performMd5Check": true,
        "remoteServer": {
          "username": "root",
          "ipAddress": "172.20.100.211",
          "path": "/tmp/",
          "fileName": "txt.txt"
        },
        "ipAddress": "192.168.0.2",
        "path": "/tmp/",
        "fileName": "txt.txt",
        "localPath": "/var/tmp/",
        "deviceName": "vsrx01-atl"
      },
      "migrationVersion": 1
    }
  ]
}