{
  "$id": "schema.json",
  "type": "object",
  "schema": "http://json-schema.org/draft-07/schema#",
  "translate": true,
  "dynamicfields": true,
  "properties": {
    "ph_request_type": {
      "type": "string",
      "description": "type of request (internal to adapter)",
      "default": "retrieveInstancesScheduleState",
      "enum": [
        "retrieveInstancesScheduleState",
        "updateInstancesScheduleState"
      ],
      "external_name": "ph_request_type"
    },
    "groupName": {
      "type": "string",
      "description": "Group name",
      "parse": false,
      "encode": false,
      "encrypt": {
        "type": "AES",
        "key": ""
      },
      "external_name": "group_name"
    },
    "groupType": {
      "type": "string",
      "description": "Group type",
      "parse": false,
      "encode": false,
      "encrypt": {
        "type": "AES",
        "key": ""
      },
      "external_name": "group_type"
    }
  },
  "definitions": {}
}