{
  "$id": "schema.json",
  "type": "object",
  "schema": "http://json-schema.org/draft-07/schema#",
  "translate": true,
  "dynamicfields": true,
  "properties": {
    "ph_request_type": {
      "type": "string",
      "description": "type of request (internal to adapter)",
      "default": "retrieveLogsForDeviceGroup",
      "enum": [
        "retrieveLogsForDeviceGroup",
        "retrieveLogsForDeviceGroupService",
        "retrieveLogsForNetworkGroup",
        "retrieveLogsForNetworkGroupService"
      ],
      "external_name": "ph_request_type"
    },
    "deviceGroupName": {
      "type": "string",
      "description": "Device group name",
      "parse": false,
      "encode": false,
      "encrypt": {
        "type": "AES",
        "key": ""
      },
      "external_name": "device_group_name"
    },
    "serviceName": {
      "type": "string",
      "description": "Network group service name",
      "parse": false,
      "encode": false,
      "encrypt": {
        "type": "AES",
        "key": ""
      },
      "external_name": "service_name"
    },
    "numberOfLines": {
      "type": "number",
      "description": "Number of lines to show from the end of the logs",
      "parse": false,
      "encode": false,
      "encrypt": {
        "type": "AES",
        "key": ""
      },
      "external_name": "number_of_lines"
    },
    "networkGroupName": {
      "type": "string",
      "description": "Network group name",
      "parse": false,
      "encode": false,
      "encrypt": {
        "type": "AES",
        "key": ""
      },
      "external_name": "network_group_name"
    }
  },
  "definitions": {}
}