{
  "$id": "schema.json",
  "type": "object",
  "schema": "http://json-schema.org/draft-07/schema#",
  "translate": true,
  "dynamicfields": true,
  "properties": {
    "ph_request_type": {
      "type": "string",
      "description": "type of request (internal to adapter)",
      "default": "deleteHealthbotOrganizationSiteSiteById",
      "enum": [
        "deleteHealthbotOrganizationSiteSiteById",
        "retrieveHealthbotOrganizationSiteSiteById",
        "createHealthbotOrganizationSiteSiteById",
        "updateHealthbotOrganizationSiteSiteById",
        "deleteHealthbotOrganizationSiteEdgeEdgeById",
        "retrieveHealthbotOrganizationSiteEdgeEdgeById",
        "createHealthbotOrganizationSiteEdgeEdgeById",
        "updateHealthbotOrganizationSiteEdgeEdgeById"
      ],
      "external_name": "ph_request_type"
    },
    "organizationName": {
      "type": "string",
      "description": "ID of organization-name",
      "parse": false,
      "encode": false,
      "encrypt": {
        "type": "AES",
        "key": ""
      },
      "external_name": "organization_name"
    },
    "siteName": {
      "type": "string",
      "description": "ID of site-name",
      "parse": false,
      "encode": false,
      "encrypt": {
        "type": "AES",
        "key": ""
      },
      "external_name": "site_name"
    },
    "edgeName": {
      "type": "string",
      "description": "ID of edge-name",
      "parse": false,
      "encode": false,
      "encrypt": {
        "type": "AES",
        "key": ""
      },
      "external_name": "edge_name"
    }
  },
  "definitions": {}
}