[
  {
    "color": null,
    "event_name": "string",
    "frequency": 4,
    "timestamp": "string"
  },
  {
    "color": null,
    "event_name": "string",
    "frequency": 6,
    "timestamp": "string"
  }
]