[
  {
    "job-id": "string",
    "job-result": "string",
    "job-status": null
  },
  {
    "job-id": "string",
    "job-result": "string",
    "job-status": null
  },
  {
    "job-id": "string",
    "job-result": "string",
    "job-status": null
  },
  {
    "job-id": "string",
    "job-result": "string",
    "job-status": null
  }
]