[
  {
    "color": null,
    "event_name": "string",
    "frequency": 7,
    "timestamp": "string"
  },
  {
    "color": null,
    "event_name": "string",
    "frequency": 5,
    "timestamp": "string"
  },
  {
    "color": null,
    "event_name": "string",
    "frequency": 1,
    "timestamp": "string"
  }
]