{
  "name": "adapter-op5",
  "webName": "Adapter for Integration to ITRS OP5",
  "supportLevel": "community",
  "vendor": "ITRS",
  "product": "OP5",
  "techAlliance": false,
  "osVersion": [],
  "apiVersions": [],
  "iapVersions": [
    "2021.1.x",
    "2021.2.x",
    "2022.1.x",
    "2023.1.x"
  ],
  "method": "REST",
  "type": "Adapter",
  "domains": [
    "Service Assurance"
  ],
  "tags": [
    "Monitoring & Troubleshooting"
  ],
  "useCases": [
    "Add Device to Monitoring",
    "Automated network data gathering for diagnostics",
    "Verify network connectivity"
  ],
  "deprecated": {
    "isDeprecated": false
  },
  "brokerSince": "",
  "authMethods": [
    {
      "type": "Basic Auth",
      "primary": true
    }
  ],
  "documentation": {
    "storeLink": "",
    "npmLink": "https://www.npmjs.com/package/@itentialopensource/adapter-op5",
    "repoLink": "https://gitlab.com/itentialopensource/adapters/adapter-op5",
    "docLink": "https://gitlab.com/itentialopensource/adapters/adapter-op5/-/blob/master/README.md?ref_type=heads",
    "demoLinks": [],
    "trainingLinks": [
      {
        "title": "Itential Academy",
        "link": "https://www.itential.com/itential-academy/"
      }
    ],
    "faqLink": "https://docs.itential.com/opensource/docs/troubleshooting-an-adapter",
    "contributeLink": "https://gitlab.com/itentialopensource/adapters/contributing-guide",
    "issueLink": "https://itential.atlassian.net/servicedesk/customer/portals",
    "webLink": "https://www.itential.com/adapters/itrs-op5/",
    "vendorLink": "https://www.itrsgroup.com/",
    "productLink": "https://www.itrsgroup.com/products/network-monitoring-op5-monitor",
    "apiLinks": [
      {
        "title": "ITRS OP5 API",
        "link": "https://docs.itrsgroup.com/docs/op5-monitor/8.1.0/topics/api/monitor-api.html",
        "public": true
      }
    ],
    "workshopLinks": [],
    "workshopHomePage": "https://www.itential.com/get-started/"
  },
  "assets": [],
  "relatedItems": {
    "adapters": [],
    "integrations": [],
    "ecosystemApplications": [],
    "workflowProjects": [],
    "transformationProjects": [],
    "exampleProjects": []
  }
}