[
  {
    "createBody": "string",
    "credentials": {
      "name": "string",
      "type": "BEARER"
    },
    "enabled": true,
    "filter": "string",
    "headers": {},
    "integration": {
      "ticketIdRegex": "string",
      "type": "DATADOG"
    },
    "name": "string",
    "timeFormat": {
      "format": "YYYY-MM-DD'T'HH:mm:ss'Z'",
      "type": "FORMATTED"
    },
    "triggers": {
      "assigneeChange": {
        "enabled": true
      },
      "classChange": {
        "enabled": true
      },
      "created": {
        "enabled": true
      },
      "descriptionChange": {
        "enabled": false
      },
      "serviceChange": {
        "enabled": true
      },
      "severityChange": {
        "enabled": false
      },
      "statusChange": {
        "enabled": true
      },
      "tagsChange": {
        "enabled": false
      },
      "typeChange": {
        "enabled": false
      }
    },
    "type": "INCIDENT",
    "updateBody": "string",
    "updatesEnabled": true,
    "urls": {
      "close": {
        "url": "string",
        "verb": "PUT"
      },
      "create": {
        "url": "string",
        "verb": "PUT"
      },
      "update": {
        "url": "string",
        "verb": "PATCH"
      }
    },
    "createdBy": "string",
    "id": {
      "counter": 6,
      "randomValue1": 1,
      "randomValue2": 3,
      "timestamp": 3,
      "date": "string"
    },
    "lastError": {
      "additionalInfo": {},
      "data": {},
      "request": {
        "body": "string",
        "headers": {},
        "url": {
          "url": "string",
          "verb": "PATCH"
        }
      },
      "response": {
        "body": "string",
        "code": 5,
        "codeReason": "string"
      },
      "status": "INITIALISED",
      "timestamp": 9
    },
    "lastUpdated": {
      "nanos": 1,
      "seconds": 9,
      "epochSecond": 1,
      "nano": 6
    },
    "status": "DISABLED"
  },
  {
    "createBody": "string",
    "credentials": {
      "name": "string",
      "type": "BASIC"
    },
    "enabled": true,
    "filter": "string",
    "headers": {},
    "integration": {
      "ticketIdRegex": "string",
      "type": "SERVICENOW"
    },
    "name": "string",
    "timeFormat": {
      "format": "YYYY-MM-DD'T'HH:mm:ss'Z'",
      "type": "FORMATTED"
    },
    "triggers": {
      "assigneeChange": {
        "enabled": true
      },
      "classChange": {
        "enabled": false
      },
      "created": {
        "enabled": true
      },
      "descriptionChange": {
        "enabled": true
      },
      "serviceChange": {
        "enabled": false
      },
      "severityChange": {
        "enabled": false
      },
      "statusChange": {
        "enabled": true
      },
      "tagsChange": {
        "enabled": false
      },
      "typeChange": {
        "enabled": false
      }
    },
    "type": "ALERT",
    "updateBody": "string",
    "updatesEnabled": true,
    "urls": {
      "close": {
        "url": "string",
        "verb": "DELETE"
      },
      "create": {
        "url": "string",
        "verb": "PATCH"
      },
      "update": {
        "url": "string",
        "verb": "DELETE"
      }
    },
    "createdBy": "string",
    "id": {
      "counter": 6,
      "randomValue1": 10,
      "randomValue2": 9,
      "timestamp": 1,
      "date": "string"
    },
    "lastError": {
      "additionalInfo": {},
      "data": {},
      "request": {
        "body": "string",
        "headers": {},
        "url": {
          "url": "string",
          "verb": "DELETE"
        }
      },
      "response": {
        "body": "string",
        "code": 4,
        "codeReason": "string"
      },
      "status": "DISABLED",
      "timestamp": 1
    },
    "lastUpdated": {
      "nanos": 4,
      "seconds": 5,
      "epochSecond": 9,
      "nano": 1
    },
    "status": "DISABLED"
  }
]