[
  {
    "collector_version": "string",
    "name": "string",
    "parameters": {},
    "template": "string"
  },
  {
    "collector_version": "string",
    "name": "string",
    "parameters": {},
    "template": "string"
  },
  {
    "collector_version": "string",
    "name": "string",
    "parameters": {},
    "template": "string"
  }
]