{
  "status": "success",
  "data": {
    "alternateResults": [
      {
        "additional_data": {},
        "data": {},
        "datasource": "string",
        "engine": {
          "confidence": 2,
          "DETECTOR_CLASS": "string",
          "highSigma": 6,
          "highThreshold": 2,
          "holdfor": 3,
          "learning": true,
          "lowSigma": 5,
          "lowThreshold": 4,
          "median": 4,
          "severity": 9,
          "sigma": 6,
          "stateful": false,
          "vector": 1
        },
        "instance": "string",
        "tags": {},
        "timed_at_ms": 3,
        "unit": "string",
        "uuid": "string"
      },
      {
        "additional_data": {},
        "data": {},
        "datasource": "string",
        "engine": {
          "confidence": 10,
          "DETECTOR_CLASS": "string",
          "highSigma": 10,
          "highThreshold": 4,
          "holdfor": 2,
          "learning": false,
          "lowSigma": 3,
          "lowThreshold": 4,
          "median": 4,
          "severity": 8,
          "sigma": 1,
          "stateful": true,
          "vector": 4
        },
        "instance": "string",
        "tags": {},
        "timed_at_ms": 2,
        "unit": "string",
        "uuid": "string"
      },
      {
        "additional_data": {},
        "data": {},
        "datasource": "string",
        "engine": {
          "confidence": 10,
          "DETECTOR_CLASS": "string",
          "highSigma": 3,
          "highThreshold": 9,
          "holdfor": 7,
          "learning": false,
          "lowSigma": 8,
          "lowThreshold": 1,
          "median": 6,
          "severity": 4,
          "sigma": 8,
          "stateful": true,
          "vector": 9
        },
        "instance": "string",
        "tags": {},
        "timed_at_ms": 9,
        "unit": "string",
        "uuid": "string"
      },
      {
        "additional_data": {},
        "data": {},
        "datasource": "string",
        "engine": {
          "confidence": 4,
          "DETECTOR_CLASS": "string",
          "highSigma": 6,
          "highThreshold": 5,
          "holdfor": 10,
          "learning": false,
          "lowSigma": 2,
          "lowThreshold": 7,
          "median": 5,
          "severity": 1,
          "sigma": 3,
          "stateful": false,
          "vector": 10
        },
        "instance": "string",
        "tags": {},
        "timed_at_ms": 6,
        "unit": "string",
        "uuid": "string"
      },
      {
        "additional_data": {},
        "data": {},
        "datasource": "string",
        "engine": {
          "confidence": 5,
          "DETECTOR_CLASS": "string",
          "highSigma": 6,
          "highThreshold": 3,
          "holdfor": 5,
          "learning": true,
          "lowSigma": 6,
          "lowThreshold": 3,
          "median": 8,
          "severity": 5,
          "sigma": 8,
          "stateful": false,
          "vector": 9
        },
        "instance": "string",
        "tags": {},
        "timed_at_ms": 2,
        "unit": "string",
        "uuid": "string"
      },
      {
        "additional_data": {},
        "data": {},
        "datasource": "string",
        "engine": {
          "confidence": 3,
          "DETECTOR_CLASS": "string",
          "highSigma": 9,
          "highThreshold": 8,
          "holdfor": 2,
          "learning": false,
          "lowSigma": 3,
          "lowThreshold": 3,
          "median": 2,
          "severity": 2,
          "sigma": 5,
          "stateful": true,
          "vector": 6
        },
        "instance": "string",
        "tags": {},
        "timed_at_ms": 4,
        "unit": "string",
        "uuid": "string"
      },
      {
        "additional_data": {},
        "data": {},
        "datasource": "string",
        "engine": {
          "confidence": 5,
          "DETECTOR_CLASS": "string",
          "highSigma": 2,
          "highThreshold": 7,
          "holdfor": 4,
          "learning": false,
          "lowSigma": 7,
          "lowThreshold": 6,
          "median": 9,
          "severity": 8,
          "sigma": 3,
          "stateful": true,
          "vector": 4
        },
        "instance": "string",
        "tags": {},
        "timed_at_ms": 8,
        "unit": "string",
        "uuid": "string"
      },
      {
        "additional_data": {},
        "data": {},
        "datasource": "string",
        "engine": {
          "confidence": 7,
          "DETECTOR_CLASS": "string",
          "highSigma": 7,
          "highThreshold": 2,
          "holdfor": 6,
          "learning": false,
          "lowSigma": 6,
          "lowThreshold": 9,
          "median": 4,
          "severity": 3,
          "sigma": 2,
          "stateful": false,
          "vector": 3
        },
        "instance": "string",
        "tags": {},
        "timed_at_ms": 3,
        "unit": "string",
        "uuid": "string"
      }
    ],
    "alternateSource": "string",
    "comparisons": [
      {
        "mongo_value": 10,
        "prom_value": 3,
        "timedAtMs": 2,
        "matched": true
      }
    ],
    "interleveDebug": "string",
    "lastTimeThereWasData": 3,
    "results": [
      {
        "additional_data": {},
        "data": {},
        "datasource": "string",
        "engine": {
          "confidence": 1,
          "DETECTOR_CLASS": "string",
          "highSigma": 7,
          "highThreshold": 4,
          "holdfor": 7,
          "learning": false,
          "lowSigma": 6,
          "lowThreshold": 4,
          "median": 5,
          "severity": 1,
          "sigma": 10,
          "stateful": true,
          "vector": 4
        },
        "instance": "string",
        "tags": {},
        "timed_at_ms": 4,
        "unit": "string",
        "uuid": "string"
      },
      {
        "additional_data": {},
        "data": {},
        "datasource": "string",
        "engine": {
          "confidence": 8,
          "DETECTOR_CLASS": "string",
          "highSigma": 8,
          "highThreshold": 2,
          "holdfor": 6,
          "learning": false,
          "lowSigma": 4,
          "lowThreshold": 8,
          "median": 10,
          "severity": 1,
          "sigma": 10,
          "stateful": true,
          "vector": 5
        },
        "instance": "string",
        "tags": {},
        "timed_at_ms": 7,
        "unit": "string",
        "uuid": "string"
      },
      {
        "additional_data": {},
        "data": {},
        "datasource": "string",
        "engine": {
          "confidence": 6,
          "DETECTOR_CLASS": "string",
          "highSigma": 3,
          "highThreshold": 10,
          "holdfor": 4,
          "learning": true,
          "lowSigma": 8,
          "lowThreshold": 2,
          "median": 7,
          "severity": 5,
          "sigma": 10,
          "stateful": true,
          "vector": 6
        },
        "instance": "string",
        "tags": {},
        "timed_at_ms": 10,
        "unit": "string",
        "uuid": "string"
      },
      {
        "additional_data": {},
        "data": {},
        "datasource": "string",
        "engine": {
          "confidence": 1,
          "DETECTOR_CLASS": "string",
          "highSigma": 1,
          "highThreshold": 6,
          "holdfor": 5,
          "learning": false,
          "lowSigma": 1,
          "lowThreshold": 3,
          "median": 9,
          "severity": 7,
          "sigma": 4,
          "stateful": false,
          "vector": 5
        },
        "instance": "string",
        "tags": {},
        "timed_at_ms": 7,
        "unit": "string",
        "uuid": "string"
      },
      {
        "additional_data": {},
        "data": {},
        "datasource": "string",
        "engine": {
          "confidence": 5,
          "DETECTOR_CLASS": "string",
          "highSigma": 10,
          "highThreshold": 3,
          "holdfor": 10,
          "learning": true,
          "lowSigma": 7,
          "lowThreshold": 9,
          "median": 1,
          "severity": 1,
          "sigma": 2,
          "stateful": false,
          "vector": 4
        },
        "instance": "string",
        "tags": {},
        "timed_at_ms": 1,
        "unit": "string",
        "uuid": "string"
      },
      {
        "additional_data": {},
        "data": {},
        "datasource": "string",
        "engine": {
          "confidence": 1,
          "DETECTOR_CLASS": "string",
          "highSigma": 8,
          "highThreshold": 1,
          "holdfor": 2,
          "learning": false,
          "lowSigma": 9,
          "lowThreshold": 7,
          "median": 7,
          "severity": 1,
          "sigma": 4,
          "stateful": true,
          "vector": 5
        },
        "instance": "string",
        "tags": {},
        "timed_at_ms": 3,
        "unit": "string",
        "uuid": "string"
      },
      {
        "additional_data": {},
        "data": {},
        "datasource": "string",
        "engine": {
          "confidence": 7,
          "DETECTOR_CLASS": "string",
          "highSigma": 8,
          "highThreshold": 8,
          "holdfor": 9,
          "learning": false,
          "lowSigma": 6,
          "lowThreshold": 6,
          "median": 8,
          "severity": 1,
          "sigma": 3,
          "stateful": true,
          "vector": 4
        },
        "instance": "string",
        "tags": {},
        "timed_at_ms": 6,
        "unit": "string",
        "uuid": "string"
      },
      {
        "additional_data": {},
        "data": {},
        "datasource": "string",
        "engine": {
          "confidence": 10,
          "DETECTOR_CLASS": "string",
          "highSigma": 1,
          "highThreshold": 9,
          "holdfor": 8,
          "learning": true,
          "lowSigma": 4,
          "lowThreshold": 5,
          "median": 1,
          "severity": 4,
          "sigma": 3,
          "stateful": true,
          "vector": 6
        },
        "instance": "string",
        "tags": {},
        "timed_at_ms": 1,
        "unit": "string",
        "uuid": "string"
      }
    ],
    "total": 2
  }
}