{
  "status": "success",
  "data": {
    "alertCount": 4,
    "alertCountTimeMillis": 6,
    "anomalyCount": 3,
    "anomalyCountTimeMillis": 7,
    "anomalyDetected": true,
    "anomalyDetectedTimeMillis": 8,
    "correlationModified": true,
    "correlationModifiedTimeMillis": 10,
    "datumCount": 9,
    "datumCountTimeMillis": 9,
    "eventCount": 2,
    "eventCountTimeMillis": 10,
    "eventsIngested": true,
    "eventsIngestedTimeMillis": 5,
    "incidentCount": 5,
    "incidentCountTimeMillis": 10,
    "instanceOwner": "string",
    "lastUpdatedTimeMillis": 8,
    "metricsIngested": true,
    "metricsIngestedTimeMillis": 10,
    "multiAlertIncidentCreated": false,
    "multiAlertIncidentCreatedTimeMillis": 4,
    "userLoggedIn": false,
    "userLoggedInTimeMillis": 10,
    "version": "string"
  }
}