[
  {
    "collector_id": {
      "counter": 10,
      "randomValue1": 8,
      "randomValue2": 8,
      "timestamp": 1,
      "date": "string"
    },
    "collector_version": "string",
    "configuration": {},
    "enabled": false,
    "plugin_name": "string",
    "id": {
      "counter": 8,
      "randomValue1": 8,
      "randomValue2": 10,
      "timestamp": 1,
      "date": "string"
    }
  }
]