{
  "status": "success",
  "data": [
    {
      "detector": {},
      "fully_qualified_moob": "string",
      "metric": "string",
      "uuid": "string",
      "version": "string"
    },
    {
      "detector": {},
      "fully_qualified_moob": "string",
      "metric": "string",
      "uuid": "string",
      "version": "string"
    },
    {
      "detector": {},
      "fully_qualified_moob": "string",
      "metric": "string",
      "uuid": "string",
      "version": "string"
    },
    {
      "detector": {},
      "fully_qualified_moob": "string",
      "metric": "string",
      "uuid": "string",
      "version": "string"
    },
    {
      "detector": {},
      "fully_qualified_moob": "string",
      "metric": "string",
      "uuid": "string",
      "version": "string"
    },
    {
      "detector": {},
      "fully_qualified_moob": "string",
      "metric": "string",
      "uuid": "string",
      "version": "string"
    },
    {
      "detector": {},
      "fully_qualified_moob": "string",
      "metric": "string",
      "uuid": "string",
      "version": "string"
    }
  ]
}