{
  "template": {},
  "testLocation": null,
  "groupId": 1,
  "overallAlertLevel": "warn",
  "pollingInterval": 5,
  "description": "Monitor Ebay site response times",
  "disableAlerting": true,
  "type": "webcheck",
  "lastUpdated": 5,
  "stopMonitoringByFolder": true,
  "id": 7,
  "stopMonitoring": true,
  "userPermission": "string",
  "individualSmAlertEnable": false,
  "checkpoints": [
    {
      "geoInfo": "string",
      "id": 10,
      "smgId": 3
    },
    {
      "geoInfo": "string",
      "id": 3,
      "smgId": 7
    },
    {
      "geoInfo": "string",
      "id": 9,
      "smgId": 4
    },
    {
      "geoInfo": "string",
      "id": 9,
      "smgId": 3
    },
    {
      "geoInfo": "string",
      "id": 7,
      "smgId": 8
    },
    {
      "geoInfo": "string",
      "id": 10,
      "smgId": 1
    },
    {
      "geoInfo": "string",
      "id": 2,
      "smgId": 4
    },
    {
      "geoInfo": "string",
      "id": 4,
      "smgId": 10
    },
    {
      "geoInfo": "string",
      "id": 6,
      "smgId": 3
    },
    {
      "geoInfo": "string",
      "id": 9,
      "smgId": 6
    }
  ],
  "transition": 1,
  "globalSmAlertCond": 3,
  "isInternal": true,
  "collectors": [
    {
      "hostname": "string",
      "collectorGroupName": "string",
      "collectorGroupId": 2,
      "description": "string",
      "id": 8,
      "status": "string"
    },
    {
      "hostname": "string",
      "collectorGroupName": "string",
      "collectorGroupId": 1,
      "description": "string",
      "id": 2,
      "status": "string"
    },
    {
      "hostname": "string",
      "collectorGroupName": "string",
      "collectorGroupId": 4,
      "description": "string",
      "id": 8,
      "status": "string"
    },
    {
      "hostname": "string",
      "collectorGroupName": "string",
      "collectorGroupId": 8,
      "description": "string",
      "id": 3,
      "status": "string"
    },
    {
      "hostname": "string",
      "collectorGroupName": "string",
      "collectorGroupId": 3,
      "description": "string",
      "id": 3,
      "status": "string"
    },
    {
      "hostname": "string",
      "collectorGroupName": "string",
      "collectorGroupId": 5,
      "description": "string",
      "id": 3,
      "status": "string"
    },
    {
      "hostname": "string",
      "collectorGroupName": "string",
      "collectorGroupId": 10,
      "description": "string",
      "id": 1,
      "status": "string"
    },
    {
      "hostname": "string",
      "collectorGroupName": "string",
      "collectorGroupId": 7,
      "description": "string",
      "id": 6,
      "status": "string"
    }
  ],
  "name": "Ebay",
  "useDefaultLocationSetting": false,
  "useDefaultAlertSetting": true,
  "individualAlertLevel": "warn",
  "properties": [
    {
      "name": "addr",
      "value": "127.0.0.1"
    },
    {
      "name": "addr",
      "value": "127.0.0.1"
    },
    {
      "name": "addr",
      "value": "127.0.0.1"
    },
    {
      "name": "addr",
      "value": "127.0.0.1"
    },
    {
      "name": "addr",
      "value": "127.0.0.1"
    },
    {
      "name": "addr",
      "value": "127.0.0.1"
    },
    {
      "name": "addr",
      "value": "127.0.0.1"
    },
    {
      "name": "addr",
      "value": "127.0.0.1"
    }
  ],
  "status": "string"
}