{
  "$id": "schema.json",
  "type": "object",
  "schema": "http://json-schema.org/draft-07/schema#",
  "translate": false,
  "dynamicfields": true,
  "properties": {
    "ph_request_type": {
      "type": "string",
      "description": "type of request (internal to adapter)",
      "default": "getImmediateDeviceListByDeviceGroupId",
      "enum": [
        "getImmediateDeviceListByDeviceGroupId",
        "getDeviceGroupDatasourceList",
        "getAwsExternalId",
        "addDeviceGroupProperty",
        "getDeviceGroupPropertyList",
        "patchDeviceGroupById",
        "getDeviceGroupById",
        "deleteDeviceGroupById",
        "updateDeviceGroupById",
        "addDeviceGroup",
        "getDeviceGroupList",
        "getSDTHistoryByDeviceGroupId",
        "patchDeviceGroupPropertyByName",
        "getDeviceGroupPropertyByName",
        "deleteDeviceGroupPropertyByName",
        "updateDeviceGroupPropertyByName",
        "patchDeviceGroupDatasourceById",
        "getDeviceGroupDatasourceById",
        "updateDeviceGroupDatasourceById",
        "getDeviceGroupSDTList",
        "getAlertListByDeviceGroupId"
      ],
      "external_name": "ph_request_type"
    }
  },
  "definitions": {}
}