{
  "inAlerting": true,
  "throttlingAlerts": 40,
  "enableThrottling": true,
  "destinations": [
    {
      "period": {
        "weekDays": [
          2,
          10,
          5,
          7,
          5,
          1
        ],
        "timezone": "string",
        "startMinutes": 7,
        "endMinutes": 7
      },
      "stages": [
        [
          {
            "method": "EMAIL",
            "contact": "string",
            "type": "Admin",
            "addr": "john.doe@logicmonitor.com"
          },
          {
            "method": "EMAIL",
            "contact": "string",
            "type": "Admin",
            "addr": "john.doe@logicmonitor.com"
          },
          {
            "method": "EMAIL",
            "contact": "string",
            "type": "Admin",
            "addr": "john.doe@logicmonitor.com"
          },
          {
            "method": "EMAIL",
            "contact": "string",
            "type": "Admin",
            "addr": "john.doe@logicmonitor.com"
          }
        ],
        [
          {
            "method": "EMAIL",
            "contact": "string",
            "type": "Admin",
            "addr": "john.doe@logicmonitor.com"
          },
          {
            "method": "EMAIL",
            "contact": "string",
            "type": "Admin",
            "addr": "john.doe@logicmonitor.com"
          },
          {
            "method": "EMAIL",
            "contact": "string",
            "type": "Admin",
            "addr": "john.doe@logicmonitor.com"
          },
          {
            "method": "EMAIL",
            "contact": "string",
            "type": "Admin",
            "addr": "john.doe@logicmonitor.com"
          }
        ],
        [
          {
            "method": "EMAIL",
            "contact": "string",
            "type": "Admin",
            "addr": "john.doe@logicmonitor.com"
          }
        ]
      ],
      "type": "string"
    },
    {
      "period": {
        "weekDays": [
          10,
          1,
          4,
          4,
          10
        ],
        "timezone": "string",
        "startMinutes": 7,
        "endMinutes": 2
      },
      "stages": [
        [
          {
            "method": "EMAIL",
            "contact": "string",
            "type": "Admin",
            "addr": "john.doe@logicmonitor.com"
          },
          {
            "method": "EMAIL",
            "contact": "string",
            "type": "Admin",
            "addr": "john.doe@logicmonitor.com"
          },
          {
            "method": "EMAIL",
            "contact": "string",
            "type": "Admin",
            "addr": "john.doe@logicmonitor.com"
          }
        ],
        [
          {
            "method": "EMAIL",
            "contact": "string",
            "type": "Admin",
            "addr": "john.doe@logicmonitor.com"
          }
        ],
        [
          {
            "method": "EMAIL",
            "contact": "string",
            "type": "Admin",
            "addr": "john.doe@logicmonitor.com"
          },
          {
            "method": "EMAIL",
            "contact": "string",
            "type": "Admin",
            "addr": "john.doe@logicmonitor.com"
          }
        ],
        [
          {
            "method": "EMAIL",
            "contact": "string",
            "type": "Admin",
            "addr": "john.doe@logicmonitor.com"
          },
          {
            "method": "EMAIL",
            "contact": "string",
            "type": "Admin",
            "addr": "john.doe@logicmonitor.com"
          },
          {
            "method": "EMAIL",
            "contact": "string",
            "type": "Admin",
            "addr": "john.doe@logicmonitor.com"
          },
          {
            "method": "EMAIL",
            "contact": "string",
            "type": "Admin",
            "addr": "john.doe@logicmonitor.com"
          },
          {
            "method": "EMAIL",
            "contact": "string",
            "type": "Admin",
            "addr": "john.doe@logicmonitor.com"
          }
        ],
        [
          {
            "method": "EMAIL",
            "contact": "string",
            "type": "Admin",
            "addr": "john.doe@logicmonitor.com"
          },
          {
            "method": "EMAIL",
            "contact": "string",
            "type": "Admin",
            "addr": "john.doe@logicmonitor.com"
          },
          {
            "method": "EMAIL",
            "contact": "string",
            "type": "Admin",
            "addr": "john.doe@logicmonitor.com"
          },
          {
            "method": "EMAIL",
            "contact": "string",
            "type": "Admin",
            "addr": "john.doe@logicmonitor.com"
          },
          {
            "method": "EMAIL",
            "contact": "string",
            "type": "Admin",
            "addr": "john.doe@logicmonitor.com"
          }
        ],
        [
          {
            "method": "EMAIL",
            "contact": "string",
            "type": "Admin",
            "addr": "john.doe@logicmonitor.com"
          },
          {
            "method": "EMAIL",
            "contact": "string",
            "type": "Admin",
            "addr": "john.doe@logicmonitor.com"
          },
          {
            "method": "EMAIL",
            "contact": "string",
            "type": "Admin",
            "addr": "john.doe@logicmonitor.com"
          },
          {
            "method": "EMAIL",
            "contact": "string",
            "type": "Admin",
            "addr": "john.doe@logicmonitor.com"
          },
          {
            "method": "EMAIL",
            "contact": "string",
            "type": "Admin",
            "addr": "john.doe@logicmonitor.com"
          },
          {
            "method": "EMAIL",
            "contact": "string",
            "type": "Admin",
            "addr": "john.doe@logicmonitor.com"
          },
          {
            "method": "EMAIL",
            "contact": "string",
            "type": "Admin",
            "addr": "john.doe@logicmonitor.com"
          }
        ],
        [
          {
            "method": "EMAIL",
            "contact": "string",
            "type": "Admin",
            "addr": "john.doe@logicmonitor.com"
          },
          {
            "method": "EMAIL",
            "contact": "string",
            "type": "Admin",
            "addr": "john.doe@logicmonitor.com"
          },
          {
            "method": "EMAIL",
            "contact": "string",
            "type": "Admin",
            "addr": "john.doe@logicmonitor.com"
          },
          {
            "method": "EMAIL",
            "contact": "string",
            "type": "Admin",
            "addr": "john.doe@logicmonitor.com"
          },
          {
            "method": "EMAIL",
            "contact": "string",
            "type": "Admin",
            "addr": "john.doe@logicmonitor.com"
          },
          {
            "method": "EMAIL",
            "contact": "string",
            "type": "Admin",
            "addr": "john.doe@logicmonitor.com"
          },
          {
            "method": "EMAIL",
            "contact": "string",
            "type": "Admin",
            "addr": "john.doe@logicmonitor.com"
          }
        ],
        [
          {
            "method": "EMAIL",
            "contact": "string",
            "type": "Admin",
            "addr": "john.doe@logicmonitor.com"
          },
          {
            "method": "EMAIL",
            "contact": "string",
            "type": "Admin",
            "addr": "john.doe@logicmonitor.com"
          },
          {
            "method": "EMAIL",
            "contact": "string",
            "type": "Admin",
            "addr": "john.doe@logicmonitor.com"
          }
        ],
        [
          {
            "method": "EMAIL",
            "contact": "string",
            "type": "Admin",
            "addr": "john.doe@logicmonitor.com"
          },
          {
            "method": "EMAIL",
            "contact": "string",
            "type": "Admin",
            "addr": "john.doe@logicmonitor.com"
          }
        ],
        [
          {
            "method": "EMAIL",
            "contact": "string",
            "type": "Admin",
            "addr": "john.doe@logicmonitor.com"
          },
          {
            "method": "EMAIL",
            "contact": "string",
            "type": "Admin",
            "addr": "john.doe@logicmonitor.com"
          },
          {
            "method": "EMAIL",
            "contact": "string",
            "type": "Admin",
            "addr": "john.doe@logicmonitor.com"
          },
          {
            "method": "EMAIL",
            "contact": "string",
            "type": "Admin",
            "addr": "john.doe@logicmonitor.com"
          },
          {
            "method": "EMAIL",
            "contact": "string",
            "type": "Admin",
            "addr": "john.doe@logicmonitor.com"
          },
          {
            "method": "EMAIL",
            "contact": "string",
            "type": "Admin",
            "addr": "john.doe@logicmonitor.com"
          },
          {
            "method": "EMAIL",
            "contact": "string",
            "type": "Admin",
            "addr": "john.doe@logicmonitor.com"
          },
          {
            "method": "EMAIL",
            "contact": "string",
            "type": "Admin",
            "addr": "john.doe@logicmonitor.com"
          },
          {
            "method": "EMAIL",
            "contact": "string",
            "type": "Admin",
            "addr": "john.doe@logicmonitor.com"
          },
          {
            "method": "EMAIL",
            "contact": "string",
            "type": "Admin",
            "addr": "john.doe@logicmonitor.com"
          }
        ]
      ],
      "type": "string"
    },
    {
      "period": {
        "weekDays": [
          5,
          9,
          6,
          8,
          2,
          8
        ],
        "timezone": "string",
        "startMinutes": 6,
        "endMinutes": 7
      },
      "stages": [
        [
          {
            "method": "EMAIL",
            "contact": "string",
            "type": "Admin",
            "addr": "john.doe@logicmonitor.com"
          },
          {
            "method": "EMAIL",
            "contact": "string",
            "type": "Admin",
            "addr": "john.doe@logicmonitor.com"
          },
          {
            "method": "EMAIL",
            "contact": "string",
            "type": "Admin",
            "addr": "john.doe@logicmonitor.com"
          },
          {
            "method": "EMAIL",
            "contact": "string",
            "type": "Admin",
            "addr": "john.doe@logicmonitor.com"
          },
          {
            "method": "EMAIL",
            "contact": "string",
            "type": "Admin",
            "addr": "john.doe@logicmonitor.com"
          },
          {
            "method": "EMAIL",
            "contact": "string",
            "type": "Admin",
            "addr": "john.doe@logicmonitor.com"
          },
          {
            "method": "EMAIL",
            "contact": "string",
            "type": "Admin",
            "addr": "john.doe@logicmonitor.com"
          },
          {
            "method": "EMAIL",
            "contact": "string",
            "type": "Admin",
            "addr": "john.doe@logicmonitor.com"
          }
        ],
        [
          {
            "method": "EMAIL",
            "contact": "string",
            "type": "Admin",
            "addr": "john.doe@logicmonitor.com"
          },
          {
            "method": "EMAIL",
            "contact": "string",
            "type": "Admin",
            "addr": "john.doe@logicmonitor.com"
          }
        ],
        [
          {
            "method": "EMAIL",
            "contact": "string",
            "type": "Admin",
            "addr": "john.doe@logicmonitor.com"
          },
          {
            "method": "EMAIL",
            "contact": "string",
            "type": "Admin",
            "addr": "john.doe@logicmonitor.com"
          },
          {
            "method": "EMAIL",
            "contact": "string",
            "type": "Admin",
            "addr": "john.doe@logicmonitor.com"
          }
        ],
        [
          {
            "method": "EMAIL",
            "contact": "string",
            "type": "Admin",
            "addr": "john.doe@logicmonitor.com"
          },
          {
            "method": "EMAIL",
            "contact": "string",
            "type": "Admin",
            "addr": "john.doe@logicmonitor.com"
          }
        ],
        [
          {
            "method": "EMAIL",
            "contact": "string",
            "type": "Admin",
            "addr": "john.doe@logicmonitor.com"
          }
        ],
        [
          {
            "method": "EMAIL",
            "contact": "string",
            "type": "Admin",
            "addr": "john.doe@logicmonitor.com"
          },
          {
            "method": "EMAIL",
            "contact": "string",
            "type": "Admin",
            "addr": "john.doe@logicmonitor.com"
          },
          {
            "method": "EMAIL",
            "contact": "string",
            "type": "Admin",
            "addr": "john.doe@logicmonitor.com"
          },
          {
            "method": "EMAIL",
            "contact": "string",
            "type": "Admin",
            "addr": "john.doe@logicmonitor.com"
          },
          {
            "method": "EMAIL",
            "contact": "string",
            "type": "Admin",
            "addr": "john.doe@logicmonitor.com"
          },
          {
            "method": "EMAIL",
            "contact": "string",
            "type": "Admin",
            "addr": "john.doe@logicmonitor.com"
          }
        ]
      ],
      "type": "string"
    },
    {
      "period": {
        "weekDays": [
          10,
          9,
          9,
          5,
          4,
          8,
          9,
          7,
          5
        ],
        "timezone": "string",
        "startMinutes": 6,
        "endMinutes": 1
      },
      "stages": [
        [
          {
            "method": "EMAIL",
            "contact": "string",
            "type": "Admin",
            "addr": "john.doe@logicmonitor.com"
          }
        ]
      ],
      "type": "string"
    },
    {
      "period": {
        "weekDays": [
          5,
          10,
          7,
          4
        ],
        "timezone": "string",
        "startMinutes": 3,
        "endMinutes": 5
      },
      "stages": [
        [
          {
            "method": "EMAIL",
            "contact": "string",
            "type": "Admin",
            "addr": "john.doe@logicmonitor.com"
          },
          {
            "method": "EMAIL",
            "contact": "string",
            "type": "Admin",
            "addr": "john.doe@logicmonitor.com"
          }
        ],
        [
          {
            "method": "EMAIL",
            "contact": "string",
            "type": "Admin",
            "addr": "john.doe@logicmonitor.com"
          },
          {
            "method": "EMAIL",
            "contact": "string",
            "type": "Admin",
            "addr": "john.doe@logicmonitor.com"
          },
          {
            "method": "EMAIL",
            "contact": "string",
            "type": "Admin",
            "addr": "john.doe@logicmonitor.com"
          },
          {
            "method": "EMAIL",
            "contact": "string",
            "type": "Admin",
            "addr": "john.doe@logicmonitor.com"
          },
          {
            "method": "EMAIL",
            "contact": "string",
            "type": "Admin",
            "addr": "john.doe@logicmonitor.com"
          },
          {
            "method": "EMAIL",
            "contact": "string",
            "type": "Admin",
            "addr": "john.doe@logicmonitor.com"
          }
        ],
        [
          {
            "method": "EMAIL",
            "contact": "string",
            "type": "Admin",
            "addr": "john.doe@logicmonitor.com"
          },
          {
            "method": "EMAIL",
            "contact": "string",
            "type": "Admin",
            "addr": "john.doe@logicmonitor.com"
          },
          {
            "method": "EMAIL",
            "contact": "string",
            "type": "Admin",
            "addr": "john.doe@logicmonitor.com"
          },
          {
            "method": "EMAIL",
            "contact": "string",
            "type": "Admin",
            "addr": "john.doe@logicmonitor.com"
          },
          {
            "method": "EMAIL",
            "contact": "string",
            "type": "Admin",
            "addr": "john.doe@logicmonitor.com"
          },
          {
            "method": "EMAIL",
            "contact": "string",
            "type": "Admin",
            "addr": "john.doe@logicmonitor.com"
          }
        ],
        [
          {
            "method": "EMAIL",
            "contact": "string",
            "type": "Admin",
            "addr": "john.doe@logicmonitor.com"
          },
          {
            "method": "EMAIL",
            "contact": "string",
            "type": "Admin",
            "addr": "john.doe@logicmonitor.com"
          },
          {
            "method": "EMAIL",
            "contact": "string",
            "type": "Admin",
            "addr": "john.doe@logicmonitor.com"
          },
          {
            "method": "EMAIL",
            "contact": "string",
            "type": "Admin",
            "addr": "john.doe@logicmonitor.com"
          },
          {
            "method": "EMAIL",
            "contact": "string",
            "type": "Admin",
            "addr": "john.doe@logicmonitor.com"
          },
          {
            "method": "EMAIL",
            "contact": "string",
            "type": "Admin",
            "addr": "john.doe@logicmonitor.com"
          }
        ],
        [
          {
            "method": "EMAIL",
            "contact": "string",
            "type": "Admin",
            "addr": "john.doe@logicmonitor.com"
          },
          {
            "method": "EMAIL",
            "contact": "string",
            "type": "Admin",
            "addr": "john.doe@logicmonitor.com"
          }
        ],
        [
          {
            "method": "EMAIL",
            "contact": "string",
            "type": "Admin",
            "addr": "john.doe@logicmonitor.com"
          },
          {
            "method": "EMAIL",
            "contact": "string",
            "type": "Admin",
            "addr": "john.doe@logicmonitor.com"
          },
          {
            "method": "EMAIL",
            "contact": "string",
            "type": "Admin",
            "addr": "john.doe@logicmonitor.com"
          },
          {
            "method": "EMAIL",
            "contact": "string",
            "type": "Admin",
            "addr": "john.doe@logicmonitor.com"
          },
          {
            "method": "EMAIL",
            "contact": "string",
            "type": "Admin",
            "addr": "john.doe@logicmonitor.com"
          }
        ],
        [
          {
            "method": "EMAIL",
            "contact": "string",
            "type": "Admin",
            "addr": "john.doe@logicmonitor.com"
          },
          {
            "method": "EMAIL",
            "contact": "string",
            "type": "Admin",
            "addr": "john.doe@logicmonitor.com"
          },
          {
            "method": "EMAIL",
            "contact": "string",
            "type": "Admin",
            "addr": "john.doe@logicmonitor.com"
          },
          {
            "method": "EMAIL",
            "contact": "string",
            "type": "Admin",
            "addr": "john.doe@logicmonitor.com"
          }
        ],
        [
          {
            "method": "EMAIL",
            "contact": "string",
            "type": "Admin",
            "addr": "john.doe@logicmonitor.com"
          },
          {
            "method": "EMAIL",
            "contact": "string",
            "type": "Admin",
            "addr": "john.doe@logicmonitor.com"
          },
          {
            "method": "EMAIL",
            "contact": "string",
            "type": "Admin",
            "addr": "john.doe@logicmonitor.com"
          },
          {
            "method": "EMAIL",
            "contact": "string",
            "type": "Admin",
            "addr": "john.doe@logicmonitor.com"
          },
          {
            "method": "EMAIL",
            "contact": "string",
            "type": "Admin",
            "addr": "john.doe@logicmonitor.com"
          },
          {
            "method": "EMAIL",
            "contact": "string",
            "type": "Admin",
            "addr": "john.doe@logicmonitor.com"
          },
          {
            "method": "EMAIL",
            "contact": "string",
            "type": "Admin",
            "addr": "john.doe@logicmonitor.com"
          },
          {
            "method": "EMAIL",
            "contact": "string",
            "type": "Admin",
            "addr": "john.doe@logicmonitor.com"
          }
        ]
      ],
      "type": "string"
    },
    {
      "period": {
        "weekDays": [
          1,
          3,
          4,
          7,
          4,
          6,
          5,
          2,
          9
        ],
        "timezone": "string",
        "startMinutes": 1,
        "endMinutes": 7
      },
      "stages": [
        [
          {
            "method": "EMAIL",
            "contact": "string",
            "type": "Admin",
            "addr": "john.doe@logicmonitor.com"
          },
          {
            "method": "EMAIL",
            "contact": "string",
            "type": "Admin",
            "addr": "john.doe@logicmonitor.com"
          },
          {
            "method": "EMAIL",
            "contact": "string",
            "type": "Admin",
            "addr": "john.doe@logicmonitor.com"
          }
        ],
        [
          {
            "method": "EMAIL",
            "contact": "string",
            "type": "Admin",
            "addr": "john.doe@logicmonitor.com"
          },
          {
            "method": "EMAIL",
            "contact": "string",
            "type": "Admin",
            "addr": "john.doe@logicmonitor.com"
          },
          {
            "method": "EMAIL",
            "contact": "string",
            "type": "Admin",
            "addr": "john.doe@logicmonitor.com"
          },
          {
            "method": "EMAIL",
            "contact": "string",
            "type": "Admin",
            "addr": "john.doe@logicmonitor.com"
          },
          {
            "method": "EMAIL",
            "contact": "string",
            "type": "Admin",
            "addr": "john.doe@logicmonitor.com"
          },
          {
            "method": "EMAIL",
            "contact": "string",
            "type": "Admin",
            "addr": "john.doe@logicmonitor.com"
          },
          {
            "method": "EMAIL",
            "contact": "string",
            "type": "Admin",
            "addr": "john.doe@logicmonitor.com"
          },
          {
            "method": "EMAIL",
            "contact": "string",
            "type": "Admin",
            "addr": "john.doe@logicmonitor.com"
          }
        ],
        [
          {
            "method": "EMAIL",
            "contact": "string",
            "type": "Admin",
            "addr": "john.doe@logicmonitor.com"
          },
          {
            "method": "EMAIL",
            "contact": "string",
            "type": "Admin",
            "addr": "john.doe@logicmonitor.com"
          },
          {
            "method": "EMAIL",
            "contact": "string",
            "type": "Admin",
            "addr": "john.doe@logicmonitor.com"
          },
          {
            "method": "EMAIL",
            "contact": "string",
            "type": "Admin",
            "addr": "john.doe@logicmonitor.com"
          },
          {
            "method": "EMAIL",
            "contact": "string",
            "type": "Admin",
            "addr": "john.doe@logicmonitor.com"
          },
          {
            "method": "EMAIL",
            "contact": "string",
            "type": "Admin",
            "addr": "john.doe@logicmonitor.com"
          },
          {
            "method": "EMAIL",
            "contact": "string",
            "type": "Admin",
            "addr": "john.doe@logicmonitor.com"
          }
        ],
        [
          {
            "method": "EMAIL",
            "contact": "string",
            "type": "Admin",
            "addr": "john.doe@logicmonitor.com"
          }
        ],
        [
          {
            "method": "EMAIL",
            "contact": "string",
            "type": "Admin",
            "addr": "john.doe@logicmonitor.com"
          },
          {
            "method": "EMAIL",
            "contact": "string",
            "type": "Admin",
            "addr": "john.doe@logicmonitor.com"
          },
          {
            "method": "EMAIL",
            "contact": "string",
            "type": "Admin",
            "addr": "john.doe@logicmonitor.com"
          },
          {
            "method": "EMAIL",
            "contact": "string",
            "type": "Admin",
            "addr": "john.doe@logicmonitor.com"
          },
          {
            "method": "EMAIL",
            "contact": "string",
            "type": "Admin",
            "addr": "john.doe@logicmonitor.com"
          },
          {
            "method": "EMAIL",
            "contact": "string",
            "type": "Admin",
            "addr": "john.doe@logicmonitor.com"
          },
          {
            "method": "EMAIL",
            "contact": "string",
            "type": "Admin",
            "addr": "john.doe@logicmonitor.com"
          }
        ],
        [
          {
            "method": "EMAIL",
            "contact": "string",
            "type": "Admin",
            "addr": "john.doe@logicmonitor.com"
          },
          {
            "method": "EMAIL",
            "contact": "string",
            "type": "Admin",
            "addr": "john.doe@logicmonitor.com"
          }
        ],
        [
          {
            "method": "EMAIL",
            "contact": "string",
            "type": "Admin",
            "addr": "john.doe@logicmonitor.com"
          },
          {
            "method": "EMAIL",
            "contact": "string",
            "type": "Admin",
            "addr": "john.doe@logicmonitor.com"
          },
          {
            "method": "EMAIL",
            "contact": "string",
            "type": "Admin",
            "addr": "john.doe@logicmonitor.com"
          },
          {
            "method": "EMAIL",
            "contact": "string",
            "type": "Admin",
            "addr": "john.doe@logicmonitor.com"
          },
          {
            "method": "EMAIL",
            "contact": "string",
            "type": "Admin",
            "addr": "john.doe@logicmonitor.com"
          },
          {
            "method": "EMAIL",
            "contact": "string",
            "type": "Admin",
            "addr": "john.doe@logicmonitor.com"
          },
          {
            "method": "EMAIL",
            "contact": "string",
            "type": "Admin",
            "addr": "john.doe@logicmonitor.com"
          }
        ]
      ],
      "type": "string"
    },
    {
      "period": {
        "weekDays": [
          8,
          8,
          8,
          2
        ],
        "timezone": "string",
        "startMinutes": 9,
        "endMinutes": 7
      },
      "stages": [
        [
          {
            "method": "EMAIL",
            "contact": "string",
            "type": "Admin",
            "addr": "john.doe@logicmonitor.com"
          },
          {
            "method": "EMAIL",
            "contact": "string",
            "type": "Admin",
            "addr": "john.doe@logicmonitor.com"
          },
          {
            "method": "EMAIL",
            "contact": "string",
            "type": "Admin",
            "addr": "john.doe@logicmonitor.com"
          },
          {
            "method": "EMAIL",
            "contact": "string",
            "type": "Admin",
            "addr": "john.doe@logicmonitor.com"
          },
          {
            "method": "EMAIL",
            "contact": "string",
            "type": "Admin",
            "addr": "john.doe@logicmonitor.com"
          },
          {
            "method": "EMAIL",
            "contact": "string",
            "type": "Admin",
            "addr": "john.doe@logicmonitor.com"
          },
          {
            "method": "EMAIL",
            "contact": "string",
            "type": "Admin",
            "addr": "john.doe@logicmonitor.com"
          },
          {
            "method": "EMAIL",
            "contact": "string",
            "type": "Admin",
            "addr": "john.doe@logicmonitor.com"
          },
          {
            "method": "EMAIL",
            "contact": "string",
            "type": "Admin",
            "addr": "john.doe@logicmonitor.com"
          },
          {
            "method": "EMAIL",
            "contact": "string",
            "type": "Admin",
            "addr": "john.doe@logicmonitor.com"
          }
        ],
        [
          {
            "method": "EMAIL",
            "contact": "string",
            "type": "Admin",
            "addr": "john.doe@logicmonitor.com"
          },
          {
            "method": "EMAIL",
            "contact": "string",
            "type": "Admin",
            "addr": "john.doe@logicmonitor.com"
          },
          {
            "method": "EMAIL",
            "contact": "string",
            "type": "Admin",
            "addr": "john.doe@logicmonitor.com"
          },
          {
            "method": "EMAIL",
            "contact": "string",
            "type": "Admin",
            "addr": "john.doe@logicmonitor.com"
          }
        ],
        [
          {
            "method": "EMAIL",
            "contact": "string",
            "type": "Admin",
            "addr": "john.doe@logicmonitor.com"
          },
          {
            "method": "EMAIL",
            "contact": "string",
            "type": "Admin",
            "addr": "john.doe@logicmonitor.com"
          },
          {
            "method": "EMAIL",
            "contact": "string",
            "type": "Admin",
            "addr": "john.doe@logicmonitor.com"
          },
          {
            "method": "EMAIL",
            "contact": "string",
            "type": "Admin",
            "addr": "john.doe@logicmonitor.com"
          },
          {
            "method": "EMAIL",
            "contact": "string",
            "type": "Admin",
            "addr": "john.doe@logicmonitor.com"
          },
          {
            "method": "EMAIL",
            "contact": "string",
            "type": "Admin",
            "addr": "john.doe@logicmonitor.com"
          },
          {
            "method": "EMAIL",
            "contact": "string",
            "type": "Admin",
            "addr": "john.doe@logicmonitor.com"
          },
          {
            "method": "EMAIL",
            "contact": "string",
            "type": "Admin",
            "addr": "john.doe@logicmonitor.com"
          }
        ],
        [
          {
            "method": "EMAIL",
            "contact": "string",
            "type": "Admin",
            "addr": "john.doe@logicmonitor.com"
          },
          {
            "method": "EMAIL",
            "contact": "string",
            "type": "Admin",
            "addr": "john.doe@logicmonitor.com"
          },
          {
            "method": "EMAIL",
            "contact": "string",
            "type": "Admin",
            "addr": "john.doe@logicmonitor.com"
          },
          {
            "method": "EMAIL",
            "contact": "string",
            "type": "Admin",
            "addr": "john.doe@logicmonitor.com"
          },
          {
            "method": "EMAIL",
            "contact": "string",
            "type": "Admin",
            "addr": "john.doe@logicmonitor.com"
          },
          {
            "method": "EMAIL",
            "contact": "string",
            "type": "Admin",
            "addr": "john.doe@logicmonitor.com"
          },
          {
            "method": "EMAIL",
            "contact": "string",
            "type": "Admin",
            "addr": "john.doe@logicmonitor.com"
          },
          {
            "method": "EMAIL",
            "contact": "string",
            "type": "Admin",
            "addr": "john.doe@logicmonitor.com"
          },
          {
            "method": "EMAIL",
            "contact": "string",
            "type": "Admin",
            "addr": "john.doe@logicmonitor.com"
          }
        ],
        [
          {
            "method": "EMAIL",
            "contact": "string",
            "type": "Admin",
            "addr": "john.doe@logicmonitor.com"
          }
        ],
        [
          {
            "method": "EMAIL",
            "contact": "string",
            "type": "Admin",
            "addr": "john.doe@logicmonitor.com"
          },
          {
            "method": "EMAIL",
            "contact": "string",
            "type": "Admin",
            "addr": "john.doe@logicmonitor.com"
          },
          {
            "method": "EMAIL",
            "contact": "string",
            "type": "Admin",
            "addr": "john.doe@logicmonitor.com"
          }
        ],
        [
          {
            "method": "EMAIL",
            "contact": "string",
            "type": "Admin",
            "addr": "john.doe@logicmonitor.com"
          },
          {
            "method": "EMAIL",
            "contact": "string",
            "type": "Admin",
            "addr": "john.doe@logicmonitor.com"
          },
          {
            "method": "EMAIL",
            "contact": "string",
            "type": "Admin",
            "addr": "john.doe@logicmonitor.com"
          },
          {
            "method": "EMAIL",
            "contact": "string",
            "type": "Admin",
            "addr": "john.doe@logicmonitor.com"
          },
          {
            "method": "EMAIL",
            "contact": "string",
            "type": "Admin",
            "addr": "john.doe@logicmonitor.com"
          },
          {
            "method": "EMAIL",
            "contact": "string",
            "type": "Admin",
            "addr": "john.doe@logicmonitor.com"
          },
          {
            "method": "EMAIL",
            "contact": "string",
            "type": "Admin",
            "addr": "john.doe@logicmonitor.com"
          },
          {
            "method": "EMAIL",
            "contact": "string",
            "type": "Admin",
            "addr": "john.doe@logicmonitor.com"
          },
          {
            "method": "EMAIL",
            "contact": "string",
            "type": "Admin",
            "addr": "john.doe@logicmonitor.com"
          },
          {
            "method": "EMAIL",
            "contact": "string",
            "type": "Admin",
            "addr": "john.doe@logicmonitor.com"
          }
        ],
        [
          {
            "method": "EMAIL",
            "contact": "string",
            "type": "Admin",
            "addr": "john.doe@logicmonitor.com"
          },
          {
            "method": "EMAIL",
            "contact": "string",
            "type": "Admin",
            "addr": "john.doe@logicmonitor.com"
          }
        ],
        [
          {
            "method": "EMAIL",
            "contact": "string",
            "type": "Admin",
            "addr": "john.doe@logicmonitor.com"
          }
        ],
        [
          {
            "method": "EMAIL",
            "contact": "string",
            "type": "Admin",
            "addr": "john.doe@logicmonitor.com"
          },
          {
            "method": "EMAIL",
            "contact": "string",
            "type": "Admin",
            "addr": "john.doe@logicmonitor.com"
          }
        ]
      ],
      "type": "string"
    },
    {
      "period": {
        "weekDays": [
          9,
          1,
          9,
          10,
          1,
          6,
          2,
          5,
          6
        ],
        "timezone": "string",
        "startMinutes": 7,
        "endMinutes": 6
      },
      "stages": [
        [
          {
            "method": "EMAIL",
            "contact": "string",
            "type": "Admin",
            "addr": "john.doe@logicmonitor.com"
          },
          {
            "method": "EMAIL",
            "contact": "string",
            "type": "Admin",
            "addr": "john.doe@logicmonitor.com"
          },
          {
            "method": "EMAIL",
            "contact": "string",
            "type": "Admin",
            "addr": "john.doe@logicmonitor.com"
          },
          {
            "method": "EMAIL",
            "contact": "string",
            "type": "Admin",
            "addr": "john.doe@logicmonitor.com"
          },
          {
            "method": "EMAIL",
            "contact": "string",
            "type": "Admin",
            "addr": "john.doe@logicmonitor.com"
          },
          {
            "method": "EMAIL",
            "contact": "string",
            "type": "Admin",
            "addr": "john.doe@logicmonitor.com"
          },
          {
            "method": "EMAIL",
            "contact": "string",
            "type": "Admin",
            "addr": "john.doe@logicmonitor.com"
          },
          {
            "method": "EMAIL",
            "contact": "string",
            "type": "Admin",
            "addr": "john.doe@logicmonitor.com"
          },
          {
            "method": "EMAIL",
            "contact": "string",
            "type": "Admin",
            "addr": "john.doe@logicmonitor.com"
          }
        ],
        [
          {
            "method": "EMAIL",
            "contact": "string",
            "type": "Admin",
            "addr": "john.doe@logicmonitor.com"
          },
          {
            "method": "EMAIL",
            "contact": "string",
            "type": "Admin",
            "addr": "john.doe@logicmonitor.com"
          },
          {
            "method": "EMAIL",
            "contact": "string",
            "type": "Admin",
            "addr": "john.doe@logicmonitor.com"
          },
          {
            "method": "EMAIL",
            "contact": "string",
            "type": "Admin",
            "addr": "john.doe@logicmonitor.com"
          },
          {
            "method": "EMAIL",
            "contact": "string",
            "type": "Admin",
            "addr": "john.doe@logicmonitor.com"
          },
          {
            "method": "EMAIL",
            "contact": "string",
            "type": "Admin",
            "addr": "john.doe@logicmonitor.com"
          },
          {
            "method": "EMAIL",
            "contact": "string",
            "type": "Admin",
            "addr": "john.doe@logicmonitor.com"
          },
          {
            "method": "EMAIL",
            "contact": "string",
            "type": "Admin",
            "addr": "john.doe@logicmonitor.com"
          },
          {
            "method": "EMAIL",
            "contact": "string",
            "type": "Admin",
            "addr": "john.doe@logicmonitor.com"
          }
        ],
        [
          {
            "method": "EMAIL",
            "contact": "string",
            "type": "Admin",
            "addr": "john.doe@logicmonitor.com"
          },
          {
            "method": "EMAIL",
            "contact": "string",
            "type": "Admin",
            "addr": "john.doe@logicmonitor.com"
          },
          {
            "method": "EMAIL",
            "contact": "string",
            "type": "Admin",
            "addr": "john.doe@logicmonitor.com"
          },
          {
            "method": "EMAIL",
            "contact": "string",
            "type": "Admin",
            "addr": "john.doe@logicmonitor.com"
          },
          {
            "method": "EMAIL",
            "contact": "string",
            "type": "Admin",
            "addr": "john.doe@logicmonitor.com"
          },
          {
            "method": "EMAIL",
            "contact": "string",
            "type": "Admin",
            "addr": "john.doe@logicmonitor.com"
          },
          {
            "method": "EMAIL",
            "contact": "string",
            "type": "Admin",
            "addr": "john.doe@logicmonitor.com"
          },
          {
            "method": "EMAIL",
            "contact": "string",
            "type": "Admin",
            "addr": "john.doe@logicmonitor.com"
          },
          {
            "method": "EMAIL",
            "contact": "string",
            "type": "Admin",
            "addr": "john.doe@logicmonitor.com"
          },
          {
            "method": "EMAIL",
            "contact": "string",
            "type": "Admin",
            "addr": "john.doe@logicmonitor.com"
          }
        ],
        [
          {
            "method": "EMAIL",
            "contact": "string",
            "type": "Admin",
            "addr": "john.doe@logicmonitor.com"
          },
          {
            "method": "EMAIL",
            "contact": "string",
            "type": "Admin",
            "addr": "john.doe@logicmonitor.com"
          },
          {
            "method": "EMAIL",
            "contact": "string",
            "type": "Admin",
            "addr": "john.doe@logicmonitor.com"
          }
        ],
        [
          {
            "method": "EMAIL",
            "contact": "string",
            "type": "Admin",
            "addr": "john.doe@logicmonitor.com"
          },
          {
            "method": "EMAIL",
            "contact": "string",
            "type": "Admin",
            "addr": "john.doe@logicmonitor.com"
          },
          {
            "method": "EMAIL",
            "contact": "string",
            "type": "Admin",
            "addr": "john.doe@logicmonitor.com"
          }
        ],
        [
          {
            "method": "EMAIL",
            "contact": "string",
            "type": "Admin",
            "addr": "john.doe@logicmonitor.com"
          },
          {
            "method": "EMAIL",
            "contact": "string",
            "type": "Admin",
            "addr": "john.doe@logicmonitor.com"
          },
          {
            "method": "EMAIL",
            "contact": "string",
            "type": "Admin",
            "addr": "john.doe@logicmonitor.com"
          }
        ],
        [
          {
            "method": "EMAIL",
            "contact": "string",
            "type": "Admin",
            "addr": "john.doe@logicmonitor.com"
          },
          {
            "method": "EMAIL",
            "contact": "string",
            "type": "Admin",
            "addr": "john.doe@logicmonitor.com"
          },
          {
            "method": "EMAIL",
            "contact": "string",
            "type": "Admin",
            "addr": "john.doe@logicmonitor.com"
          },
          {
            "method": "EMAIL",
            "contact": "string",
            "type": "Admin",
            "addr": "john.doe@logicmonitor.com"
          }
        ],
        [
          {
            "method": "EMAIL",
            "contact": "string",
            "type": "Admin",
            "addr": "john.doe@logicmonitor.com"
          },
          {
            "method": "EMAIL",
            "contact": "string",
            "type": "Admin",
            "addr": "john.doe@logicmonitor.com"
          },
          {
            "method": "EMAIL",
            "contact": "string",
            "type": "Admin",
            "addr": "john.doe@logicmonitor.com"
          }
        ],
        [
          {
            "method": "EMAIL",
            "contact": "string",
            "type": "Admin",
            "addr": "john.doe@logicmonitor.com"
          },
          {
            "method": "EMAIL",
            "contact": "string",
            "type": "Admin",
            "addr": "john.doe@logicmonitor.com"
          },
          {
            "method": "EMAIL",
            "contact": "string",
            "type": "Admin",
            "addr": "john.doe@logicmonitor.com"
          },
          {
            "method": "EMAIL",
            "contact": "string",
            "type": "Admin",
            "addr": "john.doe@logicmonitor.com"
          },
          {
            "method": "EMAIL",
            "contact": "string",
            "type": "Admin",
            "addr": "john.doe@logicmonitor.com"
          },
          {
            "method": "EMAIL",
            "contact": "string",
            "type": "Admin",
            "addr": "john.doe@logicmonitor.com"
          },
          {
            "method": "EMAIL",
            "contact": "string",
            "type": "Admin",
            "addr": "john.doe@logicmonitor.com"
          },
          {
            "method": "EMAIL",
            "contact": "string",
            "type": "Admin",
            "addr": "john.doe@logicmonitor.com"
          },
          {
            "method": "EMAIL",
            "contact": "string",
            "type": "Admin",
            "addr": "john.doe@logicmonitor.com"
          },
          {
            "method": "EMAIL",
            "contact": "string",
            "type": "Admin",
            "addr": "john.doe@logicmonitor.com"
          }
        ]
      ],
      "type": "string"
    },
    {
      "period": {
        "weekDays": [
          3,
          1,
          4,
          3,
          2,
          7,
          8,
          2
        ],
        "timezone": "string",
        "startMinutes": 3,
        "endMinutes": 5
      },
      "stages": [
        [
          {
            "method": "EMAIL",
            "contact": "string",
            "type": "Admin",
            "addr": "john.doe@logicmonitor.com"
          },
          {
            "method": "EMAIL",
            "contact": "string",
            "type": "Admin",
            "addr": "john.doe@logicmonitor.com"
          }
        ],
        [
          {
            "method": "EMAIL",
            "contact": "string",
            "type": "Admin",
            "addr": "john.doe@logicmonitor.com"
          },
          {
            "method": "EMAIL",
            "contact": "string",
            "type": "Admin",
            "addr": "john.doe@logicmonitor.com"
          }
        ],
        [
          {
            "method": "EMAIL",
            "contact": "string",
            "type": "Admin",
            "addr": "john.doe@logicmonitor.com"
          },
          {
            "method": "EMAIL",
            "contact": "string",
            "type": "Admin",
            "addr": "john.doe@logicmonitor.com"
          },
          {
            "method": "EMAIL",
            "contact": "string",
            "type": "Admin",
            "addr": "john.doe@logicmonitor.com"
          },
          {
            "method": "EMAIL",
            "contact": "string",
            "type": "Admin",
            "addr": "john.doe@logicmonitor.com"
          },
          {
            "method": "EMAIL",
            "contact": "string",
            "type": "Admin",
            "addr": "john.doe@logicmonitor.com"
          },
          {
            "method": "EMAIL",
            "contact": "string",
            "type": "Admin",
            "addr": "john.doe@logicmonitor.com"
          },
          {
            "method": "EMAIL",
            "contact": "string",
            "type": "Admin",
            "addr": "john.doe@logicmonitor.com"
          },
          {
            "method": "EMAIL",
            "contact": "string",
            "type": "Admin",
            "addr": "john.doe@logicmonitor.com"
          },
          {
            "method": "EMAIL",
            "contact": "string",
            "type": "Admin",
            "addr": "john.doe@logicmonitor.com"
          },
          {
            "method": "EMAIL",
            "contact": "string",
            "type": "Admin",
            "addr": "john.doe@logicmonitor.com"
          }
        ],
        [
          {
            "method": "EMAIL",
            "contact": "string",
            "type": "Admin",
            "addr": "john.doe@logicmonitor.com"
          },
          {
            "method": "EMAIL",
            "contact": "string",
            "type": "Admin",
            "addr": "john.doe@logicmonitor.com"
          },
          {
            "method": "EMAIL",
            "contact": "string",
            "type": "Admin",
            "addr": "john.doe@logicmonitor.com"
          },
          {
            "method": "EMAIL",
            "contact": "string",
            "type": "Admin",
            "addr": "john.doe@logicmonitor.com"
          }
        ],
        [
          {
            "method": "EMAIL",
            "contact": "string",
            "type": "Admin",
            "addr": "john.doe@logicmonitor.com"
          },
          {
            "method": "EMAIL",
            "contact": "string",
            "type": "Admin",
            "addr": "john.doe@logicmonitor.com"
          },
          {
            "method": "EMAIL",
            "contact": "string",
            "type": "Admin",
            "addr": "john.doe@logicmonitor.com"
          },
          {
            "method": "EMAIL",
            "contact": "string",
            "type": "Admin",
            "addr": "john.doe@logicmonitor.com"
          },
          {
            "method": "EMAIL",
            "contact": "string",
            "type": "Admin",
            "addr": "john.doe@logicmonitor.com"
          },
          {
            "method": "EMAIL",
            "contact": "string",
            "type": "Admin",
            "addr": "john.doe@logicmonitor.com"
          },
          {
            "method": "EMAIL",
            "contact": "string",
            "type": "Admin",
            "addr": "john.doe@logicmonitor.com"
          },
          {
            "method": "EMAIL",
            "contact": "string",
            "type": "Admin",
            "addr": "john.doe@logicmonitor.com"
          },
          {
            "method": "EMAIL",
            "contact": "string",
            "type": "Admin",
            "addr": "john.doe@logicmonitor.com"
          }
        ],
        [
          {
            "method": "EMAIL",
            "contact": "string",
            "type": "Admin",
            "addr": "john.doe@logicmonitor.com"
          },
          {
            "method": "EMAIL",
            "contact": "string",
            "type": "Admin",
            "addr": "john.doe@logicmonitor.com"
          },
          {
            "method": "EMAIL",
            "contact": "string",
            "type": "Admin",
            "addr": "john.doe@logicmonitor.com"
          },
          {
            "method": "EMAIL",
            "contact": "string",
            "type": "Admin",
            "addr": "john.doe@logicmonitor.com"
          },
          {
            "method": "EMAIL",
            "contact": "string",
            "type": "Admin",
            "addr": "john.doe@logicmonitor.com"
          },
          {
            "method": "EMAIL",
            "contact": "string",
            "type": "Admin",
            "addr": "john.doe@logicmonitor.com"
          },
          {
            "method": "EMAIL",
            "contact": "string",
            "type": "Admin",
            "addr": "john.doe@logicmonitor.com"
          }
        ]
      ],
      "type": "string"
    }
  ],
  "name": "NOC Team",
  "description": "For alerts escalated to the NOC Team",
  "id": 4,
  "ccDestinations": [
    {
      "method": "EMAIL",
      "contact": "string",
      "type": "Admin",
      "addr": "john.doe@logicmonitor.com"
    },
    {
      "method": "EMAIL",
      "contact": "string",
      "type": "Admin",
      "addr": "john.doe@logicmonitor.com"
    },
    {
      "method": "EMAIL",
      "contact": "string",
      "type": "Admin",
      "addr": "john.doe@logicmonitor.com"
    },
    {
      "method": "EMAIL",
      "contact": "string",
      "type": "Admin",
      "addr": "john.doe@logicmonitor.com"
    },
    {
      "method": "EMAIL",
      "contact": "string",
      "type": "Admin",
      "addr": "john.doe@logicmonitor.com"
    }
  ],
  "throttlingPeriod": 30
}