{
  "inAlerting": false,
  "throttlingAlerts": 40,
  "enableThrottling": true,
  "destinations": [
    {
      "period": {
        "weekDays": [
          8,
          6,
          7,
          1,
          10,
          5
        ],
        "timezone": "string",
        "startMinutes": 10,
        "endMinutes": 2
      },
      "stages": [
        [
          {
            "method": "EMAIL",
            "contact": "string",
            "type": "Admin",
            "addr": "john.doe@logicmonitor.com"
          },
          {
            "method": "EMAIL",
            "contact": "string",
            "type": "Admin",
            "addr": "john.doe@logicmonitor.com"
          },
          {
            "method": "EMAIL",
            "contact": "string",
            "type": "Admin",
            "addr": "john.doe@logicmonitor.com"
          },
          {
            "method": "EMAIL",
            "contact": "string",
            "type": "Admin",
            "addr": "john.doe@logicmonitor.com"
          },
          {
            "method": "EMAIL",
            "contact": "string",
            "type": "Admin",
            "addr": "john.doe@logicmonitor.com"
          }
        ],
        [
          {
            "method": "EMAIL",
            "contact": "string",
            "type": "Admin",
            "addr": "john.doe@logicmonitor.com"
          },
          {
            "method": "EMAIL",
            "contact": "string",
            "type": "Admin",
            "addr": "john.doe@logicmonitor.com"
          }
        ],
        [
          {
            "method": "EMAIL",
            "contact": "string",
            "type": "Admin",
            "addr": "john.doe@logicmonitor.com"
          },
          {
            "method": "EMAIL",
            "contact": "string",
            "type": "Admin",
            "addr": "john.doe@logicmonitor.com"
          },
          {
            "method": "EMAIL",
            "contact": "string",
            "type": "Admin",
            "addr": "john.doe@logicmonitor.com"
          },
          {
            "method": "EMAIL",
            "contact": "string",
            "type": "Admin",
            "addr": "john.doe@logicmonitor.com"
          },
          {
            "method": "EMAIL",
            "contact": "string",
            "type": "Admin",
            "addr": "john.doe@logicmonitor.com"
          }
        ],
        [
          {
            "method": "EMAIL",
            "contact": "string",
            "type": "Admin",
            "addr": "john.doe@logicmonitor.com"
          },
          {
            "method": "EMAIL",
            "contact": "string",
            "type": "Admin",
            "addr": "john.doe@logicmonitor.com"
          }
        ],
        [
          {
            "method": "EMAIL",
            "contact": "string",
            "type": "Admin",
            "addr": "john.doe@logicmonitor.com"
          },
          {
            "method": "EMAIL",
            "contact": "string",
            "type": "Admin",
            "addr": "john.doe@logicmonitor.com"
          },
          {
            "method": "EMAIL",
            "contact": "string",
            "type": "Admin",
            "addr": "john.doe@logicmonitor.com"
          },
          {
            "method": "EMAIL",
            "contact": "string",
            "type": "Admin",
            "addr": "john.doe@logicmonitor.com"
          },
          {
            "method": "EMAIL",
            "contact": "string",
            "type": "Admin",
            "addr": "john.doe@logicmonitor.com"
          },
          {
            "method": "EMAIL",
            "contact": "string",
            "type": "Admin",
            "addr": "john.doe@logicmonitor.com"
          },
          {
            "method": "EMAIL",
            "contact": "string",
            "type": "Admin",
            "addr": "john.doe@logicmonitor.com"
          }
        ],
        [
          {
            "method": "EMAIL",
            "contact": "string",
            "type": "Admin",
            "addr": "john.doe@logicmonitor.com"
          },
          {
            "method": "EMAIL",
            "contact": "string",
            "type": "Admin",
            "addr": "john.doe@logicmonitor.com"
          },
          {
            "method": "EMAIL",
            "contact": "string",
            "type": "Admin",
            "addr": "john.doe@logicmonitor.com"
          },
          {
            "method": "EMAIL",
            "contact": "string",
            "type": "Admin",
            "addr": "john.doe@logicmonitor.com"
          },
          {
            "method": "EMAIL",
            "contact": "string",
            "type": "Admin",
            "addr": "john.doe@logicmonitor.com"
          },
          {
            "method": "EMAIL",
            "contact": "string",
            "type": "Admin",
            "addr": "john.doe@logicmonitor.com"
          }
        ]
      ],
      "type": "string"
    },
    {
      "period": {
        "weekDays": [
          10
        ],
        "timezone": "string",
        "startMinutes": 5,
        "endMinutes": 4
      },
      "stages": [
        [
          {
            "method": "EMAIL",
            "contact": "string",
            "type": "Admin",
            "addr": "john.doe@logicmonitor.com"
          },
          {
            "method": "EMAIL",
            "contact": "string",
            "type": "Admin",
            "addr": "john.doe@logicmonitor.com"
          },
          {
            "method": "EMAIL",
            "contact": "string",
            "type": "Admin",
            "addr": "john.doe@logicmonitor.com"
          },
          {
            "method": "EMAIL",
            "contact": "string",
            "type": "Admin",
            "addr": "john.doe@logicmonitor.com"
          },
          {
            "method": "EMAIL",
            "contact": "string",
            "type": "Admin",
            "addr": "john.doe@logicmonitor.com"
          }
        ],
        [
          {
            "method": "EMAIL",
            "contact": "string",
            "type": "Admin",
            "addr": "john.doe@logicmonitor.com"
          },
          {
            "method": "EMAIL",
            "contact": "string",
            "type": "Admin",
            "addr": "john.doe@logicmonitor.com"
          },
          {
            "method": "EMAIL",
            "contact": "string",
            "type": "Admin",
            "addr": "john.doe@logicmonitor.com"
          },
          {
            "method": "EMAIL",
            "contact": "string",
            "type": "Admin",
            "addr": "john.doe@logicmonitor.com"
          },
          {
            "method": "EMAIL",
            "contact": "string",
            "type": "Admin",
            "addr": "john.doe@logicmonitor.com"
          }
        ],
        [
          {
            "method": "EMAIL",
            "contact": "string",
            "type": "Admin",
            "addr": "john.doe@logicmonitor.com"
          },
          {
            "method": "EMAIL",
            "contact": "string",
            "type": "Admin",
            "addr": "john.doe@logicmonitor.com"
          },
          {
            "method": "EMAIL",
            "contact": "string",
            "type": "Admin",
            "addr": "john.doe@logicmonitor.com"
          },
          {
            "method": "EMAIL",
            "contact": "string",
            "type": "Admin",
            "addr": "john.doe@logicmonitor.com"
          },
          {
            "method": "EMAIL",
            "contact": "string",
            "type": "Admin",
            "addr": "john.doe@logicmonitor.com"
          },
          {
            "method": "EMAIL",
            "contact": "string",
            "type": "Admin",
            "addr": "john.doe@logicmonitor.com"
          },
          {
            "method": "EMAIL",
            "contact": "string",
            "type": "Admin",
            "addr": "john.doe@logicmonitor.com"
          },
          {
            "method": "EMAIL",
            "contact": "string",
            "type": "Admin",
            "addr": "john.doe@logicmonitor.com"
          },
          {
            "method": "EMAIL",
            "contact": "string",
            "type": "Admin",
            "addr": "john.doe@logicmonitor.com"
          }
        ],
        [
          {
            "method": "EMAIL",
            "contact": "string",
            "type": "Admin",
            "addr": "john.doe@logicmonitor.com"
          },
          {
            "method": "EMAIL",
            "contact": "string",
            "type": "Admin",
            "addr": "john.doe@logicmonitor.com"
          },
          {
            "method": "EMAIL",
            "contact": "string",
            "type": "Admin",
            "addr": "john.doe@logicmonitor.com"
          },
          {
            "method": "EMAIL",
            "contact": "string",
            "type": "Admin",
            "addr": "john.doe@logicmonitor.com"
          },
          {
            "method": "EMAIL",
            "contact": "string",
            "type": "Admin",
            "addr": "john.doe@logicmonitor.com"
          },
          {
            "method": "EMAIL",
            "contact": "string",
            "type": "Admin",
            "addr": "john.doe@logicmonitor.com"
          },
          {
            "method": "EMAIL",
            "contact": "string",
            "type": "Admin",
            "addr": "john.doe@logicmonitor.com"
          },
          {
            "method": "EMAIL",
            "contact": "string",
            "type": "Admin",
            "addr": "john.doe@logicmonitor.com"
          },
          {
            "method": "EMAIL",
            "contact": "string",
            "type": "Admin",
            "addr": "john.doe@logicmonitor.com"
          },
          {
            "method": "EMAIL",
            "contact": "string",
            "type": "Admin",
            "addr": "john.doe@logicmonitor.com"
          }
        ],
        [
          {
            "method": "EMAIL",
            "contact": "string",
            "type": "Admin",
            "addr": "john.doe@logicmonitor.com"
          },
          {
            "method": "EMAIL",
            "contact": "string",
            "type": "Admin",
            "addr": "john.doe@logicmonitor.com"
          },
          {
            "method": "EMAIL",
            "contact": "string",
            "type": "Admin",
            "addr": "john.doe@logicmonitor.com"
          },
          {
            "method": "EMAIL",
            "contact": "string",
            "type": "Admin",
            "addr": "john.doe@logicmonitor.com"
          },
          {
            "method": "EMAIL",
            "contact": "string",
            "type": "Admin",
            "addr": "john.doe@logicmonitor.com"
          },
          {
            "method": "EMAIL",
            "contact": "string",
            "type": "Admin",
            "addr": "john.doe@logicmonitor.com"
          },
          {
            "method": "EMAIL",
            "contact": "string",
            "type": "Admin",
            "addr": "john.doe@logicmonitor.com"
          },
          {
            "method": "EMAIL",
            "contact": "string",
            "type": "Admin",
            "addr": "john.doe@logicmonitor.com"
          },
          {
            "method": "EMAIL",
            "contact": "string",
            "type": "Admin",
            "addr": "john.doe@logicmonitor.com"
          }
        ],
        [
          {
            "method": "EMAIL",
            "contact": "string",
            "type": "Admin",
            "addr": "john.doe@logicmonitor.com"
          },
          {
            "method": "EMAIL",
            "contact": "string",
            "type": "Admin",
            "addr": "john.doe@logicmonitor.com"
          },
          {
            "method": "EMAIL",
            "contact": "string",
            "type": "Admin",
            "addr": "john.doe@logicmonitor.com"
          },
          {
            "method": "EMAIL",
            "contact": "string",
            "type": "Admin",
            "addr": "john.doe@logicmonitor.com"
          },
          {
            "method": "EMAIL",
            "contact": "string",
            "type": "Admin",
            "addr": "john.doe@logicmonitor.com"
          },
          {
            "method": "EMAIL",
            "contact": "string",
            "type": "Admin",
            "addr": "john.doe@logicmonitor.com"
          }
        ]
      ],
      "type": "string"
    },
    {
      "period": {
        "weekDays": [
          2,
          4
        ],
        "timezone": "string",
        "startMinutes": 1,
        "endMinutes": 6
      },
      "stages": [
        [
          {
            "method": "EMAIL",
            "contact": "string",
            "type": "Admin",
            "addr": "john.doe@logicmonitor.com"
          },
          {
            "method": "EMAIL",
            "contact": "string",
            "type": "Admin",
            "addr": "john.doe@logicmonitor.com"
          },
          {
            "method": "EMAIL",
            "contact": "string",
            "type": "Admin",
            "addr": "john.doe@logicmonitor.com"
          },
          {
            "method": "EMAIL",
            "contact": "string",
            "type": "Admin",
            "addr": "john.doe@logicmonitor.com"
          },
          {
            "method": "EMAIL",
            "contact": "string",
            "type": "Admin",
            "addr": "john.doe@logicmonitor.com"
          },
          {
            "method": "EMAIL",
            "contact": "string",
            "type": "Admin",
            "addr": "john.doe@logicmonitor.com"
          }
        ],
        [
          {
            "method": "EMAIL",
            "contact": "string",
            "type": "Admin",
            "addr": "john.doe@logicmonitor.com"
          },
          {
            "method": "EMAIL",
            "contact": "string",
            "type": "Admin",
            "addr": "john.doe@logicmonitor.com"
          },
          {
            "method": "EMAIL",
            "contact": "string",
            "type": "Admin",
            "addr": "john.doe@logicmonitor.com"
          },
          {
            "method": "EMAIL",
            "contact": "string",
            "type": "Admin",
            "addr": "john.doe@logicmonitor.com"
          },
          {
            "method": "EMAIL",
            "contact": "string",
            "type": "Admin",
            "addr": "john.doe@logicmonitor.com"
          },
          {
            "method": "EMAIL",
            "contact": "string",
            "type": "Admin",
            "addr": "john.doe@logicmonitor.com"
          },
          {
            "method": "EMAIL",
            "contact": "string",
            "type": "Admin",
            "addr": "john.doe@logicmonitor.com"
          },
          {
            "method": "EMAIL",
            "contact": "string",
            "type": "Admin",
            "addr": "john.doe@logicmonitor.com"
          },
          {
            "method": "EMAIL",
            "contact": "string",
            "type": "Admin",
            "addr": "john.doe@logicmonitor.com"
          }
        ],
        [
          {
            "method": "EMAIL",
            "contact": "string",
            "type": "Admin",
            "addr": "john.doe@logicmonitor.com"
          },
          {
            "method": "EMAIL",
            "contact": "string",
            "type": "Admin",
            "addr": "john.doe@logicmonitor.com"
          },
          {
            "method": "EMAIL",
            "contact": "string",
            "type": "Admin",
            "addr": "john.doe@logicmonitor.com"
          },
          {
            "method": "EMAIL",
            "contact": "string",
            "type": "Admin",
            "addr": "john.doe@logicmonitor.com"
          },
          {
            "method": "EMAIL",
            "contact": "string",
            "type": "Admin",
            "addr": "john.doe@logicmonitor.com"
          },
          {
            "method": "EMAIL",
            "contact": "string",
            "type": "Admin",
            "addr": "john.doe@logicmonitor.com"
          },
          {
            "method": "EMAIL",
            "contact": "string",
            "type": "Admin",
            "addr": "john.doe@logicmonitor.com"
          },
          {
            "method": "EMAIL",
            "contact": "string",
            "type": "Admin",
            "addr": "john.doe@logicmonitor.com"
          },
          {
            "method": "EMAIL",
            "contact": "string",
            "type": "Admin",
            "addr": "john.doe@logicmonitor.com"
          }
        ],
        [
          {
            "method": "EMAIL",
            "contact": "string",
            "type": "Admin",
            "addr": "john.doe@logicmonitor.com"
          },
          {
            "method": "EMAIL",
            "contact": "string",
            "type": "Admin",
            "addr": "john.doe@logicmonitor.com"
          },
          {
            "method": "EMAIL",
            "contact": "string",
            "type": "Admin",
            "addr": "john.doe@logicmonitor.com"
          },
          {
            "method": "EMAIL",
            "contact": "string",
            "type": "Admin",
            "addr": "john.doe@logicmonitor.com"
          }
        ],
        [
          {
            "method": "EMAIL",
            "contact": "string",
            "type": "Admin",
            "addr": "john.doe@logicmonitor.com"
          },
          {
            "method": "EMAIL",
            "contact": "string",
            "type": "Admin",
            "addr": "john.doe@logicmonitor.com"
          },
          {
            "method": "EMAIL",
            "contact": "string",
            "type": "Admin",
            "addr": "john.doe@logicmonitor.com"
          },
          {
            "method": "EMAIL",
            "contact": "string",
            "type": "Admin",
            "addr": "john.doe@logicmonitor.com"
          },
          {
            "method": "EMAIL",
            "contact": "string",
            "type": "Admin",
            "addr": "john.doe@logicmonitor.com"
          }
        ],
        [
          {
            "method": "EMAIL",
            "contact": "string",
            "type": "Admin",
            "addr": "john.doe@logicmonitor.com"
          },
          {
            "method": "EMAIL",
            "contact": "string",
            "type": "Admin",
            "addr": "john.doe@logicmonitor.com"
          },
          {
            "method": "EMAIL",
            "contact": "string",
            "type": "Admin",
            "addr": "john.doe@logicmonitor.com"
          },
          {
            "method": "EMAIL",
            "contact": "string",
            "type": "Admin",
            "addr": "john.doe@logicmonitor.com"
          },
          {
            "method": "EMAIL",
            "contact": "string",
            "type": "Admin",
            "addr": "john.doe@logicmonitor.com"
          },
          {
            "method": "EMAIL",
            "contact": "string",
            "type": "Admin",
            "addr": "john.doe@logicmonitor.com"
          }
        ],
        [
          {
            "method": "EMAIL",
            "contact": "string",
            "type": "Admin",
            "addr": "john.doe@logicmonitor.com"
          },
          {
            "method": "EMAIL",
            "contact": "string",
            "type": "Admin",
            "addr": "john.doe@logicmonitor.com"
          },
          {
            "method": "EMAIL",
            "contact": "string",
            "type": "Admin",
            "addr": "john.doe@logicmonitor.com"
          },
          {
            "method": "EMAIL",
            "contact": "string",
            "type": "Admin",
            "addr": "john.doe@logicmonitor.com"
          },
          {
            "method": "EMAIL",
            "contact": "string",
            "type": "Admin",
            "addr": "john.doe@logicmonitor.com"
          }
        ],
        [
          {
            "method": "EMAIL",
            "contact": "string",
            "type": "Admin",
            "addr": "john.doe@logicmonitor.com"
          },
          {
            "method": "EMAIL",
            "contact": "string",
            "type": "Admin",
            "addr": "john.doe@logicmonitor.com"
          },
          {
            "method": "EMAIL",
            "contact": "string",
            "type": "Admin",
            "addr": "john.doe@logicmonitor.com"
          },
          {
            "method": "EMAIL",
            "contact": "string",
            "type": "Admin",
            "addr": "john.doe@logicmonitor.com"
          },
          {
            "method": "EMAIL",
            "contact": "string",
            "type": "Admin",
            "addr": "john.doe@logicmonitor.com"
          },
          {
            "method": "EMAIL",
            "contact": "string",
            "type": "Admin",
            "addr": "john.doe@logicmonitor.com"
          },
          {
            "method": "EMAIL",
            "contact": "string",
            "type": "Admin",
            "addr": "john.doe@logicmonitor.com"
          }
        ],
        [
          {
            "method": "EMAIL",
            "contact": "string",
            "type": "Admin",
            "addr": "john.doe@logicmonitor.com"
          },
          {
            "method": "EMAIL",
            "contact": "string",
            "type": "Admin",
            "addr": "john.doe@logicmonitor.com"
          },
          {
            "method": "EMAIL",
            "contact": "string",
            "type": "Admin",
            "addr": "john.doe@logicmonitor.com"
          },
          {
            "method": "EMAIL",
            "contact": "string",
            "type": "Admin",
            "addr": "john.doe@logicmonitor.com"
          }
        ]
      ],
      "type": "string"
    },
    {
      "period": {
        "weekDays": [
          3,
          10,
          3,
          9
        ],
        "timezone": "string",
        "startMinutes": 4,
        "endMinutes": 9
      },
      "stages": [
        [
          {
            "method": "EMAIL",
            "contact": "string",
            "type": "Admin",
            "addr": "john.doe@logicmonitor.com"
          },
          {
            "method": "EMAIL",
            "contact": "string",
            "type": "Admin",
            "addr": "john.doe@logicmonitor.com"
          },
          {
            "method": "EMAIL",
            "contact": "string",
            "type": "Admin",
            "addr": "john.doe@logicmonitor.com"
          },
          {
            "method": "EMAIL",
            "contact": "string",
            "type": "Admin",
            "addr": "john.doe@logicmonitor.com"
          },
          {
            "method": "EMAIL",
            "contact": "string",
            "type": "Admin",
            "addr": "john.doe@logicmonitor.com"
          },
          {
            "method": "EMAIL",
            "contact": "string",
            "type": "Admin",
            "addr": "john.doe@logicmonitor.com"
          },
          {
            "method": "EMAIL",
            "contact": "string",
            "type": "Admin",
            "addr": "john.doe@logicmonitor.com"
          },
          {
            "method": "EMAIL",
            "contact": "string",
            "type": "Admin",
            "addr": "john.doe@logicmonitor.com"
          },
          {
            "method": "EMAIL",
            "contact": "string",
            "type": "Admin",
            "addr": "john.doe@logicmonitor.com"
          },
          {
            "method": "EMAIL",
            "contact": "string",
            "type": "Admin",
            "addr": "john.doe@logicmonitor.com"
          }
        ],
        [
          {
            "method": "EMAIL",
            "contact": "string",
            "type": "Admin",
            "addr": "john.doe@logicmonitor.com"
          },
          {
            "method": "EMAIL",
            "contact": "string",
            "type": "Admin",
            "addr": "john.doe@logicmonitor.com"
          },
          {
            "method": "EMAIL",
            "contact": "string",
            "type": "Admin",
            "addr": "john.doe@logicmonitor.com"
          },
          {
            "method": "EMAIL",
            "contact": "string",
            "type": "Admin",
            "addr": "john.doe@logicmonitor.com"
          },
          {
            "method": "EMAIL",
            "contact": "string",
            "type": "Admin",
            "addr": "john.doe@logicmonitor.com"
          },
          {
            "method": "EMAIL",
            "contact": "string",
            "type": "Admin",
            "addr": "john.doe@logicmonitor.com"
          },
          {
            "method": "EMAIL",
            "contact": "string",
            "type": "Admin",
            "addr": "john.doe@logicmonitor.com"
          },
          {
            "method": "EMAIL",
            "contact": "string",
            "type": "Admin",
            "addr": "john.doe@logicmonitor.com"
          },
          {
            "method": "EMAIL",
            "contact": "string",
            "type": "Admin",
            "addr": "john.doe@logicmonitor.com"
          }
        ],
        [
          {
            "method": "EMAIL",
            "contact": "string",
            "type": "Admin",
            "addr": "john.doe@logicmonitor.com"
          },
          {
            "method": "EMAIL",
            "contact": "string",
            "type": "Admin",
            "addr": "john.doe@logicmonitor.com"
          },
          {
            "method": "EMAIL",
            "contact": "string",
            "type": "Admin",
            "addr": "john.doe@logicmonitor.com"
          },
          {
            "method": "EMAIL",
            "contact": "string",
            "type": "Admin",
            "addr": "john.doe@logicmonitor.com"
          },
          {
            "method": "EMAIL",
            "contact": "string",
            "type": "Admin",
            "addr": "john.doe@logicmonitor.com"
          },
          {
            "method": "EMAIL",
            "contact": "string",
            "type": "Admin",
            "addr": "john.doe@logicmonitor.com"
          },
          {
            "method": "EMAIL",
            "contact": "string",
            "type": "Admin",
            "addr": "john.doe@logicmonitor.com"
          },
          {
            "method": "EMAIL",
            "contact": "string",
            "type": "Admin",
            "addr": "john.doe@logicmonitor.com"
          },
          {
            "method": "EMAIL",
            "contact": "string",
            "type": "Admin",
            "addr": "john.doe@logicmonitor.com"
          }
        ],
        [
          {
            "method": "EMAIL",
            "contact": "string",
            "type": "Admin",
            "addr": "john.doe@logicmonitor.com"
          },
          {
            "method": "EMAIL",
            "contact": "string",
            "type": "Admin",
            "addr": "john.doe@logicmonitor.com"
          },
          {
            "method": "EMAIL",
            "contact": "string",
            "type": "Admin",
            "addr": "john.doe@logicmonitor.com"
          },
          {
            "method": "EMAIL",
            "contact": "string",
            "type": "Admin",
            "addr": "john.doe@logicmonitor.com"
          },
          {
            "method": "EMAIL",
            "contact": "string",
            "type": "Admin",
            "addr": "john.doe@logicmonitor.com"
          },
          {
            "method": "EMAIL",
            "contact": "string",
            "type": "Admin",
            "addr": "john.doe@logicmonitor.com"
          }
        ],
        [
          {
            "method": "EMAIL",
            "contact": "string",
            "type": "Admin",
            "addr": "john.doe@logicmonitor.com"
          },
          {
            "method": "EMAIL",
            "contact": "string",
            "type": "Admin",
            "addr": "john.doe@logicmonitor.com"
          },
          {
            "method": "EMAIL",
            "contact": "string",
            "type": "Admin",
            "addr": "john.doe@logicmonitor.com"
          },
          {
            "method": "EMAIL",
            "contact": "string",
            "type": "Admin",
            "addr": "john.doe@logicmonitor.com"
          },
          {
            "method": "EMAIL",
            "contact": "string",
            "type": "Admin",
            "addr": "john.doe@logicmonitor.com"
          },
          {
            "method": "EMAIL",
            "contact": "string",
            "type": "Admin",
            "addr": "john.doe@logicmonitor.com"
          },
          {
            "method": "EMAIL",
            "contact": "string",
            "type": "Admin",
            "addr": "john.doe@logicmonitor.com"
          }
        ],
        [
          {
            "method": "EMAIL",
            "contact": "string",
            "type": "Admin",
            "addr": "john.doe@logicmonitor.com"
          },
          {
            "method": "EMAIL",
            "contact": "string",
            "type": "Admin",
            "addr": "john.doe@logicmonitor.com"
          },
          {
            "method": "EMAIL",
            "contact": "string",
            "type": "Admin",
            "addr": "john.doe@logicmonitor.com"
          },
          {
            "method": "EMAIL",
            "contact": "string",
            "type": "Admin",
            "addr": "john.doe@logicmonitor.com"
          },
          {
            "method": "EMAIL",
            "contact": "string",
            "type": "Admin",
            "addr": "john.doe@logicmonitor.com"
          },
          {
            "method": "EMAIL",
            "contact": "string",
            "type": "Admin",
            "addr": "john.doe@logicmonitor.com"
          },
          {
            "method": "EMAIL",
            "contact": "string",
            "type": "Admin",
            "addr": "john.doe@logicmonitor.com"
          }
        ],
        [
          {
            "method": "EMAIL",
            "contact": "string",
            "type": "Admin",
            "addr": "john.doe@logicmonitor.com"
          },
          {
            "method": "EMAIL",
            "contact": "string",
            "type": "Admin",
            "addr": "john.doe@logicmonitor.com"
          },
          {
            "method": "EMAIL",
            "contact": "string",
            "type": "Admin",
            "addr": "john.doe@logicmonitor.com"
          },
          {
            "method": "EMAIL",
            "contact": "string",
            "type": "Admin",
            "addr": "john.doe@logicmonitor.com"
          },
          {
            "method": "EMAIL",
            "contact": "string",
            "type": "Admin",
            "addr": "john.doe@logicmonitor.com"
          },
          {
            "method": "EMAIL",
            "contact": "string",
            "type": "Admin",
            "addr": "john.doe@logicmonitor.com"
          },
          {
            "method": "EMAIL",
            "contact": "string",
            "type": "Admin",
            "addr": "john.doe@logicmonitor.com"
          },
          {
            "method": "EMAIL",
            "contact": "string",
            "type": "Admin",
            "addr": "john.doe@logicmonitor.com"
          }
        ],
        [
          {
            "method": "EMAIL",
            "contact": "string",
            "type": "Admin",
            "addr": "john.doe@logicmonitor.com"
          },
          {
            "method": "EMAIL",
            "contact": "string",
            "type": "Admin",
            "addr": "john.doe@logicmonitor.com"
          },
          {
            "method": "EMAIL",
            "contact": "string",
            "type": "Admin",
            "addr": "john.doe@logicmonitor.com"
          },
          {
            "method": "EMAIL",
            "contact": "string",
            "type": "Admin",
            "addr": "john.doe@logicmonitor.com"
          },
          {
            "method": "EMAIL",
            "contact": "string",
            "type": "Admin",
            "addr": "john.doe@logicmonitor.com"
          },
          {
            "method": "EMAIL",
            "contact": "string",
            "type": "Admin",
            "addr": "john.doe@logicmonitor.com"
          },
          {
            "method": "EMAIL",
            "contact": "string",
            "type": "Admin",
            "addr": "john.doe@logicmonitor.com"
          }
        ],
        [
          {
            "method": "EMAIL",
            "contact": "string",
            "type": "Admin",
            "addr": "john.doe@logicmonitor.com"
          },
          {
            "method": "EMAIL",
            "contact": "string",
            "type": "Admin",
            "addr": "john.doe@logicmonitor.com"
          },
          {
            "method": "EMAIL",
            "contact": "string",
            "type": "Admin",
            "addr": "john.doe@logicmonitor.com"
          },
          {
            "method": "EMAIL",
            "contact": "string",
            "type": "Admin",
            "addr": "john.doe@logicmonitor.com"
          },
          {
            "method": "EMAIL",
            "contact": "string",
            "type": "Admin",
            "addr": "john.doe@logicmonitor.com"
          },
          {
            "method": "EMAIL",
            "contact": "string",
            "type": "Admin",
            "addr": "john.doe@logicmonitor.com"
          },
          {
            "method": "EMAIL",
            "contact": "string",
            "type": "Admin",
            "addr": "john.doe@logicmonitor.com"
          },
          {
            "method": "EMAIL",
            "contact": "string",
            "type": "Admin",
            "addr": "john.doe@logicmonitor.com"
          }
        ]
      ],
      "type": "string"
    },
    {
      "period": {
        "weekDays": [
          1,
          5,
          2,
          8,
          5,
          2,
          5
        ],
        "timezone": "string",
        "startMinutes": 4,
        "endMinutes": 8
      },
      "stages": [
        [
          {
            "method": "EMAIL",
            "contact": "string",
            "type": "Admin",
            "addr": "john.doe@logicmonitor.com"
          },
          {
            "method": "EMAIL",
            "contact": "string",
            "type": "Admin",
            "addr": "john.doe@logicmonitor.com"
          }
        ],
        [
          {
            "method": "EMAIL",
            "contact": "string",
            "type": "Admin",
            "addr": "john.doe@logicmonitor.com"
          },
          {
            "method": "EMAIL",
            "contact": "string",
            "type": "Admin",
            "addr": "john.doe@logicmonitor.com"
          },
          {
            "method": "EMAIL",
            "contact": "string",
            "type": "Admin",
            "addr": "john.doe@logicmonitor.com"
          },
          {
            "method": "EMAIL",
            "contact": "string",
            "type": "Admin",
            "addr": "john.doe@logicmonitor.com"
          },
          {
            "method": "EMAIL",
            "contact": "string",
            "type": "Admin",
            "addr": "john.doe@logicmonitor.com"
          },
          {
            "method": "EMAIL",
            "contact": "string",
            "type": "Admin",
            "addr": "john.doe@logicmonitor.com"
          }
        ],
        [
          {
            "method": "EMAIL",
            "contact": "string",
            "type": "Admin",
            "addr": "john.doe@logicmonitor.com"
          },
          {
            "method": "EMAIL",
            "contact": "string",
            "type": "Admin",
            "addr": "john.doe@logicmonitor.com"
          },
          {
            "method": "EMAIL",
            "contact": "string",
            "type": "Admin",
            "addr": "john.doe@logicmonitor.com"
          },
          {
            "method": "EMAIL",
            "contact": "string",
            "type": "Admin",
            "addr": "john.doe@logicmonitor.com"
          },
          {
            "method": "EMAIL",
            "contact": "string",
            "type": "Admin",
            "addr": "john.doe@logicmonitor.com"
          }
        ],
        [
          {
            "method": "EMAIL",
            "contact": "string",
            "type": "Admin",
            "addr": "john.doe@logicmonitor.com"
          },
          {
            "method": "EMAIL",
            "contact": "string",
            "type": "Admin",
            "addr": "john.doe@logicmonitor.com"
          },
          {
            "method": "EMAIL",
            "contact": "string",
            "type": "Admin",
            "addr": "john.doe@logicmonitor.com"
          },
          {
            "method": "EMAIL",
            "contact": "string",
            "type": "Admin",
            "addr": "john.doe@logicmonitor.com"
          },
          {
            "method": "EMAIL",
            "contact": "string",
            "type": "Admin",
            "addr": "john.doe@logicmonitor.com"
          },
          {
            "method": "EMAIL",
            "contact": "string",
            "type": "Admin",
            "addr": "john.doe@logicmonitor.com"
          },
          {
            "method": "EMAIL",
            "contact": "string",
            "type": "Admin",
            "addr": "john.doe@logicmonitor.com"
          },
          {
            "method": "EMAIL",
            "contact": "string",
            "type": "Admin",
            "addr": "john.doe@logicmonitor.com"
          },
          {
            "method": "EMAIL",
            "contact": "string",
            "type": "Admin",
            "addr": "john.doe@logicmonitor.com"
          }
        ],
        [
          {
            "method": "EMAIL",
            "contact": "string",
            "type": "Admin",
            "addr": "john.doe@logicmonitor.com"
          },
          {
            "method": "EMAIL",
            "contact": "string",
            "type": "Admin",
            "addr": "john.doe@logicmonitor.com"
          }
        ],
        [
          {
            "method": "EMAIL",
            "contact": "string",
            "type": "Admin",
            "addr": "john.doe@logicmonitor.com"
          },
          {
            "method": "EMAIL",
            "contact": "string",
            "type": "Admin",
            "addr": "john.doe@logicmonitor.com"
          },
          {
            "method": "EMAIL",
            "contact": "string",
            "type": "Admin",
            "addr": "john.doe@logicmonitor.com"
          },
          {
            "method": "EMAIL",
            "contact": "string",
            "type": "Admin",
            "addr": "john.doe@logicmonitor.com"
          },
          {
            "method": "EMAIL",
            "contact": "string",
            "type": "Admin",
            "addr": "john.doe@logicmonitor.com"
          },
          {
            "method": "EMAIL",
            "contact": "string",
            "type": "Admin",
            "addr": "john.doe@logicmonitor.com"
          },
          {
            "method": "EMAIL",
            "contact": "string",
            "type": "Admin",
            "addr": "john.doe@logicmonitor.com"
          },
          {
            "method": "EMAIL",
            "contact": "string",
            "type": "Admin",
            "addr": "john.doe@logicmonitor.com"
          },
          {
            "method": "EMAIL",
            "contact": "string",
            "type": "Admin",
            "addr": "john.doe@logicmonitor.com"
          }
        ],
        [
          {
            "method": "EMAIL",
            "contact": "string",
            "type": "Admin",
            "addr": "john.doe@logicmonitor.com"
          },
          {
            "method": "EMAIL",
            "contact": "string",
            "type": "Admin",
            "addr": "john.doe@logicmonitor.com"
          },
          {
            "method": "EMAIL",
            "contact": "string",
            "type": "Admin",
            "addr": "john.doe@logicmonitor.com"
          },
          {
            "method": "EMAIL",
            "contact": "string",
            "type": "Admin",
            "addr": "john.doe@logicmonitor.com"
          },
          {
            "method": "EMAIL",
            "contact": "string",
            "type": "Admin",
            "addr": "john.doe@logicmonitor.com"
          }
        ]
      ],
      "type": "string"
    },
    {
      "period": {
        "weekDays": [
          4,
          8,
          3,
          7,
          10,
          4,
          8,
          3,
          8,
          6
        ],
        "timezone": "string",
        "startMinutes": 10,
        "endMinutes": 6
      },
      "stages": [
        [
          {
            "method": "EMAIL",
            "contact": "string",
            "type": "Admin",
            "addr": "john.doe@logicmonitor.com"
          },
          {
            "method": "EMAIL",
            "contact": "string",
            "type": "Admin",
            "addr": "john.doe@logicmonitor.com"
          }
        ],
        [
          {
            "method": "EMAIL",
            "contact": "string",
            "type": "Admin",
            "addr": "john.doe@logicmonitor.com"
          },
          {
            "method": "EMAIL",
            "contact": "string",
            "type": "Admin",
            "addr": "john.doe@logicmonitor.com"
          },
          {
            "method": "EMAIL",
            "contact": "string",
            "type": "Admin",
            "addr": "john.doe@logicmonitor.com"
          },
          {
            "method": "EMAIL",
            "contact": "string",
            "type": "Admin",
            "addr": "john.doe@logicmonitor.com"
          },
          {
            "method": "EMAIL",
            "contact": "string",
            "type": "Admin",
            "addr": "john.doe@logicmonitor.com"
          },
          {
            "method": "EMAIL",
            "contact": "string",
            "type": "Admin",
            "addr": "john.doe@logicmonitor.com"
          }
        ],
        [
          {
            "method": "EMAIL",
            "contact": "string",
            "type": "Admin",
            "addr": "john.doe@logicmonitor.com"
          },
          {
            "method": "EMAIL",
            "contact": "string",
            "type": "Admin",
            "addr": "john.doe@logicmonitor.com"
          },
          {
            "method": "EMAIL",
            "contact": "string",
            "type": "Admin",
            "addr": "john.doe@logicmonitor.com"
          }
        ],
        [
          {
            "method": "EMAIL",
            "contact": "string",
            "type": "Admin",
            "addr": "john.doe@logicmonitor.com"
          },
          {
            "method": "EMAIL",
            "contact": "string",
            "type": "Admin",
            "addr": "john.doe@logicmonitor.com"
          },
          {
            "method": "EMAIL",
            "contact": "string",
            "type": "Admin",
            "addr": "john.doe@logicmonitor.com"
          }
        ]
      ],
      "type": "string"
    },
    {
      "period": {
        "weekDays": [
          10,
          8,
          8,
          9,
          1,
          10
        ],
        "timezone": "string",
        "startMinutes": 7,
        "endMinutes": 10
      },
      "stages": [
        [
          {
            "method": "EMAIL",
            "contact": "string",
            "type": "Admin",
            "addr": "john.doe@logicmonitor.com"
          },
          {
            "method": "EMAIL",
            "contact": "string",
            "type": "Admin",
            "addr": "john.doe@logicmonitor.com"
          },
          {
            "method": "EMAIL",
            "contact": "string",
            "type": "Admin",
            "addr": "john.doe@logicmonitor.com"
          },
          {
            "method": "EMAIL",
            "contact": "string",
            "type": "Admin",
            "addr": "john.doe@logicmonitor.com"
          },
          {
            "method": "EMAIL",
            "contact": "string",
            "type": "Admin",
            "addr": "john.doe@logicmonitor.com"
          }
        ]
      ],
      "type": "string"
    },
    {
      "period": {
        "weekDays": [
          4,
          8,
          8,
          2
        ],
        "timezone": "string",
        "startMinutes": 3,
        "endMinutes": 1
      },
      "stages": [
        [
          {
            "method": "EMAIL",
            "contact": "string",
            "type": "Admin",
            "addr": "john.doe@logicmonitor.com"
          },
          {
            "method": "EMAIL",
            "contact": "string",
            "type": "Admin",
            "addr": "john.doe@logicmonitor.com"
          }
        ],
        [
          {
            "method": "EMAIL",
            "contact": "string",
            "type": "Admin",
            "addr": "john.doe@logicmonitor.com"
          },
          {
            "method": "EMAIL",
            "contact": "string",
            "type": "Admin",
            "addr": "john.doe@logicmonitor.com"
          },
          {
            "method": "EMAIL",
            "contact": "string",
            "type": "Admin",
            "addr": "john.doe@logicmonitor.com"
          }
        ],
        [
          {
            "method": "EMAIL",
            "contact": "string",
            "type": "Admin",
            "addr": "john.doe@logicmonitor.com"
          },
          {
            "method": "EMAIL",
            "contact": "string",
            "type": "Admin",
            "addr": "john.doe@logicmonitor.com"
          },
          {
            "method": "EMAIL",
            "contact": "string",
            "type": "Admin",
            "addr": "john.doe@logicmonitor.com"
          },
          {
            "method": "EMAIL",
            "contact": "string",
            "type": "Admin",
            "addr": "john.doe@logicmonitor.com"
          },
          {
            "method": "EMAIL",
            "contact": "string",
            "type": "Admin",
            "addr": "john.doe@logicmonitor.com"
          }
        ],
        [
          {
            "method": "EMAIL",
            "contact": "string",
            "type": "Admin",
            "addr": "john.doe@logicmonitor.com"
          },
          {
            "method": "EMAIL",
            "contact": "string",
            "type": "Admin",
            "addr": "john.doe@logicmonitor.com"
          },
          {
            "method": "EMAIL",
            "contact": "string",
            "type": "Admin",
            "addr": "john.doe@logicmonitor.com"
          },
          {
            "method": "EMAIL",
            "contact": "string",
            "type": "Admin",
            "addr": "john.doe@logicmonitor.com"
          },
          {
            "method": "EMAIL",
            "contact": "string",
            "type": "Admin",
            "addr": "john.doe@logicmonitor.com"
          }
        ]
      ],
      "type": "string"
    },
    {
      "period": {
        "weekDays": [
          2,
          10,
          3,
          8,
          7
        ],
        "timezone": "string",
        "startMinutes": 5,
        "endMinutes": 7
      },
      "stages": [
        [
          {
            "method": "EMAIL",
            "contact": "string",
            "type": "Admin",
            "addr": "john.doe@logicmonitor.com"
          },
          {
            "method": "EMAIL",
            "contact": "string",
            "type": "Admin",
            "addr": "john.doe@logicmonitor.com"
          },
          {
            "method": "EMAIL",
            "contact": "string",
            "type": "Admin",
            "addr": "john.doe@logicmonitor.com"
          },
          {
            "method": "EMAIL",
            "contact": "string",
            "type": "Admin",
            "addr": "john.doe@logicmonitor.com"
          },
          {
            "method": "EMAIL",
            "contact": "string",
            "type": "Admin",
            "addr": "john.doe@logicmonitor.com"
          },
          {
            "method": "EMAIL",
            "contact": "string",
            "type": "Admin",
            "addr": "john.doe@logicmonitor.com"
          },
          {
            "method": "EMAIL",
            "contact": "string",
            "type": "Admin",
            "addr": "john.doe@logicmonitor.com"
          },
          {
            "method": "EMAIL",
            "contact": "string",
            "type": "Admin",
            "addr": "john.doe@logicmonitor.com"
          },
          {
            "method": "EMAIL",
            "contact": "string",
            "type": "Admin",
            "addr": "john.doe@logicmonitor.com"
          }
        ],
        [
          {
            "method": "EMAIL",
            "contact": "string",
            "type": "Admin",
            "addr": "john.doe@logicmonitor.com"
          },
          {
            "method": "EMAIL",
            "contact": "string",
            "type": "Admin",
            "addr": "john.doe@logicmonitor.com"
          },
          {
            "method": "EMAIL",
            "contact": "string",
            "type": "Admin",
            "addr": "john.doe@logicmonitor.com"
          },
          {
            "method": "EMAIL",
            "contact": "string",
            "type": "Admin",
            "addr": "john.doe@logicmonitor.com"
          },
          {
            "method": "EMAIL",
            "contact": "string",
            "type": "Admin",
            "addr": "john.doe@logicmonitor.com"
          },
          {
            "method": "EMAIL",
            "contact": "string",
            "type": "Admin",
            "addr": "john.doe@logicmonitor.com"
          },
          {
            "method": "EMAIL",
            "contact": "string",
            "type": "Admin",
            "addr": "john.doe@logicmonitor.com"
          },
          {
            "method": "EMAIL",
            "contact": "string",
            "type": "Admin",
            "addr": "john.doe@logicmonitor.com"
          }
        ],
        [
          {
            "method": "EMAIL",
            "contact": "string",
            "type": "Admin",
            "addr": "john.doe@logicmonitor.com"
          },
          {
            "method": "EMAIL",
            "contact": "string",
            "type": "Admin",
            "addr": "john.doe@logicmonitor.com"
          },
          {
            "method": "EMAIL",
            "contact": "string",
            "type": "Admin",
            "addr": "john.doe@logicmonitor.com"
          },
          {
            "method": "EMAIL",
            "contact": "string",
            "type": "Admin",
            "addr": "john.doe@logicmonitor.com"
          },
          {
            "method": "EMAIL",
            "contact": "string",
            "type": "Admin",
            "addr": "john.doe@logicmonitor.com"
          },
          {
            "method": "EMAIL",
            "contact": "string",
            "type": "Admin",
            "addr": "john.doe@logicmonitor.com"
          }
        ],
        [
          {
            "method": "EMAIL",
            "contact": "string",
            "type": "Admin",
            "addr": "john.doe@logicmonitor.com"
          }
        ],
        [
          {
            "method": "EMAIL",
            "contact": "string",
            "type": "Admin",
            "addr": "john.doe@logicmonitor.com"
          }
        ],
        [
          {
            "method": "EMAIL",
            "contact": "string",
            "type": "Admin",
            "addr": "john.doe@logicmonitor.com"
          },
          {
            "method": "EMAIL",
            "contact": "string",
            "type": "Admin",
            "addr": "john.doe@logicmonitor.com"
          },
          {
            "method": "EMAIL",
            "contact": "string",
            "type": "Admin",
            "addr": "john.doe@logicmonitor.com"
          },
          {
            "method": "EMAIL",
            "contact": "string",
            "type": "Admin",
            "addr": "john.doe@logicmonitor.com"
          },
          {
            "method": "EMAIL",
            "contact": "string",
            "type": "Admin",
            "addr": "john.doe@logicmonitor.com"
          },
          {
            "method": "EMAIL",
            "contact": "string",
            "type": "Admin",
            "addr": "john.doe@logicmonitor.com"
          }
        ],
        [
          {
            "method": "EMAIL",
            "contact": "string",
            "type": "Admin",
            "addr": "john.doe@logicmonitor.com"
          }
        ],
        [
          {
            "method": "EMAIL",
            "contact": "string",
            "type": "Admin",
            "addr": "john.doe@logicmonitor.com"
          },
          {
            "method": "EMAIL",
            "contact": "string",
            "type": "Admin",
            "addr": "john.doe@logicmonitor.com"
          },
          {
            "method": "EMAIL",
            "contact": "string",
            "type": "Admin",
            "addr": "john.doe@logicmonitor.com"
          },
          {
            "method": "EMAIL",
            "contact": "string",
            "type": "Admin",
            "addr": "john.doe@logicmonitor.com"
          },
          {
            "method": "EMAIL",
            "contact": "string",
            "type": "Admin",
            "addr": "john.doe@logicmonitor.com"
          },
          {
            "method": "EMAIL",
            "contact": "string",
            "type": "Admin",
            "addr": "john.doe@logicmonitor.com"
          },
          {
            "method": "EMAIL",
            "contact": "string",
            "type": "Admin",
            "addr": "john.doe@logicmonitor.com"
          },
          {
            "method": "EMAIL",
            "contact": "string",
            "type": "Admin",
            "addr": "john.doe@logicmonitor.com"
          },
          {
            "method": "EMAIL",
            "contact": "string",
            "type": "Admin",
            "addr": "john.doe@logicmonitor.com"
          },
          {
            "method": "EMAIL",
            "contact": "string",
            "type": "Admin",
            "addr": "john.doe@logicmonitor.com"
          }
        ],
        [
          {
            "method": "EMAIL",
            "contact": "string",
            "type": "Admin",
            "addr": "john.doe@logicmonitor.com"
          },
          {
            "method": "EMAIL",
            "contact": "string",
            "type": "Admin",
            "addr": "john.doe@logicmonitor.com"
          },
          {
            "method": "EMAIL",
            "contact": "string",
            "type": "Admin",
            "addr": "john.doe@logicmonitor.com"
          },
          {
            "method": "EMAIL",
            "contact": "string",
            "type": "Admin",
            "addr": "john.doe@logicmonitor.com"
          },
          {
            "method": "EMAIL",
            "contact": "string",
            "type": "Admin",
            "addr": "john.doe@logicmonitor.com"
          },
          {
            "method": "EMAIL",
            "contact": "string",
            "type": "Admin",
            "addr": "john.doe@logicmonitor.com"
          },
          {
            "method": "EMAIL",
            "contact": "string",
            "type": "Admin",
            "addr": "john.doe@logicmonitor.com"
          }
        ]
      ],
      "type": "string"
    },
    {
      "period": {
        "weekDays": [
          7,
          8
        ],
        "timezone": "string",
        "startMinutes": 2,
        "endMinutes": 7
      },
      "stages": [
        [
          {
            "method": "EMAIL",
            "contact": "string",
            "type": "Admin",
            "addr": "john.doe@logicmonitor.com"
          },
          {
            "method": "EMAIL",
            "contact": "string",
            "type": "Admin",
            "addr": "john.doe@logicmonitor.com"
          },
          {
            "method": "EMAIL",
            "contact": "string",
            "type": "Admin",
            "addr": "john.doe@logicmonitor.com"
          }
        ],
        [
          {
            "method": "EMAIL",
            "contact": "string",
            "type": "Admin",
            "addr": "john.doe@logicmonitor.com"
          },
          {
            "method": "EMAIL",
            "contact": "string",
            "type": "Admin",
            "addr": "john.doe@logicmonitor.com"
          },
          {
            "method": "EMAIL",
            "contact": "string",
            "type": "Admin",
            "addr": "john.doe@logicmonitor.com"
          },
          {
            "method": "EMAIL",
            "contact": "string",
            "type": "Admin",
            "addr": "john.doe@logicmonitor.com"
          },
          {
            "method": "EMAIL",
            "contact": "string",
            "type": "Admin",
            "addr": "john.doe@logicmonitor.com"
          },
          {
            "method": "EMAIL",
            "contact": "string",
            "type": "Admin",
            "addr": "john.doe@logicmonitor.com"
          },
          {
            "method": "EMAIL",
            "contact": "string",
            "type": "Admin",
            "addr": "john.doe@logicmonitor.com"
          },
          {
            "method": "EMAIL",
            "contact": "string",
            "type": "Admin",
            "addr": "john.doe@logicmonitor.com"
          },
          {
            "method": "EMAIL",
            "contact": "string",
            "type": "Admin",
            "addr": "john.doe@logicmonitor.com"
          },
          {
            "method": "EMAIL",
            "contact": "string",
            "type": "Admin",
            "addr": "john.doe@logicmonitor.com"
          }
        ],
        [
          {
            "method": "EMAIL",
            "contact": "string",
            "type": "Admin",
            "addr": "john.doe@logicmonitor.com"
          },
          {
            "method": "EMAIL",
            "contact": "string",
            "type": "Admin",
            "addr": "john.doe@logicmonitor.com"
          },
          {
            "method": "EMAIL",
            "contact": "string",
            "type": "Admin",
            "addr": "john.doe@logicmonitor.com"
          },
          {
            "method": "EMAIL",
            "contact": "string",
            "type": "Admin",
            "addr": "john.doe@logicmonitor.com"
          },
          {
            "method": "EMAIL",
            "contact": "string",
            "type": "Admin",
            "addr": "john.doe@logicmonitor.com"
          },
          {
            "method": "EMAIL",
            "contact": "string",
            "type": "Admin",
            "addr": "john.doe@logicmonitor.com"
          },
          {
            "method": "EMAIL",
            "contact": "string",
            "type": "Admin",
            "addr": "john.doe@logicmonitor.com"
          },
          {
            "method": "EMAIL",
            "contact": "string",
            "type": "Admin",
            "addr": "john.doe@logicmonitor.com"
          },
          {
            "method": "EMAIL",
            "contact": "string",
            "type": "Admin",
            "addr": "john.doe@logicmonitor.com"
          }
        ],
        [
          {
            "method": "EMAIL",
            "contact": "string",
            "type": "Admin",
            "addr": "john.doe@logicmonitor.com"
          },
          {
            "method": "EMAIL",
            "contact": "string",
            "type": "Admin",
            "addr": "john.doe@logicmonitor.com"
          }
        ],
        [
          {
            "method": "EMAIL",
            "contact": "string",
            "type": "Admin",
            "addr": "john.doe@logicmonitor.com"
          },
          {
            "method": "EMAIL",
            "contact": "string",
            "type": "Admin",
            "addr": "john.doe@logicmonitor.com"
          },
          {
            "method": "EMAIL",
            "contact": "string",
            "type": "Admin",
            "addr": "john.doe@logicmonitor.com"
          }
        ],
        [
          {
            "method": "EMAIL",
            "contact": "string",
            "type": "Admin",
            "addr": "john.doe@logicmonitor.com"
          },
          {
            "method": "EMAIL",
            "contact": "string",
            "type": "Admin",
            "addr": "john.doe@logicmonitor.com"
          },
          {
            "method": "EMAIL",
            "contact": "string",
            "type": "Admin",
            "addr": "john.doe@logicmonitor.com"
          },
          {
            "method": "EMAIL",
            "contact": "string",
            "type": "Admin",
            "addr": "john.doe@logicmonitor.com"
          },
          {
            "method": "EMAIL",
            "contact": "string",
            "type": "Admin",
            "addr": "john.doe@logicmonitor.com"
          },
          {
            "method": "EMAIL",
            "contact": "string",
            "type": "Admin",
            "addr": "john.doe@logicmonitor.com"
          },
          {
            "method": "EMAIL",
            "contact": "string",
            "type": "Admin",
            "addr": "john.doe@logicmonitor.com"
          },
          {
            "method": "EMAIL",
            "contact": "string",
            "type": "Admin",
            "addr": "john.doe@logicmonitor.com"
          }
        ],
        [
          {
            "method": "EMAIL",
            "contact": "string",
            "type": "Admin",
            "addr": "john.doe@logicmonitor.com"
          },
          {
            "method": "EMAIL",
            "contact": "string",
            "type": "Admin",
            "addr": "john.doe@logicmonitor.com"
          },
          {
            "method": "EMAIL",
            "contact": "string",
            "type": "Admin",
            "addr": "john.doe@logicmonitor.com"
          },
          {
            "method": "EMAIL",
            "contact": "string",
            "type": "Admin",
            "addr": "john.doe@logicmonitor.com"
          },
          {
            "method": "EMAIL",
            "contact": "string",
            "type": "Admin",
            "addr": "john.doe@logicmonitor.com"
          },
          {
            "method": "EMAIL",
            "contact": "string",
            "type": "Admin",
            "addr": "john.doe@logicmonitor.com"
          },
          {
            "method": "EMAIL",
            "contact": "string",
            "type": "Admin",
            "addr": "john.doe@logicmonitor.com"
          },
          {
            "method": "EMAIL",
            "contact": "string",
            "type": "Admin",
            "addr": "john.doe@logicmonitor.com"
          },
          {
            "method": "EMAIL",
            "contact": "string",
            "type": "Admin",
            "addr": "john.doe@logicmonitor.com"
          }
        ]
      ],
      "type": "string"
    }
  ],
  "name": "NOC Team",
  "description": "For alerts escalated to the NOC Team",
  "id": 1,
  "ccDestinations": [
    {
      "method": "EMAIL",
      "contact": "string",
      "type": "Admin",
      "addr": "john.doe@logicmonitor.com"
    },
    {
      "method": "EMAIL",
      "contact": "string",
      "type": "Admin",
      "addr": "john.doe@logicmonitor.com"
    }
  ],
  "throttlingPeriod": 30
}