{
  "fullPath": "string",
  "groupType": "Normal",
  "numOfAWSDevices": 7,
  "description": "Linux Servers",
  "appliesTo": "isLinux()",
  "gcpTestResultCode": 7,
  "disableAlerting": true,
  "awsRegionsInfo": "string",
  "createdOn": 6,
  "hasNetflowEnabledDevices": false,
  "numOfAzureDevices": 9,
  "defaultCollectorDescription": "string",
  "defaultCollectorId": 1,
  "awsTestResult": null,
  "extra": {},
  "numOfDirectSubGroups": 10,
  "subGroups": [
    {
      "fullPath": "string",
      "groupType": "string",
      "userPermission": "string",
      "gcpRegionsInfo": "string",
      "description": "string",
      "appliesTo": "string",
      "awsRegionsInfo": "string",
      "numOfHosts": 7,
      "name": "string",
      "numOfDirectSubGroups": 10,
      "numOfDirectDevices": 1,
      "id": 4,
      "azureRegionsInfo": "string"
    }
  ],
  "numOfDirectDevices": 7,
  "id": 1,
  "enableNetflow": "true",
  "azureTestResultCode": 10,
  "effectiveAlertEnabled": false,
  "userPermission": "string",
  "gcpRegionsInfo": "string",
  "groupStatus": "string",
  "numOfGcpDevices": 5,
  "azureTestResult": null,
  "parentId": 1,
  "awsTestResultCode": 9,
  "customProperties": [
    {
      "name": "addr",
      "value": "127.0.0.1"
    },
    {
      "name": "addr",
      "value": "127.0.0.1"
    },
    {
      "name": "addr",
      "value": "127.0.0.1"
    },
    {
      "name": "addr",
      "value": "127.0.0.1"
    },
    {
      "name": "addr",
      "value": "127.0.0.1"
    },
    {
      "name": "addr",
      "value": "127.0.0.1"
    }
  ],
  "numOfHosts": 1,
  "name": "Linux Servers",
  "gcpTestResult": null,
  "azureRegionsInfo": "string"
}