{
  "fullPath": "string",
  "groupType": "Normal",
  "numOfAWSDevices": 5,
  "description": "Linux Servers",
  "appliesTo": "isLinux()",
  "gcpTestResultCode": 2,
  "disableAlerting": true,
  "awsRegionsInfo": "string",
  "createdOn": 9,
  "hasNetflowEnabledDevices": false,
  "numOfAzureDevices": 3,
  "defaultCollectorDescription": "string",
  "defaultCollectorId": 1,
  "awsTestResult": null,
  "extra": {},
  "numOfDirectSubGroups": 4,
  "subGroups": [
    {
      "fullPath": "string",
      "groupType": "string",
      "userPermission": "string",
      "gcpRegionsInfo": "string",
      "description": "string",
      "appliesTo": "string",
      "awsRegionsInfo": "string",
      "numOfHosts": 1,
      "name": "string",
      "numOfDirectSubGroups": 6,
      "numOfDirectDevices": 2,
      "id": 8,
      "azureRegionsInfo": "string"
    },
    {
      "fullPath": "string",
      "groupType": "string",
      "userPermission": "string",
      "gcpRegionsInfo": "string",
      "description": "string",
      "appliesTo": "string",
      "awsRegionsInfo": "string",
      "numOfHosts": 4,
      "name": "string",
      "numOfDirectSubGroups": 6,
      "numOfDirectDevices": 7,
      "id": 8,
      "azureRegionsInfo": "string"
    }
  ],
  "numOfDirectDevices": 2,
  "id": 9,
  "enableNetflow": "true",
  "azureTestResultCode": 10,
  "effectiveAlertEnabled": true,
  "userPermission": "string",
  "gcpRegionsInfo": "string",
  "groupStatus": "string",
  "numOfGcpDevices": 8,
  "azureTestResult": null,
  "parentId": 1,
  "awsTestResultCode": 9,
  "customProperties": [
    {
      "name": "addr",
      "value": "127.0.0.1"
    }
  ],
  "numOfHosts": 9,
  "name": "Linux Servers",
  "gcpTestResult": null,
  "azureRegionsInfo": "string"
}