{
  "total": 1,
  "searchId": "string",
  "items": [
    {
      "timeEpoch": 10,
      "clientIp": "string",
      "updateReason": "string",
      "timeStr": "string",
      "id": 2,
      "userName": "string"
    },
    {
      "timeEpoch": 5,
      "clientIp": "string",
      "updateReason": "string",
      "timeStr": "string",
      "id": 6,
      "userName": "string"
    },
    {
      "timeEpoch": 4,
      "clientIp": "string",
      "updateReason": "string",
      "timeStr": "string",
      "id": 6,
      "userName": "string"
    },
    {
      "timeEpoch": 3,
      "clientIp": "string",
      "updateReason": "string",
      "timeStr": "string",
      "id": 9,
      "userName": "string"
    },
    {
      "timeEpoch": 8,
      "clientIp": "string",
      "updateReason": "string",
      "timeStr": "string",
      "id": 2,
      "userName": "string"
    },
    {
      "timeEpoch": 9,
      "clientIp": "string",
      "updateReason": "string",
      "timeStr": "string",
      "id": 5,
      "userName": "string"
    },
    {
      "timeEpoch": 2,
      "clientIp": "string",
      "updateReason": "string",
      "timeStr": "string",
      "id": 1,
      "userName": "string"
    },
    {
      "timeEpoch": 5,
      "clientIp": "string",
      "updateReason": "string",
      "timeStr": "string",
      "id": 8,
      "userName": "string"
    }
  ]
}