{
  "total": 7,
  "searchId": "string",
  "items": [
    {
      "template": {},
      "testLocation": null,
      "groupId": 1,
      "overallAlertLevel": "warn",
      "pollingInterval": 5,
      "description": "Monitor Ebay site response times",
      "disableAlerting": false,
      "type": "webcheck",
      "lastUpdated": 1,
      "stopMonitoringByFolder": false,
      "id": 1,
      "stopMonitoring": true,
      "userPermission": "string",
      "individualSmAlertEnable": true,
      "checkpoints": [
        {
          "geoInfo": "string",
          "id": 4,
          "smgId": 2
        },
        {
          "geoInfo": "string",
          "id": 5,
          "smgId": 5
        },
        {
          "geoInfo": "string",
          "id": 9,
          "smgId": 2
        },
        {
          "geoInfo": "string",
          "id": 2,
          "smgId": 10
        },
        {
          "geoInfo": "string",
          "id": 4,
          "smgId": 6
        },
        {
          "geoInfo": "string",
          "id": 9,
          "smgId": 8
        },
        {
          "geoInfo": "string",
          "id": 2,
          "smgId": 7
        }
      ],
      "transition": 1,
      "globalSmAlertCond": 2,
      "isInternal": true,
      "collectors": [
        {
          "hostname": "string",
          "collectorGroupName": "string",
          "collectorGroupId": 1,
          "description": "string",
          "id": 9,
          "status": "string"
        },
        {
          "hostname": "string",
          "collectorGroupName": "string",
          "collectorGroupId": 6,
          "description": "string",
          "id": 2,
          "status": "string"
        },
        {
          "hostname": "string",
          "collectorGroupName": "string",
          "collectorGroupId": 10,
          "description": "string",
          "id": 7,
          "status": "string"
        },
        {
          "hostname": "string",
          "collectorGroupName": "string",
          "collectorGroupId": 7,
          "description": "string",
          "id": 4,
          "status": "string"
        },
        {
          "hostname": "string",
          "collectorGroupName": "string",
          "collectorGroupId": 1,
          "description": "string",
          "id": 4,
          "status": "string"
        },
        {
          "hostname": "string",
          "collectorGroupName": "string",
          "collectorGroupId": 3,
          "description": "string",
          "id": 5,
          "status": "string"
        },
        {
          "hostname": "string",
          "collectorGroupName": "string",
          "collectorGroupId": 1,
          "description": "string",
          "id": 4,
          "status": "string"
        }
      ],
      "name": "Ebay",
      "useDefaultLocationSetting": false,
      "useDefaultAlertSetting": true,
      "individualAlertLevel": "warn",
      "properties": [
        {
          "name": "addr",
          "value": "127.0.0.1"
        },
        {
          "name": "addr",
          "value": "127.0.0.1"
        },
        {
          "name": "addr",
          "value": "127.0.0.1"
        },
        {
          "name": "addr",
          "value": "127.0.0.1"
        },
        {
          "name": "addr",
          "value": "127.0.0.1"
        },
        {
          "name": "addr",
          "value": "127.0.0.1"
        },
        {
          "name": "addr",
          "value": "127.0.0.1"
        }
      ],
      "status": "string"
    },
    {
      "template": {},
      "testLocation": null,
      "groupId": 1,
      "overallAlertLevel": "warn",
      "pollingInterval": 5,
      "description": "Monitor Ebay site response times",
      "disableAlerting": true,
      "type": "webcheck",
      "lastUpdated": 8,
      "stopMonitoringByFolder": false,
      "id": 3,
      "stopMonitoring": true,
      "userPermission": "string",
      "individualSmAlertEnable": true,
      "checkpoints": [
        {
          "geoInfo": "string",
          "id": 5,
          "smgId": 3
        },
        {
          "geoInfo": "string",
          "id": 5,
          "smgId": 7
        },
        {
          "geoInfo": "string",
          "id": 6,
          "smgId": 3
        },
        {
          "geoInfo": "string",
          "id": 10,
          "smgId": 4
        },
        {
          "geoInfo": "string",
          "id": 10,
          "smgId": 1
        },
        {
          "geoInfo": "string",
          "id": 6,
          "smgId": 2
        },
        {
          "geoInfo": "string",
          "id": 8,
          "smgId": 2
        },
        {
          "geoInfo": "string",
          "id": 3,
          "smgId": 6
        },
        {
          "geoInfo": "string",
          "id": 9,
          "smgId": 9
        },
        {
          "geoInfo": "string",
          "id": 9,
          "smgId": 2
        }
      ],
      "transition": 1,
      "globalSmAlertCond": 8,
      "isInternal": true,
      "collectors": [
        {
          "hostname": "string",
          "collectorGroupName": "string",
          "collectorGroupId": 2,
          "description": "string",
          "id": 9,
          "status": "string"
        },
        {
          "hostname": "string",
          "collectorGroupName": "string",
          "collectorGroupId": 4,
          "description": "string",
          "id": 9,
          "status": "string"
        },
        {
          "hostname": "string",
          "collectorGroupName": "string",
          "collectorGroupId": 5,
          "description": "string",
          "id": 1,
          "status": "string"
        },
        {
          "hostname": "string",
          "collectorGroupName": "string",
          "collectorGroupId": 10,
          "description": "string",
          "id": 5,
          "status": "string"
        },
        {
          "hostname": "string",
          "collectorGroupName": "string",
          "collectorGroupId": 7,
          "description": "string",
          "id": 5,
          "status": "string"
        },
        {
          "hostname": "string",
          "collectorGroupName": "string",
          "collectorGroupId": 1,
          "description": "string",
          "id": 6,
          "status": "string"
        },
        {
          "hostname": "string",
          "collectorGroupName": "string",
          "collectorGroupId": 4,
          "description": "string",
          "id": 10,
          "status": "string"
        },
        {
          "hostname": "string",
          "collectorGroupName": "string",
          "collectorGroupId": 8,
          "description": "string",
          "id": 8,
          "status": "string"
        }
      ],
      "name": "Ebay",
      "useDefaultLocationSetting": false,
      "useDefaultAlertSetting": true,
      "individualAlertLevel": "warn",
      "properties": [
        {
          "name": "addr",
          "value": "127.0.0.1"
        }
      ],
      "status": "string"
    },
    {
      "template": {},
      "testLocation": null,
      "groupId": 1,
      "overallAlertLevel": "warn",
      "pollingInterval": 5,
      "description": "Monitor Ebay site response times",
      "disableAlerting": true,
      "type": "webcheck",
      "lastUpdated": 1,
      "stopMonitoringByFolder": true,
      "id": 9,
      "stopMonitoring": false,
      "userPermission": "string",
      "individualSmAlertEnable": true,
      "checkpoints": [
        {
          "geoInfo": "string",
          "id": 9,
          "smgId": 7
        },
        {
          "geoInfo": "string",
          "id": 7,
          "smgId": 5
        },
        {
          "geoInfo": "string",
          "id": 1,
          "smgId": 5
        },
        {
          "geoInfo": "string",
          "id": 9,
          "smgId": 10
        },
        {
          "geoInfo": "string",
          "id": 10,
          "smgId": 10
        },
        {
          "geoInfo": "string",
          "id": 7,
          "smgId": 8
        },
        {
          "geoInfo": "string",
          "id": 10,
          "smgId": 5
        },
        {
          "geoInfo": "string",
          "id": 8,
          "smgId": 9
        }
      ],
      "transition": 1,
      "globalSmAlertCond": 4,
      "isInternal": false,
      "collectors": [
        {
          "hostname": "string",
          "collectorGroupName": "string",
          "collectorGroupId": 4,
          "description": "string",
          "id": 7,
          "status": "string"
        },
        {
          "hostname": "string",
          "collectorGroupName": "string",
          "collectorGroupId": 5,
          "description": "string",
          "id": 2,
          "status": "string"
        },
        {
          "hostname": "string",
          "collectorGroupName": "string",
          "collectorGroupId": 7,
          "description": "string",
          "id": 5,
          "status": "string"
        },
        {
          "hostname": "string",
          "collectorGroupName": "string",
          "collectorGroupId": 6,
          "description": "string",
          "id": 4,
          "status": "string"
        },
        {
          "hostname": "string",
          "collectorGroupName": "string",
          "collectorGroupId": 2,
          "description": "string",
          "id": 3,
          "status": "string"
        }
      ],
      "name": "Ebay",
      "useDefaultLocationSetting": true,
      "useDefaultAlertSetting": true,
      "individualAlertLevel": "warn",
      "properties": [
        {
          "name": "addr",
          "value": "127.0.0.1"
        },
        {
          "name": "addr",
          "value": "127.0.0.1"
        },
        {
          "name": "addr",
          "value": "127.0.0.1"
        },
        {
          "name": "addr",
          "value": "127.0.0.1"
        },
        {
          "name": "addr",
          "value": "127.0.0.1"
        },
        {
          "name": "addr",
          "value": "127.0.0.1"
        },
        {
          "name": "addr",
          "value": "127.0.0.1"
        },
        {
          "name": "addr",
          "value": "127.0.0.1"
        },
        {
          "name": "addr",
          "value": "127.0.0.1"
        },
        {
          "name": "addr",
          "value": "127.0.0.1"
        }
      ],
      "status": "string"
    },
    {
      "template": {},
      "testLocation": null,
      "groupId": 1,
      "overallAlertLevel": "warn",
      "pollingInterval": 5,
      "description": "Monitor Ebay site response times",
      "disableAlerting": true,
      "type": "webcheck",
      "lastUpdated": 2,
      "stopMonitoringByFolder": true,
      "id": 10,
      "stopMonitoring": true,
      "userPermission": "string",
      "individualSmAlertEnable": false,
      "checkpoints": [
        {
          "geoInfo": "string",
          "id": 10,
          "smgId": 3
        },
        {
          "geoInfo": "string",
          "id": 4,
          "smgId": 10
        },
        {
          "geoInfo": "string",
          "id": 4,
          "smgId": 3
        },
        {
          "geoInfo": "string",
          "id": 8,
          "smgId": 7
        },
        {
          "geoInfo": "string",
          "id": 9,
          "smgId": 4
        }
      ],
      "transition": 1,
      "globalSmAlertCond": 9,
      "isInternal": true,
      "collectors": [
        {
          "hostname": "string",
          "collectorGroupName": "string",
          "collectorGroupId": 3,
          "description": "string",
          "id": 2,
          "status": "string"
        },
        {
          "hostname": "string",
          "collectorGroupName": "string",
          "collectorGroupId": 7,
          "description": "string",
          "id": 3,
          "status": "string"
        },
        {
          "hostname": "string",
          "collectorGroupName": "string",
          "collectorGroupId": 5,
          "description": "string",
          "id": 7,
          "status": "string"
        },
        {
          "hostname": "string",
          "collectorGroupName": "string",
          "collectorGroupId": 5,
          "description": "string",
          "id": 3,
          "status": "string"
        },
        {
          "hostname": "string",
          "collectorGroupName": "string",
          "collectorGroupId": 10,
          "description": "string",
          "id": 9,
          "status": "string"
        },
        {
          "hostname": "string",
          "collectorGroupName": "string",
          "collectorGroupId": 6,
          "description": "string",
          "id": 1,
          "status": "string"
        },
        {
          "hostname": "string",
          "collectorGroupName": "string",
          "collectorGroupId": 9,
          "description": "string",
          "id": 10,
          "status": "string"
        }
      ],
      "name": "Ebay",
      "useDefaultLocationSetting": true,
      "useDefaultAlertSetting": true,
      "individualAlertLevel": "warn",
      "properties": [
        {
          "name": "addr",
          "value": "127.0.0.1"
        },
        {
          "name": "addr",
          "value": "127.0.0.1"
        },
        {
          "name": "addr",
          "value": "127.0.0.1"
        },
        {
          "name": "addr",
          "value": "127.0.0.1"
        },
        {
          "name": "addr",
          "value": "127.0.0.1"
        },
        {
          "name": "addr",
          "value": "127.0.0.1"
        },
        {
          "name": "addr",
          "value": "127.0.0.1"
        },
        {
          "name": "addr",
          "value": "127.0.0.1"
        },
        {
          "name": "addr",
          "value": "127.0.0.1"
        },
        {
          "name": "addr",
          "value": "127.0.0.1"
        }
      ],
      "status": "string"
    },
    {
      "template": {},
      "testLocation": null,
      "groupId": 1,
      "overallAlertLevel": "warn",
      "pollingInterval": 5,
      "description": "Monitor Ebay site response times",
      "disableAlerting": true,
      "type": "webcheck",
      "lastUpdated": 6,
      "stopMonitoringByFolder": true,
      "id": 2,
      "stopMonitoring": false,
      "userPermission": "string",
      "individualSmAlertEnable": true,
      "checkpoints": [
        {
          "geoInfo": "string",
          "id": 8,
          "smgId": 2
        },
        {
          "geoInfo": "string",
          "id": 4,
          "smgId": 2
        },
        {
          "geoInfo": "string",
          "id": 8,
          "smgId": 9
        },
        {
          "geoInfo": "string",
          "id": 1,
          "smgId": 10
        },
        {
          "geoInfo": "string",
          "id": 3,
          "smgId": 2
        },
        {
          "geoInfo": "string",
          "id": 4,
          "smgId": 3
        },
        {
          "geoInfo": "string",
          "id": 7,
          "smgId": 7
        },
        {
          "geoInfo": "string",
          "id": 3,
          "smgId": 1
        },
        {
          "geoInfo": "string",
          "id": 4,
          "smgId": 8
        },
        {
          "geoInfo": "string",
          "id": 7,
          "smgId": 7
        }
      ],
      "transition": 1,
      "globalSmAlertCond": 1,
      "isInternal": true,
      "collectors": [
        {
          "hostname": "string",
          "collectorGroupName": "string",
          "collectorGroupId": 3,
          "description": "string",
          "id": 10,
          "status": "string"
        },
        {
          "hostname": "string",
          "collectorGroupName": "string",
          "collectorGroupId": 3,
          "description": "string",
          "id": 9,
          "status": "string"
        },
        {
          "hostname": "string",
          "collectorGroupName": "string",
          "collectorGroupId": 7,
          "description": "string",
          "id": 6,
          "status": "string"
        },
        {
          "hostname": "string",
          "collectorGroupName": "string",
          "collectorGroupId": 7,
          "description": "string",
          "id": 8,
          "status": "string"
        },
        {
          "hostname": "string",
          "collectorGroupName": "string",
          "collectorGroupId": 4,
          "description": "string",
          "id": 4,
          "status": "string"
        },
        {
          "hostname": "string",
          "collectorGroupName": "string",
          "collectorGroupId": 6,
          "description": "string",
          "id": 8,
          "status": "string"
        },
        {
          "hostname": "string",
          "collectorGroupName": "string",
          "collectorGroupId": 8,
          "description": "string",
          "id": 3,
          "status": "string"
        },
        {
          "hostname": "string",
          "collectorGroupName": "string",
          "collectorGroupId": 3,
          "description": "string",
          "id": 7,
          "status": "string"
        },
        {
          "hostname": "string",
          "collectorGroupName": "string",
          "collectorGroupId": 7,
          "description": "string",
          "id": 8,
          "status": "string"
        },
        {
          "hostname": "string",
          "collectorGroupName": "string",
          "collectorGroupId": 10,
          "description": "string",
          "id": 9,
          "status": "string"
        }
      ],
      "name": "Ebay",
      "useDefaultLocationSetting": false,
      "useDefaultAlertSetting": true,
      "individualAlertLevel": "warn",
      "properties": [
        {
          "name": "addr",
          "value": "127.0.0.1"
        },
        {
          "name": "addr",
          "value": "127.0.0.1"
        },
        {
          "name": "addr",
          "value": "127.0.0.1"
        },
        {
          "name": "addr",
          "value": "127.0.0.1"
        },
        {
          "name": "addr",
          "value": "127.0.0.1"
        },
        {
          "name": "addr",
          "value": "127.0.0.1"
        },
        {
          "name": "addr",
          "value": "127.0.0.1"
        }
      ],
      "status": "string"
    },
    {
      "template": {},
      "testLocation": null,
      "groupId": 1,
      "overallAlertLevel": "warn",
      "pollingInterval": 5,
      "description": "Monitor Ebay site response times",
      "disableAlerting": true,
      "type": "webcheck",
      "lastUpdated": 4,
      "stopMonitoringByFolder": false,
      "id": 9,
      "stopMonitoring": false,
      "userPermission": "string",
      "individualSmAlertEnable": true,
      "checkpoints": [
        {
          "geoInfo": "string",
          "id": 9,
          "smgId": 3
        },
        {
          "geoInfo": "string",
          "id": 2,
          "smgId": 8
        },
        {
          "geoInfo": "string",
          "id": 5,
          "smgId": 6
        },
        {
          "geoInfo": "string",
          "id": 1,
          "smgId": 10
        },
        {
          "geoInfo": "string",
          "id": 6,
          "smgId": 10
        },
        {
          "geoInfo": "string",
          "id": 9,
          "smgId": 2
        },
        {
          "geoInfo": "string",
          "id": 3,
          "smgId": 6
        },
        {
          "geoInfo": "string",
          "id": 10,
          "smgId": 8
        },
        {
          "geoInfo": "string",
          "id": 5,
          "smgId": 8
        },
        {
          "geoInfo": "string",
          "id": 8,
          "smgId": 2
        }
      ],
      "transition": 1,
      "globalSmAlertCond": 2,
      "isInternal": false,
      "collectors": [
        {
          "hostname": "string",
          "collectorGroupName": "string",
          "collectorGroupId": 8,
          "description": "string",
          "id": 7,
          "status": "string"
        },
        {
          "hostname": "string",
          "collectorGroupName": "string",
          "collectorGroupId": 3,
          "description": "string",
          "id": 4,
          "status": "string"
        },
        {
          "hostname": "string",
          "collectorGroupName": "string",
          "collectorGroupId": 2,
          "description": "string",
          "id": 8,
          "status": "string"
        },
        {
          "hostname": "string",
          "collectorGroupName": "string",
          "collectorGroupId": 4,
          "description": "string",
          "id": 7,
          "status": "string"
        },
        {
          "hostname": "string",
          "collectorGroupName": "string",
          "collectorGroupId": 3,
          "description": "string",
          "id": 5,
          "status": "string"
        },
        {
          "hostname": "string",
          "collectorGroupName": "string",
          "collectorGroupId": 5,
          "description": "string",
          "id": 6,
          "status": "string"
        },
        {
          "hostname": "string",
          "collectorGroupName": "string",
          "collectorGroupId": 1,
          "description": "string",
          "id": 4,
          "status": "string"
        },
        {
          "hostname": "string",
          "collectorGroupName": "string",
          "collectorGroupId": 1,
          "description": "string",
          "id": 10,
          "status": "string"
        }
      ],
      "name": "Ebay",
      "useDefaultLocationSetting": false,
      "useDefaultAlertSetting": true,
      "individualAlertLevel": "warn",
      "properties": [
        {
          "name": "addr",
          "value": "127.0.0.1"
        },
        {
          "name": "addr",
          "value": "127.0.0.1"
        }
      ],
      "status": "string"
    },
    {
      "template": {},
      "testLocation": null,
      "groupId": 1,
      "overallAlertLevel": "warn",
      "pollingInterval": 5,
      "description": "Monitor Ebay site response times",
      "disableAlerting": false,
      "type": "webcheck",
      "lastUpdated": 2,
      "stopMonitoringByFolder": true,
      "id": 10,
      "stopMonitoring": true,
      "userPermission": "string",
      "individualSmAlertEnable": false,
      "checkpoints": [
        {
          "geoInfo": "string",
          "id": 6,
          "smgId": 6
        },
        {
          "geoInfo": "string",
          "id": 5,
          "smgId": 7
        },
        {
          "geoInfo": "string",
          "id": 2,
          "smgId": 5
        },
        {
          "geoInfo": "string",
          "id": 8,
          "smgId": 1
        },
        {
          "geoInfo": "string",
          "id": 3,
          "smgId": 2
        },
        {
          "geoInfo": "string",
          "id": 8,
          "smgId": 1
        }
      ],
      "transition": 1,
      "globalSmAlertCond": 1,
      "isInternal": false,
      "collectors": [
        {
          "hostname": "string",
          "collectorGroupName": "string",
          "collectorGroupId": 1,
          "description": "string",
          "id": 5,
          "status": "string"
        },
        {
          "hostname": "string",
          "collectorGroupName": "string",
          "collectorGroupId": 2,
          "description": "string",
          "id": 2,
          "status": "string"
        },
        {
          "hostname": "string",
          "collectorGroupName": "string",
          "collectorGroupId": 5,
          "description": "string",
          "id": 8,
          "status": "string"
        },
        {
          "hostname": "string",
          "collectorGroupName": "string",
          "collectorGroupId": 3,
          "description": "string",
          "id": 4,
          "status": "string"
        },
        {
          "hostname": "string",
          "collectorGroupName": "string",
          "collectorGroupId": 1,
          "description": "string",
          "id": 6,
          "status": "string"
        },
        {
          "hostname": "string",
          "collectorGroupName": "string",
          "collectorGroupId": 1,
          "description": "string",
          "id": 5,
          "status": "string"
        },
        {
          "hostname": "string",
          "collectorGroupName": "string",
          "collectorGroupId": 2,
          "description": "string",
          "id": 9,
          "status": "string"
        },
        {
          "hostname": "string",
          "collectorGroupName": "string",
          "collectorGroupId": 1,
          "description": "string",
          "id": 8,
          "status": "string"
        },
        {
          "hostname": "string",
          "collectorGroupName": "string",
          "collectorGroupId": 10,
          "description": "string",
          "id": 4,
          "status": "string"
        },
        {
          "hostname": "string",
          "collectorGroupName": "string",
          "collectorGroupId": 7,
          "description": "string",
          "id": 8,
          "status": "string"
        }
      ],
      "name": "Ebay",
      "useDefaultLocationSetting": true,
      "useDefaultAlertSetting": true,
      "individualAlertLevel": "warn",
      "properties": [
        {
          "name": "addr",
          "value": "127.0.0.1"
        },
        {
          "name": "addr",
          "value": "127.0.0.1"
        },
        {
          "name": "addr",
          "value": "127.0.0.1"
        },
        {
          "name": "addr",
          "value": "127.0.0.1"
        },
        {
          "name": "addr",
          "value": "127.0.0.1"
        },
        {
          "name": "addr",
          "value": "127.0.0.1"
        },
        {
          "name": "addr",
          "value": "127.0.0.1"
        },
        {
          "name": "addr",
          "value": "127.0.0.1"
        },
        {
          "name": "addr",
          "value": "127.0.0.1"
        }
      ],
      "status": "string"
    },
    {
      "template": {},
      "testLocation": null,
      "groupId": 1,
      "overallAlertLevel": "warn",
      "pollingInterval": 5,
      "description": "Monitor Ebay site response times",
      "disableAlerting": false,
      "type": "webcheck",
      "lastUpdated": 7,
      "stopMonitoringByFolder": false,
      "id": 4,
      "stopMonitoring": true,
      "userPermission": "string",
      "individualSmAlertEnable": true,
      "checkpoints": [
        {
          "geoInfo": "string",
          "id": 4,
          "smgId": 5
        },
        {
          "geoInfo": "string",
          "id": 1,
          "smgId": 10
        },
        {
          "geoInfo": "string",
          "id": 9,
          "smgId": 4
        },
        {
          "geoInfo": "string",
          "id": 5,
          "smgId": 4
        },
        {
          "geoInfo": "string",
          "id": 5,
          "smgId": 7
        },
        {
          "geoInfo": "string",
          "id": 3,
          "smgId": 1
        },
        {
          "geoInfo": "string",
          "id": 2,
          "smgId": 10
        },
        {
          "geoInfo": "string",
          "id": 9,
          "smgId": 6
        }
      ],
      "transition": 1,
      "globalSmAlertCond": 8,
      "isInternal": true,
      "collectors": [
        {
          "hostname": "string",
          "collectorGroupName": "string",
          "collectorGroupId": 2,
          "description": "string",
          "id": 5,
          "status": "string"
        },
        {
          "hostname": "string",
          "collectorGroupName": "string",
          "collectorGroupId": 6,
          "description": "string",
          "id": 3,
          "status": "string"
        },
        {
          "hostname": "string",
          "collectorGroupName": "string",
          "collectorGroupId": 7,
          "description": "string",
          "id": 2,
          "status": "string"
        },
        {
          "hostname": "string",
          "collectorGroupName": "string",
          "collectorGroupId": 7,
          "description": "string",
          "id": 10,
          "status": "string"
        },
        {
          "hostname": "string",
          "collectorGroupName": "string",
          "collectorGroupId": 2,
          "description": "string",
          "id": 3,
          "status": "string"
        },
        {
          "hostname": "string",
          "collectorGroupName": "string",
          "collectorGroupId": 5,
          "description": "string",
          "id": 9,
          "status": "string"
        },
        {
          "hostname": "string",
          "collectorGroupName": "string",
          "collectorGroupId": 8,
          "description": "string",
          "id": 7,
          "status": "string"
        },
        {
          "hostname": "string",
          "collectorGroupName": "string",
          "collectorGroupId": 1,
          "description": "string",
          "id": 9,
          "status": "string"
        },
        {
          "hostname": "string",
          "collectorGroupName": "string",
          "collectorGroupId": 4,
          "description": "string",
          "id": 5,
          "status": "string"
        }
      ],
      "name": "Ebay",
      "useDefaultLocationSetting": false,
      "useDefaultAlertSetting": true,
      "individualAlertLevel": "warn",
      "properties": [
        {
          "name": "addr",
          "value": "127.0.0.1"
        },
        {
          "name": "addr",
          "value": "127.0.0.1"
        },
        {
          "name": "addr",
          "value": "127.0.0.1"
        },
        {
          "name": "addr",
          "value": "127.0.0.1"
        },
        {
          "name": "addr",
          "value": "127.0.0.1"
        }
      ],
      "status": "string"
    },
    {
      "template": {},
      "testLocation": null,
      "groupId": 1,
      "overallAlertLevel": "warn",
      "pollingInterval": 5,
      "description": "Monitor Ebay site response times",
      "disableAlerting": true,
      "type": "webcheck",
      "lastUpdated": 2,
      "stopMonitoringByFolder": true,
      "id": 8,
      "stopMonitoring": false,
      "userPermission": "string",
      "individualSmAlertEnable": false,
      "checkpoints": [
        {
          "geoInfo": "string",
          "id": 10,
          "smgId": 5
        }
      ],
      "transition": 1,
      "globalSmAlertCond": 4,
      "isInternal": true,
      "collectors": [
        {
          "hostname": "string",
          "collectorGroupName": "string",
          "collectorGroupId": 3,
          "description": "string",
          "id": 4,
          "status": "string"
        },
        {
          "hostname": "string",
          "collectorGroupName": "string",
          "collectorGroupId": 4,
          "description": "string",
          "id": 7,
          "status": "string"
        },
        {
          "hostname": "string",
          "collectorGroupName": "string",
          "collectorGroupId": 5,
          "description": "string",
          "id": 7,
          "status": "string"
        },
        {
          "hostname": "string",
          "collectorGroupName": "string",
          "collectorGroupId": 2,
          "description": "string",
          "id": 4,
          "status": "string"
        },
        {
          "hostname": "string",
          "collectorGroupName": "string",
          "collectorGroupId": 8,
          "description": "string",
          "id": 7,
          "status": "string"
        },
        {
          "hostname": "string",
          "collectorGroupName": "string",
          "collectorGroupId": 8,
          "description": "string",
          "id": 3,
          "status": "string"
        },
        {
          "hostname": "string",
          "collectorGroupName": "string",
          "collectorGroupId": 3,
          "description": "string",
          "id": 6,
          "status": "string"
        }
      ],
      "name": "Ebay",
      "useDefaultLocationSetting": true,
      "useDefaultAlertSetting": true,
      "individualAlertLevel": "warn",
      "properties": [
        {
          "name": "addr",
          "value": "127.0.0.1"
        },
        {
          "name": "addr",
          "value": "127.0.0.1"
        },
        {
          "name": "addr",
          "value": "127.0.0.1"
        },
        {
          "name": "addr",
          "value": "127.0.0.1"
        },
        {
          "name": "addr",
          "value": "127.0.0.1"
        },
        {
          "name": "addr",
          "value": "127.0.0.1"
        }
      ],
      "status": "string"
    },
    {
      "template": {},
      "testLocation": null,
      "groupId": 1,
      "overallAlertLevel": "warn",
      "pollingInterval": 5,
      "description": "Monitor Ebay site response times",
      "disableAlerting": true,
      "type": "webcheck",
      "lastUpdated": 8,
      "stopMonitoringByFolder": false,
      "id": 9,
      "stopMonitoring": true,
      "userPermission": "string",
      "individualSmAlertEnable": false,
      "checkpoints": [
        {
          "geoInfo": "string",
          "id": 5,
          "smgId": 6
        },
        {
          "geoInfo": "string",
          "id": 1,
          "smgId": 6
        },
        {
          "geoInfo": "string",
          "id": 1,
          "smgId": 1
        },
        {
          "geoInfo": "string",
          "id": 4,
          "smgId": 8
        },
        {
          "geoInfo": "string",
          "id": 9,
          "smgId": 6
        }
      ],
      "transition": 1,
      "globalSmAlertCond": 9,
      "isInternal": true,
      "collectors": [
        {
          "hostname": "string",
          "collectorGroupName": "string",
          "collectorGroupId": 9,
          "description": "string",
          "id": 3,
          "status": "string"
        },
        {
          "hostname": "string",
          "collectorGroupName": "string",
          "collectorGroupId": 5,
          "description": "string",
          "id": 3,
          "status": "string"
        },
        {
          "hostname": "string",
          "collectorGroupName": "string",
          "collectorGroupId": 2,
          "description": "string",
          "id": 2,
          "status": "string"
        },
        {
          "hostname": "string",
          "collectorGroupName": "string",
          "collectorGroupId": 7,
          "description": "string",
          "id": 6,
          "status": "string"
        },
        {
          "hostname": "string",
          "collectorGroupName": "string",
          "collectorGroupId": 1,
          "description": "string",
          "id": 4,
          "status": "string"
        },
        {
          "hostname": "string",
          "collectorGroupName": "string",
          "collectorGroupId": 9,
          "description": "string",
          "id": 4,
          "status": "string"
        },
        {
          "hostname": "string",
          "collectorGroupName": "string",
          "collectorGroupId": 6,
          "description": "string",
          "id": 3,
          "status": "string"
        },
        {
          "hostname": "string",
          "collectorGroupName": "string",
          "collectorGroupId": 3,
          "description": "string",
          "id": 1,
          "status": "string"
        }
      ],
      "name": "Ebay",
      "useDefaultLocationSetting": true,
      "useDefaultAlertSetting": true,
      "individualAlertLevel": "warn",
      "properties": [
        {
          "name": "addr",
          "value": "127.0.0.1"
        },
        {
          "name": "addr",
          "value": "127.0.0.1"
        },
        {
          "name": "addr",
          "value": "127.0.0.1"
        },
        {
          "name": "addr",
          "value": "127.0.0.1"
        },
        {
          "name": "addr",
          "value": "127.0.0.1"
        },
        {
          "name": "addr",
          "value": "127.0.0.1"
        },
        {
          "name": "addr",
          "value": "127.0.0.1"
        },
        {
          "name": "addr",
          "value": "127.0.0.1"
        }
      ],
      "status": "string"
    }
  ]
}