{
  "resourceId": 4,
  "instanceName": "string",
  "monitorObjectId": 2,
  "endEpoch": 5,
  "rule": "string",
  "threshold": "string",
  "type": "string",
  "startEpoch": 3,
  "enableAnomalyAlertGeneration": "string",
  "internalId": "string",
  "ackComment": "string",
  "monitorObjectName": "string",
  "dataPointName": "string",
  "instanceId": 3,
  "dataPointId": 7,
  "nextRecipient": 6,
  "id": "string",
  "detailMessage": {},
  "ruleId": 7,
  "alertValue": "string",
  "ackedBy": "string",
  "severity": 2,
  "sdted": true,
  "ackedEpoch": 6,
  "chain": "string",
  "SDT": {},
  "subChainId": 5,
  "enableAnomalyAlertSuppression": "string",
  "receivedList": "string",
  "monitorObjectType": "string",
  "customColumns": {},
  "acked": false,
  "resourceTemplateType": "string",
  "clearValue": "string",
  "instanceDescription": "string",
  "monitorObjectGroups": {},
  "chainId": 5,
  "resourceTemplateId": 10,
  "cleared": true,
  "resourceTemplateName": "string"
}