{
  "inheritList": [
    {
      "fullpath": "string",
      "id": 6,
      "type": "string",
      "value": "string"
    },
    {
      "fullpath": "string",
      "id": 2,
      "type": "string",
      "value": "string"
    },
    {
      "fullpath": "string",
      "id": 5,
      "type": "string",
      "value": "string"
    },
    {
      "fullpath": "string",
      "id": 2,
      "type": "string",
      "value": "string"
    },
    {
      "fullpath": "string",
      "id": 6,
      "type": "string",
      "value": "string"
    },
    {
      "fullpath": "string",
      "id": 8,
      "type": "string",
      "value": "string"
    },
    {
      "fullpath": "string",
      "id": 8,
      "type": "string",
      "value": "string"
    },
    {
      "fullpath": "string",
      "id": 1,
      "type": "string",
      "value": "string"
    },
    {
      "fullpath": "string",
      "id": 7,
      "type": "string",
      "value": "string"
    },
    {
      "fullpath": "string",
      "id": 2,
      "type": "string",
      "value": "string"
    }
  ],
  "name": "string",
  "type": "string",
  "value": "string"
}