{
  "total": 10,
  "searchId": "string",
  "items": [
    {
      "base1024": false,
      "timeScale": "string",
      "maxValue": {},
      "displayPrio": 5,
      "aggregated": true,
      "title": "string",
      "virtualDataPoints": [
        {
          "rpn": "string",
          "name": "string"
        },
        {
          "rpn": "string",
          "name": "string"
        },
        {
          "rpn": "string",
          "name": "string"
        },
        {
          "rpn": "string",
          "name": "string"
        },
        {
          "rpn": "string",
          "name": "string"
        },
        {
          "rpn": "string",
          "name": "string"
        },
        {
          "rpn": "string",
          "name": "string"
        },
        {
          "rpn": "string",
          "name": "string"
        },
        {
          "rpn": "string",
          "name": "string"
        },
        {
          "rpn": "string",
          "name": "string"
        }
      ],
      "minValue": {},
      "name": "string",
      "width": 3,
      "dataPoints": [
        {
          "aggregateMethod": "string",
          "dataPointName": "string",
          "dataPointId": 4,
          "consolidateFunc": 6
        },
        {
          "aggregateMethod": "string",
          "dataPointName": "string",
          "dataPointId": 8,
          "consolidateFunc": 10
        },
        {
          "aggregateMethod": "string",
          "dataPointName": "string",
          "dataPointId": 3,
          "consolidateFunc": 7
        },
        {
          "aggregateMethod": "string",
          "dataPointName": "string",
          "dataPointId": 9,
          "consolidateFunc": 10
        },
        {
          "aggregateMethod": "string",
          "dataPointName": "string",
          "dataPointId": 2,
          "consolidateFunc": 8
        },
        {
          "aggregateMethod": "string",
          "dataPointName": "string",
          "dataPointId": 5,
          "consolidateFunc": 3
        }
      ],
      "verticalLabel": "string",
      "id": 5,
      "rigid": true,
      "lines": [
        {
          "colorName": "string",
          "dataPointName": "string",
          "dataPointId": 4,
          "legend": "string",
          "isVirtualDataPoint": false,
          "type": 9
        },
        {
          "colorName": "string",
          "dataPointName": "string",
          "dataPointId": 4,
          "legend": "string",
          "isVirtualDataPoint": true,
          "type": 1
        },
        {
          "colorName": "string",
          "dataPointName": "string",
          "dataPointId": 5,
          "legend": "string",
          "isVirtualDataPoint": true,
          "type": 2
        },
        {
          "colorName": "string",
          "dataPointName": "string",
          "dataPointId": 3,
          "legend": "string",
          "isVirtualDataPoint": false,
          "type": 7
        },
        {
          "colorName": "string",
          "dataPointName": "string",
          "dataPointId": 2,
          "legend": "string",
          "isVirtualDataPoint": false,
          "type": 1
        },
        {
          "colorName": "string",
          "dataPointName": "string",
          "dataPointId": 2,
          "legend": "string",
          "isVirtualDataPoint": true,
          "type": 2
        },
        {
          "colorName": "string",
          "dataPointName": "string",
          "dataPointId": 9,
          "legend": "string",
          "isVirtualDataPoint": true,
          "type": 3
        },
        {
          "colorName": "string",
          "dataPointName": "string",
          "dataPointId": 4,
          "legend": "string",
          "isVirtualDataPoint": true,
          "type": 3
        },
        {
          "colorName": "string",
          "dataPointName": "string",
          "dataPointId": 7,
          "legend": "string",
          "isVirtualDataPoint": true,
          "type": 4
        },
        {
          "colorName": "string",
          "dataPointName": "string",
          "dataPointId": 4,
          "legend": "string",
          "isVirtualDataPoint": true,
          "type": 1
        }
      ],
      "height": 7
    },
    {
      "base1024": true,
      "timeScale": "string",
      "maxValue": {},
      "displayPrio": 6,
      "aggregated": false,
      "title": "string",
      "virtualDataPoints": [
        {
          "rpn": "string",
          "name": "string"
        },
        {
          "rpn": "string",
          "name": "string"
        },
        {
          "rpn": "string",
          "name": "string"
        },
        {
          "rpn": "string",
          "name": "string"
        },
        {
          "rpn": "string",
          "name": "string"
        },
        {
          "rpn": "string",
          "name": "string"
        },
        {
          "rpn": "string",
          "name": "string"
        },
        {
          "rpn": "string",
          "name": "string"
        }
      ],
      "minValue": {},
      "name": "string",
      "width": 4,
      "dataPoints": [
        {
          "aggregateMethod": "string",
          "dataPointName": "string",
          "dataPointId": 7,
          "consolidateFunc": 1
        },
        {
          "aggregateMethod": "string",
          "dataPointName": "string",
          "dataPointId": 5,
          "consolidateFunc": 8
        },
        {
          "aggregateMethod": "string",
          "dataPointName": "string",
          "dataPointId": 8,
          "consolidateFunc": 2
        },
        {
          "aggregateMethod": "string",
          "dataPointName": "string",
          "dataPointId": 7,
          "consolidateFunc": 10
        },
        {
          "aggregateMethod": "string",
          "dataPointName": "string",
          "dataPointId": 4,
          "consolidateFunc": 4
        },
        {
          "aggregateMethod": "string",
          "dataPointName": "string",
          "dataPointId": 1,
          "consolidateFunc": 1
        }
      ],
      "verticalLabel": "string",
      "id": 2,
      "rigid": false,
      "lines": [
        {
          "colorName": "string",
          "dataPointName": "string",
          "dataPointId": 5,
          "legend": "string",
          "isVirtualDataPoint": true,
          "type": 2
        },
        {
          "colorName": "string",
          "dataPointName": "string",
          "dataPointId": 5,
          "legend": "string",
          "isVirtualDataPoint": false,
          "type": 9
        },
        {
          "colorName": "string",
          "dataPointName": "string",
          "dataPointId": 6,
          "legend": "string",
          "isVirtualDataPoint": true,
          "type": 3
        },
        {
          "colorName": "string",
          "dataPointName": "string",
          "dataPointId": 2,
          "legend": "string",
          "isVirtualDataPoint": false,
          "type": 5
        },
        {
          "colorName": "string",
          "dataPointName": "string",
          "dataPointId": 7,
          "legend": "string",
          "isVirtualDataPoint": true,
          "type": 1
        },
        {
          "colorName": "string",
          "dataPointName": "string",
          "dataPointId": 2,
          "legend": "string",
          "isVirtualDataPoint": false,
          "type": 3
        },
        {
          "colorName": "string",
          "dataPointName": "string",
          "dataPointId": 3,
          "legend": "string",
          "isVirtualDataPoint": false,
          "type": 7
        }
      ],
      "height": 8
    },
    {
      "base1024": false,
      "timeScale": "string",
      "maxValue": {},
      "displayPrio": 8,
      "aggregated": true,
      "title": "string",
      "virtualDataPoints": [
        {
          "rpn": "string",
          "name": "string"
        }
      ],
      "minValue": {},
      "name": "string",
      "width": 4,
      "dataPoints": [
        {
          "aggregateMethod": "string",
          "dataPointName": "string",
          "dataPointId": 9,
          "consolidateFunc": 6
        },
        {
          "aggregateMethod": "string",
          "dataPointName": "string",
          "dataPointId": 2,
          "consolidateFunc": 3
        },
        {
          "aggregateMethod": "string",
          "dataPointName": "string",
          "dataPointId": 3,
          "consolidateFunc": 1
        },
        {
          "aggregateMethod": "string",
          "dataPointName": "string",
          "dataPointId": 4,
          "consolidateFunc": 1
        },
        {
          "aggregateMethod": "string",
          "dataPointName": "string",
          "dataPointId": 3,
          "consolidateFunc": 7
        },
        {
          "aggregateMethod": "string",
          "dataPointName": "string",
          "dataPointId": 7,
          "consolidateFunc": 5
        },
        {
          "aggregateMethod": "string",
          "dataPointName": "string",
          "dataPointId": 9,
          "consolidateFunc": 3
        },
        {
          "aggregateMethod": "string",
          "dataPointName": "string",
          "dataPointId": 4,
          "consolidateFunc": 4
        },
        {
          "aggregateMethod": "string",
          "dataPointName": "string",
          "dataPointId": 3,
          "consolidateFunc": 9
        },
        {
          "aggregateMethod": "string",
          "dataPointName": "string",
          "dataPointId": 3,
          "consolidateFunc": 6
        }
      ],
      "verticalLabel": "string",
      "id": 5,
      "rigid": false,
      "lines": [
        {
          "colorName": "string",
          "dataPointName": "string",
          "dataPointId": 9,
          "legend": "string",
          "isVirtualDataPoint": false,
          "type": 1
        },
        {
          "colorName": "string",
          "dataPointName": "string",
          "dataPointId": 8,
          "legend": "string",
          "isVirtualDataPoint": false,
          "type": 10
        }
      ],
      "height": 9
    },
    {
      "base1024": true,
      "timeScale": "string",
      "maxValue": {},
      "displayPrio": 8,
      "aggregated": false,
      "title": "string",
      "virtualDataPoints": [
        {
          "rpn": "string",
          "name": "string"
        },
        {
          "rpn": "string",
          "name": "string"
        }
      ],
      "minValue": {},
      "name": "string",
      "width": 7,
      "dataPoints": [
        {
          "aggregateMethod": "string",
          "dataPointName": "string",
          "dataPointId": 2,
          "consolidateFunc": 3
        },
        {
          "aggregateMethod": "string",
          "dataPointName": "string",
          "dataPointId": 3,
          "consolidateFunc": 7
        },
        {
          "aggregateMethod": "string",
          "dataPointName": "string",
          "dataPointId": 6,
          "consolidateFunc": 1
        }
      ],
      "verticalLabel": "string",
      "id": 9,
      "rigid": true,
      "lines": [
        {
          "colorName": "string",
          "dataPointName": "string",
          "dataPointId": 10,
          "legend": "string",
          "isVirtualDataPoint": true,
          "type": 3
        },
        {
          "colorName": "string",
          "dataPointName": "string",
          "dataPointId": 5,
          "legend": "string",
          "isVirtualDataPoint": false,
          "type": 10
        }
      ],
      "height": 7
    }
  ]
}