{
  "total": 2,
  "searchId": "string",
  "items": [
    {
      "collectorAttribute": {
        "name": "string"
      },
      "autoDiscoveryConfig": {
        "persistentInstance": false,
        "scheduleInterval": 2,
        "deleteInactiveInstance": false,
        "method": {
          "name": "string"
        },
        "instanceAutoGroupMethod": "string",
        "instanceAutoGroupMethodParams": "string",
        "filters": [
          {
            "comment": "string",
            "attribute": "string",
            "operation": "string",
            "value": "string"
          },
          {
            "comment": "string",
            "attribute": "string",
            "operation": "string",
            "value": "string"
          },
          {
            "comment": "string",
            "attribute": "string",
            "operation": "string",
            "value": "string"
          },
          {
            "comment": "string",
            "attribute": "string",
            "operation": "string",
            "value": "string"
          },
          {
            "comment": "string",
            "attribute": "string",
            "operation": "string",
            "value": "string"
          },
          {
            "comment": "string",
            "attribute": "string",
            "operation": "string",
            "value": "string"
          },
          {
            "comment": "string",
            "attribute": "string",
            "operation": "string",
            "value": "string"
          },
          {
            "comment": "string",
            "attribute": "string",
            "operation": "string",
            "value": "string"
          },
          {
            "comment": "string",
            "attribute": "string",
            "operation": "string",
            "value": "string"
          }
        ],
        "disableInstance": false,
        "dataSourceName": "string"
      },
      "eriDiscoveryConfig": {
        "winScript": "string",
        "groovyScript": "string",
        "name": "string",
        "type": "string",
        "linuxCmdline": "string",
        "linuxScript": "string",
        "winCmdline": "string"
      },
      "displayName": "string",
      "description": "string",
      "appliesTo": "string",
      "enableAutoDiscovery": false,
      "technology": "string",
      "version": 6,
      "tags": "string",
      "auditVersion": 5,
      "hasMultiInstances": true,
      "collectMethod": "string",
      "eriDiscoveryInterval": 6,
      "enableEriDiscovery": false,
      "collectInterval": 2,
      "name": "string",
      "dataPoints": [
        {
          "alertForNoData": 9,
          "maxValue": "string",
          "dataType": 9,
          "postProcessorMethod": "string",
          "postProcessorParam": "string",
          "maxDigits": 5,
          "rawDataFieldName": "string",
          "description": "string",
          "alertClearTransitionInterval": 3,
          "userParam3": "string",
          "userParam2": "string",
          "type": 10,
          "alertExprNote": "string",
          "dataSourceId": 1,
          "minValue": "string",
          "alertBody": "string",
          "userParam1": "string",
          "name": "string",
          "alertSubject": "string",
          "id": 4,
          "alertTransitionInterval": 6,
          "alertExpr": "string"
        },
        {
          "alertForNoData": 8,
          "maxValue": "string",
          "dataType": 4,
          "postProcessorMethod": "string",
          "postProcessorParam": "string",
          "maxDigits": 1,
          "rawDataFieldName": "string",
          "description": "string",
          "alertClearTransitionInterval": 8,
          "userParam3": "string",
          "userParam2": "string",
          "type": 9,
          "alertExprNote": "string",
          "dataSourceId": 4,
          "minValue": "string",
          "alertBody": "string",
          "userParam1": "string",
          "name": "string",
          "alertSubject": "string",
          "id": 9,
          "alertTransitionInterval": 7,
          "alertExpr": "string"
        },
        {
          "alertForNoData": 1,
          "maxValue": "string",
          "dataType": 7,
          "postProcessorMethod": "string",
          "postProcessorParam": "string",
          "maxDigits": 10,
          "rawDataFieldName": "string",
          "description": "string",
          "alertClearTransitionInterval": 8,
          "userParam3": "string",
          "userParam2": "string",
          "type": 6,
          "alertExprNote": "string",
          "dataSourceId": 6,
          "minValue": "string",
          "alertBody": "string",
          "userParam1": "string",
          "name": "string",
          "alertSubject": "string",
          "id": 1,
          "alertTransitionInterval": 7,
          "alertExpr": "string"
        },
        {
          "alertForNoData": 6,
          "maxValue": "string",
          "dataType": 5,
          "postProcessorMethod": "string",
          "postProcessorParam": "string",
          "maxDigits": 2,
          "rawDataFieldName": "string",
          "description": "string",
          "alertClearTransitionInterval": 3,
          "userParam3": "string",
          "userParam2": "string",
          "type": 3,
          "alertExprNote": "string",
          "dataSourceId": 2,
          "minValue": "string",
          "alertBody": "string",
          "userParam1": "string",
          "name": "string",
          "alertSubject": "string",
          "id": 8,
          "alertTransitionInterval": 8,
          "alertExpr": "string"
        },
        {
          "alertForNoData": 3,
          "maxValue": "string",
          "dataType": 6,
          "postProcessorMethod": "string",
          "postProcessorParam": "string",
          "maxDigits": 5,
          "rawDataFieldName": "string",
          "description": "string",
          "alertClearTransitionInterval": 9,
          "userParam3": "string",
          "userParam2": "string",
          "type": 1,
          "alertExprNote": "string",
          "dataSourceId": 3,
          "minValue": "string",
          "alertBody": "string",
          "userParam1": "string",
          "name": "string",
          "alertSubject": "string",
          "id": 10,
          "alertTransitionInterval": 1,
          "alertExpr": "string"
        },
        {
          "alertForNoData": 4,
          "maxValue": "string",
          "dataType": 4,
          "postProcessorMethod": "string",
          "postProcessorParam": "string",
          "maxDigits": 3,
          "rawDataFieldName": "string",
          "description": "string",
          "alertClearTransitionInterval": 9,
          "userParam3": "string",
          "userParam2": "string",
          "type": 6,
          "alertExprNote": "string",
          "dataSourceId": 3,
          "minValue": "string",
          "alertBody": "string",
          "userParam1": "string",
          "name": "string",
          "alertSubject": "string",
          "id": 8,
          "alertTransitionInterval": 10,
          "alertExpr": "string"
        },
        {
          "alertForNoData": 6,
          "maxValue": "string",
          "dataType": 5,
          "postProcessorMethod": "string",
          "postProcessorParam": "string",
          "maxDigits": 2,
          "rawDataFieldName": "string",
          "description": "string",
          "alertClearTransitionInterval": 1,
          "userParam3": "string",
          "userParam2": "string",
          "type": 4,
          "alertExprNote": "string",
          "dataSourceId": 8,
          "minValue": "string",
          "alertBody": "string",
          "userParam1": "string",
          "name": "string",
          "alertSubject": "string",
          "id": 3,
          "alertTransitionInterval": 1,
          "alertExpr": "string"
        },
        {
          "alertForNoData": 6,
          "maxValue": "string",
          "dataType": 4,
          "postProcessorMethod": "string",
          "postProcessorParam": "string",
          "maxDigits": 3,
          "rawDataFieldName": "string",
          "description": "string",
          "alertClearTransitionInterval": 10,
          "userParam3": "string",
          "userParam2": "string",
          "type": 10,
          "alertExprNote": "string",
          "dataSourceId": 7,
          "minValue": "string",
          "alertBody": "string",
          "userParam1": "string",
          "name": "string",
          "alertSubject": "string",
          "id": 6,
          "alertTransitionInterval": 5,
          "alertExpr": "string"
        },
        {
          "alertForNoData": 5,
          "maxValue": "string",
          "dataType": 10,
          "postProcessorMethod": "string",
          "postProcessorParam": "string",
          "maxDigits": 2,
          "rawDataFieldName": "string",
          "description": "string",
          "alertClearTransitionInterval": 7,
          "userParam3": "string",
          "userParam2": "string",
          "type": 7,
          "alertExprNote": "string",
          "dataSourceId": 2,
          "minValue": "string",
          "alertBody": "string",
          "userParam1": "string",
          "name": "string",
          "alertSubject": "string",
          "id": 10,
          "alertTransitionInterval": 2,
          "alertExpr": "string"
        }
      ],
      "id": 3,
      "group": "string"
    },
    {
      "collectorAttribute": {
        "name": "string"
      },
      "autoDiscoveryConfig": {
        "persistentInstance": false,
        "scheduleInterval": 2,
        "deleteInactiveInstance": true,
        "method": {
          "name": "string"
        },
        "instanceAutoGroupMethod": "string",
        "instanceAutoGroupMethodParams": "string",
        "filters": [
          {
            "comment": "string",
            "attribute": "string",
            "operation": "string",
            "value": "string"
          },
          {
            "comment": "string",
            "attribute": "string",
            "operation": "string",
            "value": "string"
          },
          {
            "comment": "string",
            "attribute": "string",
            "operation": "string",
            "value": "string"
          },
          {
            "comment": "string",
            "attribute": "string",
            "operation": "string",
            "value": "string"
          },
          {
            "comment": "string",
            "attribute": "string",
            "operation": "string",
            "value": "string"
          },
          {
            "comment": "string",
            "attribute": "string",
            "operation": "string",
            "value": "string"
          },
          {
            "comment": "string",
            "attribute": "string",
            "operation": "string",
            "value": "string"
          },
          {
            "comment": "string",
            "attribute": "string",
            "operation": "string",
            "value": "string"
          },
          {
            "comment": "string",
            "attribute": "string",
            "operation": "string",
            "value": "string"
          }
        ],
        "disableInstance": false,
        "dataSourceName": "string"
      },
      "eriDiscoveryConfig": {
        "winScript": "string",
        "groovyScript": "string",
        "name": "string",
        "type": "string",
        "linuxCmdline": "string",
        "linuxScript": "string",
        "winCmdline": "string"
      },
      "displayName": "string",
      "description": "string",
      "appliesTo": "string",
      "enableAutoDiscovery": false,
      "technology": "string",
      "version": 8,
      "tags": "string",
      "auditVersion": 4,
      "hasMultiInstances": false,
      "collectMethod": "string",
      "eriDiscoveryInterval": 4,
      "enableEriDiscovery": true,
      "collectInterval": 9,
      "name": "string",
      "dataPoints": [
        {
          "alertForNoData": 4,
          "maxValue": "string",
          "dataType": 2,
          "postProcessorMethod": "string",
          "postProcessorParam": "string",
          "maxDigits": 5,
          "rawDataFieldName": "string",
          "description": "string",
          "alertClearTransitionInterval": 4,
          "userParam3": "string",
          "userParam2": "string",
          "type": 2,
          "alertExprNote": "string",
          "dataSourceId": 2,
          "minValue": "string",
          "alertBody": "string",
          "userParam1": "string",
          "name": "string",
          "alertSubject": "string",
          "id": 3,
          "alertTransitionInterval": 5,
          "alertExpr": "string"
        },
        {
          "alertForNoData": 2,
          "maxValue": "string",
          "dataType": 5,
          "postProcessorMethod": "string",
          "postProcessorParam": "string",
          "maxDigits": 10,
          "rawDataFieldName": "string",
          "description": "string",
          "alertClearTransitionInterval": 6,
          "userParam3": "string",
          "userParam2": "string",
          "type": 6,
          "alertExprNote": "string",
          "dataSourceId": 5,
          "minValue": "string",
          "alertBody": "string",
          "userParam1": "string",
          "name": "string",
          "alertSubject": "string",
          "id": 10,
          "alertTransitionInterval": 5,
          "alertExpr": "string"
        },
        {
          "alertForNoData": 7,
          "maxValue": "string",
          "dataType": 6,
          "postProcessorMethod": "string",
          "postProcessorParam": "string",
          "maxDigits": 9,
          "rawDataFieldName": "string",
          "description": "string",
          "alertClearTransitionInterval": 7,
          "userParam3": "string",
          "userParam2": "string",
          "type": 8,
          "alertExprNote": "string",
          "dataSourceId": 2,
          "minValue": "string",
          "alertBody": "string",
          "userParam1": "string",
          "name": "string",
          "alertSubject": "string",
          "id": 3,
          "alertTransitionInterval": 3,
          "alertExpr": "string"
        },
        {
          "alertForNoData": 6,
          "maxValue": "string",
          "dataType": 4,
          "postProcessorMethod": "string",
          "postProcessorParam": "string",
          "maxDigits": 9,
          "rawDataFieldName": "string",
          "description": "string",
          "alertClearTransitionInterval": 2,
          "userParam3": "string",
          "userParam2": "string",
          "type": 4,
          "alertExprNote": "string",
          "dataSourceId": 7,
          "minValue": "string",
          "alertBody": "string",
          "userParam1": "string",
          "name": "string",
          "alertSubject": "string",
          "id": 4,
          "alertTransitionInterval": 2,
          "alertExpr": "string"
        },
        {
          "alertForNoData": 10,
          "maxValue": "string",
          "dataType": 9,
          "postProcessorMethod": "string",
          "postProcessorParam": "string",
          "maxDigits": 7,
          "rawDataFieldName": "string",
          "description": "string",
          "alertClearTransitionInterval": 9,
          "userParam3": "string",
          "userParam2": "string",
          "type": 6,
          "alertExprNote": "string",
          "dataSourceId": 6,
          "minValue": "string",
          "alertBody": "string",
          "userParam1": "string",
          "name": "string",
          "alertSubject": "string",
          "id": 4,
          "alertTransitionInterval": 5,
          "alertExpr": "string"
        },
        {
          "alertForNoData": 6,
          "maxValue": "string",
          "dataType": 7,
          "postProcessorMethod": "string",
          "postProcessorParam": "string",
          "maxDigits": 7,
          "rawDataFieldName": "string",
          "description": "string",
          "alertClearTransitionInterval": 5,
          "userParam3": "string",
          "userParam2": "string",
          "type": 5,
          "alertExprNote": "string",
          "dataSourceId": 4,
          "minValue": "string",
          "alertBody": "string",
          "userParam1": "string",
          "name": "string",
          "alertSubject": "string",
          "id": 4,
          "alertTransitionInterval": 4,
          "alertExpr": "string"
        },
        {
          "alertForNoData": 2,
          "maxValue": "string",
          "dataType": 1,
          "postProcessorMethod": "string",
          "postProcessorParam": "string",
          "maxDigits": 7,
          "rawDataFieldName": "string",
          "description": "string",
          "alertClearTransitionInterval": 5,
          "userParam3": "string",
          "userParam2": "string",
          "type": 7,
          "alertExprNote": "string",
          "dataSourceId": 5,
          "minValue": "string",
          "alertBody": "string",
          "userParam1": "string",
          "name": "string",
          "alertSubject": "string",
          "id": 7,
          "alertTransitionInterval": 1,
          "alertExpr": "string"
        },
        {
          "alertForNoData": 5,
          "maxValue": "string",
          "dataType": 9,
          "postProcessorMethod": "string",
          "postProcessorParam": "string",
          "maxDigits": 6,
          "rawDataFieldName": "string",
          "description": "string",
          "alertClearTransitionInterval": 1,
          "userParam3": "string",
          "userParam2": "string",
          "type": 4,
          "alertExprNote": "string",
          "dataSourceId": 1,
          "minValue": "string",
          "alertBody": "string",
          "userParam1": "string",
          "name": "string",
          "alertSubject": "string",
          "id": 2,
          "alertTransitionInterval": 7,
          "alertExpr": "string"
        }
      ],
      "id": 9,
      "group": "string"
    },
    {
      "collectorAttribute": {
        "name": "string"
      },
      "autoDiscoveryConfig": {
        "persistentInstance": true,
        "scheduleInterval": 6,
        "deleteInactiveInstance": false,
        "method": {
          "name": "string"
        },
        "instanceAutoGroupMethod": "string",
        "instanceAutoGroupMethodParams": "string",
        "filters": [
          {
            "comment": "string",
            "attribute": "string",
            "operation": "string",
            "value": "string"
          },
          {
            "comment": "string",
            "attribute": "string",
            "operation": "string",
            "value": "string"
          }
        ],
        "disableInstance": false,
        "dataSourceName": "string"
      },
      "eriDiscoveryConfig": {
        "winScript": "string",
        "groovyScript": "string",
        "name": "string",
        "type": "string",
        "linuxCmdline": "string",
        "linuxScript": "string",
        "winCmdline": "string"
      },
      "displayName": "string",
      "description": "string",
      "appliesTo": "string",
      "enableAutoDiscovery": true,
      "technology": "string",
      "version": 5,
      "tags": "string",
      "auditVersion": 7,
      "hasMultiInstances": false,
      "collectMethod": "string",
      "eriDiscoveryInterval": 1,
      "enableEriDiscovery": true,
      "collectInterval": 5,
      "name": "string",
      "dataPoints": [
        {
          "alertForNoData": 9,
          "maxValue": "string",
          "dataType": 3,
          "postProcessorMethod": "string",
          "postProcessorParam": "string",
          "maxDigits": 3,
          "rawDataFieldName": "string",
          "description": "string",
          "alertClearTransitionInterval": 5,
          "userParam3": "string",
          "userParam2": "string",
          "type": 3,
          "alertExprNote": "string",
          "dataSourceId": 8,
          "minValue": "string",
          "alertBody": "string",
          "userParam1": "string",
          "name": "string",
          "alertSubject": "string",
          "id": 9,
          "alertTransitionInterval": 8,
          "alertExpr": "string"
        },
        {
          "alertForNoData": 10,
          "maxValue": "string",
          "dataType": 3,
          "postProcessorMethod": "string",
          "postProcessorParam": "string",
          "maxDigits": 8,
          "rawDataFieldName": "string",
          "description": "string",
          "alertClearTransitionInterval": 5,
          "userParam3": "string",
          "userParam2": "string",
          "type": 5,
          "alertExprNote": "string",
          "dataSourceId": 3,
          "minValue": "string",
          "alertBody": "string",
          "userParam1": "string",
          "name": "string",
          "alertSubject": "string",
          "id": 5,
          "alertTransitionInterval": 6,
          "alertExpr": "string"
        },
        {
          "alertForNoData": 2,
          "maxValue": "string",
          "dataType": 1,
          "postProcessorMethod": "string",
          "postProcessorParam": "string",
          "maxDigits": 7,
          "rawDataFieldName": "string",
          "description": "string",
          "alertClearTransitionInterval": 1,
          "userParam3": "string",
          "userParam2": "string",
          "type": 7,
          "alertExprNote": "string",
          "dataSourceId": 3,
          "minValue": "string",
          "alertBody": "string",
          "userParam1": "string",
          "name": "string",
          "alertSubject": "string",
          "id": 6,
          "alertTransitionInterval": 7,
          "alertExpr": "string"
        },
        {
          "alertForNoData": 9,
          "maxValue": "string",
          "dataType": 5,
          "postProcessorMethod": "string",
          "postProcessorParam": "string",
          "maxDigits": 3,
          "rawDataFieldName": "string",
          "description": "string",
          "alertClearTransitionInterval": 4,
          "userParam3": "string",
          "userParam2": "string",
          "type": 1,
          "alertExprNote": "string",
          "dataSourceId": 5,
          "minValue": "string",
          "alertBody": "string",
          "userParam1": "string",
          "name": "string",
          "alertSubject": "string",
          "id": 6,
          "alertTransitionInterval": 3,
          "alertExpr": "string"
        },
        {
          "alertForNoData": 10,
          "maxValue": "string",
          "dataType": 8,
          "postProcessorMethod": "string",
          "postProcessorParam": "string",
          "maxDigits": 10,
          "rawDataFieldName": "string",
          "description": "string",
          "alertClearTransitionInterval": 1,
          "userParam3": "string",
          "userParam2": "string",
          "type": 2,
          "alertExprNote": "string",
          "dataSourceId": 3,
          "minValue": "string",
          "alertBody": "string",
          "userParam1": "string",
          "name": "string",
          "alertSubject": "string",
          "id": 5,
          "alertTransitionInterval": 9,
          "alertExpr": "string"
        },
        {
          "alertForNoData": 1,
          "maxValue": "string",
          "dataType": 2,
          "postProcessorMethod": "string",
          "postProcessorParam": "string",
          "maxDigits": 9,
          "rawDataFieldName": "string",
          "description": "string",
          "alertClearTransitionInterval": 6,
          "userParam3": "string",
          "userParam2": "string",
          "type": 1,
          "alertExprNote": "string",
          "dataSourceId": 8,
          "minValue": "string",
          "alertBody": "string",
          "userParam1": "string",
          "name": "string",
          "alertSubject": "string",
          "id": 10,
          "alertTransitionInterval": 10,
          "alertExpr": "string"
        },
        {
          "alertForNoData": 6,
          "maxValue": "string",
          "dataType": 5,
          "postProcessorMethod": "string",
          "postProcessorParam": "string",
          "maxDigits": 2,
          "rawDataFieldName": "string",
          "description": "string",
          "alertClearTransitionInterval": 6,
          "userParam3": "string",
          "userParam2": "string",
          "type": 2,
          "alertExprNote": "string",
          "dataSourceId": 3,
          "minValue": "string",
          "alertBody": "string",
          "userParam1": "string",
          "name": "string",
          "alertSubject": "string",
          "id": 7,
          "alertTransitionInterval": 2,
          "alertExpr": "string"
        }
      ],
      "id": 4,
      "group": "string"
    },
    {
      "collectorAttribute": {
        "name": "string"
      },
      "autoDiscoveryConfig": {
        "persistentInstance": false,
        "scheduleInterval": 3,
        "deleteInactiveInstance": true,
        "method": {
          "name": "string"
        },
        "instanceAutoGroupMethod": "string",
        "instanceAutoGroupMethodParams": "string",
        "filters": [
          {
            "comment": "string",
            "attribute": "string",
            "operation": "string",
            "value": "string"
          },
          {
            "comment": "string",
            "attribute": "string",
            "operation": "string",
            "value": "string"
          },
          {
            "comment": "string",
            "attribute": "string",
            "operation": "string",
            "value": "string"
          },
          {
            "comment": "string",
            "attribute": "string",
            "operation": "string",
            "value": "string"
          },
          {
            "comment": "string",
            "attribute": "string",
            "operation": "string",
            "value": "string"
          },
          {
            "comment": "string",
            "attribute": "string",
            "operation": "string",
            "value": "string"
          }
        ],
        "disableInstance": false,
        "dataSourceName": "string"
      },
      "eriDiscoveryConfig": {
        "winScript": "string",
        "groovyScript": "string",
        "name": "string",
        "type": "string",
        "linuxCmdline": "string",
        "linuxScript": "string",
        "winCmdline": "string"
      },
      "displayName": "string",
      "description": "string",
      "appliesTo": "string",
      "enableAutoDiscovery": true,
      "technology": "string",
      "version": 9,
      "tags": "string",
      "auditVersion": 9,
      "hasMultiInstances": true,
      "collectMethod": "string",
      "eriDiscoveryInterval": 7,
      "enableEriDiscovery": true,
      "collectInterval": 10,
      "name": "string",
      "dataPoints": [
        {
          "alertForNoData": 3,
          "maxValue": "string",
          "dataType": 6,
          "postProcessorMethod": "string",
          "postProcessorParam": "string",
          "maxDigits": 5,
          "rawDataFieldName": "string",
          "description": "string",
          "alertClearTransitionInterval": 5,
          "userParam3": "string",
          "userParam2": "string",
          "type": 8,
          "alertExprNote": "string",
          "dataSourceId": 10,
          "minValue": "string",
          "alertBody": "string",
          "userParam1": "string",
          "name": "string",
          "alertSubject": "string",
          "id": 5,
          "alertTransitionInterval": 8,
          "alertExpr": "string"
        }
      ],
      "id": 1,
      "group": "string"
    },
    {
      "collectorAttribute": {
        "name": "string"
      },
      "autoDiscoveryConfig": {
        "persistentInstance": true,
        "scheduleInterval": 10,
        "deleteInactiveInstance": true,
        "method": {
          "name": "string"
        },
        "instanceAutoGroupMethod": "string",
        "instanceAutoGroupMethodParams": "string",
        "filters": [
          {
            "comment": "string",
            "attribute": "string",
            "operation": "string",
            "value": "string"
          },
          {
            "comment": "string",
            "attribute": "string",
            "operation": "string",
            "value": "string"
          },
          {
            "comment": "string",
            "attribute": "string",
            "operation": "string",
            "value": "string"
          },
          {
            "comment": "string",
            "attribute": "string",
            "operation": "string",
            "value": "string"
          },
          {
            "comment": "string",
            "attribute": "string",
            "operation": "string",
            "value": "string"
          },
          {
            "comment": "string",
            "attribute": "string",
            "operation": "string",
            "value": "string"
          },
          {
            "comment": "string",
            "attribute": "string",
            "operation": "string",
            "value": "string"
          },
          {
            "comment": "string",
            "attribute": "string",
            "operation": "string",
            "value": "string"
          },
          {
            "comment": "string",
            "attribute": "string",
            "operation": "string",
            "value": "string"
          },
          {
            "comment": "string",
            "attribute": "string",
            "operation": "string",
            "value": "string"
          }
        ],
        "disableInstance": false,
        "dataSourceName": "string"
      },
      "eriDiscoveryConfig": {
        "winScript": "string",
        "groovyScript": "string",
        "name": "string",
        "type": "string",
        "linuxCmdline": "string",
        "linuxScript": "string",
        "winCmdline": "string"
      },
      "displayName": "string",
      "description": "string",
      "appliesTo": "string",
      "enableAutoDiscovery": false,
      "technology": "string",
      "version": 1,
      "tags": "string",
      "auditVersion": 5,
      "hasMultiInstances": false,
      "collectMethod": "string",
      "eriDiscoveryInterval": 7,
      "enableEriDiscovery": true,
      "collectInterval": 4,
      "name": "string",
      "dataPoints": [
        {
          "alertForNoData": 9,
          "maxValue": "string",
          "dataType": 1,
          "postProcessorMethod": "string",
          "postProcessorParam": "string",
          "maxDigits": 10,
          "rawDataFieldName": "string",
          "description": "string",
          "alertClearTransitionInterval": 9,
          "userParam3": "string",
          "userParam2": "string",
          "type": 10,
          "alertExprNote": "string",
          "dataSourceId": 6,
          "minValue": "string",
          "alertBody": "string",
          "userParam1": "string",
          "name": "string",
          "alertSubject": "string",
          "id": 9,
          "alertTransitionInterval": 2,
          "alertExpr": "string"
        },
        {
          "alertForNoData": 5,
          "maxValue": "string",
          "dataType": 3,
          "postProcessorMethod": "string",
          "postProcessorParam": "string",
          "maxDigits": 6,
          "rawDataFieldName": "string",
          "description": "string",
          "alertClearTransitionInterval": 10,
          "userParam3": "string",
          "userParam2": "string",
          "type": 5,
          "alertExprNote": "string",
          "dataSourceId": 10,
          "minValue": "string",
          "alertBody": "string",
          "userParam1": "string",
          "name": "string",
          "alertSubject": "string",
          "id": 7,
          "alertTransitionInterval": 1,
          "alertExpr": "string"
        },
        {
          "alertForNoData": 10,
          "maxValue": "string",
          "dataType": 6,
          "postProcessorMethod": "string",
          "postProcessorParam": "string",
          "maxDigits": 4,
          "rawDataFieldName": "string",
          "description": "string",
          "alertClearTransitionInterval": 8,
          "userParam3": "string",
          "userParam2": "string",
          "type": 2,
          "alertExprNote": "string",
          "dataSourceId": 2,
          "minValue": "string",
          "alertBody": "string",
          "userParam1": "string",
          "name": "string",
          "alertSubject": "string",
          "id": 1,
          "alertTransitionInterval": 1,
          "alertExpr": "string"
        },
        {
          "alertForNoData": 2,
          "maxValue": "string",
          "dataType": 2,
          "postProcessorMethod": "string",
          "postProcessorParam": "string",
          "maxDigits": 4,
          "rawDataFieldName": "string",
          "description": "string",
          "alertClearTransitionInterval": 1,
          "userParam3": "string",
          "userParam2": "string",
          "type": 2,
          "alertExprNote": "string",
          "dataSourceId": 9,
          "minValue": "string",
          "alertBody": "string",
          "userParam1": "string",
          "name": "string",
          "alertSubject": "string",
          "id": 6,
          "alertTransitionInterval": 5,
          "alertExpr": "string"
        },
        {
          "alertForNoData": 8,
          "maxValue": "string",
          "dataType": 8,
          "postProcessorMethod": "string",
          "postProcessorParam": "string",
          "maxDigits": 6,
          "rawDataFieldName": "string",
          "description": "string",
          "alertClearTransitionInterval": 4,
          "userParam3": "string",
          "userParam2": "string",
          "type": 4,
          "alertExprNote": "string",
          "dataSourceId": 9,
          "minValue": "string",
          "alertBody": "string",
          "userParam1": "string",
          "name": "string",
          "alertSubject": "string",
          "id": 3,
          "alertTransitionInterval": 7,
          "alertExpr": "string"
        },
        {
          "alertForNoData": 10,
          "maxValue": "string",
          "dataType": 9,
          "postProcessorMethod": "string",
          "postProcessorParam": "string",
          "maxDigits": 5,
          "rawDataFieldName": "string",
          "description": "string",
          "alertClearTransitionInterval": 3,
          "userParam3": "string",
          "userParam2": "string",
          "type": 7,
          "alertExprNote": "string",
          "dataSourceId": 9,
          "minValue": "string",
          "alertBody": "string",
          "userParam1": "string",
          "name": "string",
          "alertSubject": "string",
          "id": 3,
          "alertTransitionInterval": 8,
          "alertExpr": "string"
        },
        {
          "alertForNoData": 3,
          "maxValue": "string",
          "dataType": 9,
          "postProcessorMethod": "string",
          "postProcessorParam": "string",
          "maxDigits": 9,
          "rawDataFieldName": "string",
          "description": "string",
          "alertClearTransitionInterval": 10,
          "userParam3": "string",
          "userParam2": "string",
          "type": 8,
          "alertExprNote": "string",
          "dataSourceId": 9,
          "minValue": "string",
          "alertBody": "string",
          "userParam1": "string",
          "name": "string",
          "alertSubject": "string",
          "id": 6,
          "alertTransitionInterval": 7,
          "alertExpr": "string"
        },
        {
          "alertForNoData": 2,
          "maxValue": "string",
          "dataType": 9,
          "postProcessorMethod": "string",
          "postProcessorParam": "string",
          "maxDigits": 7,
          "rawDataFieldName": "string",
          "description": "string",
          "alertClearTransitionInterval": 10,
          "userParam3": "string",
          "userParam2": "string",
          "type": 6,
          "alertExprNote": "string",
          "dataSourceId": 4,
          "minValue": "string",
          "alertBody": "string",
          "userParam1": "string",
          "name": "string",
          "alertSubject": "string",
          "id": 3,
          "alertTransitionInterval": 10,
          "alertExpr": "string"
        },
        {
          "alertForNoData": 6,
          "maxValue": "string",
          "dataType": 3,
          "postProcessorMethod": "string",
          "postProcessorParam": "string",
          "maxDigits": 3,
          "rawDataFieldName": "string",
          "description": "string",
          "alertClearTransitionInterval": 5,
          "userParam3": "string",
          "userParam2": "string",
          "type": 2,
          "alertExprNote": "string",
          "dataSourceId": 5,
          "minValue": "string",
          "alertBody": "string",
          "userParam1": "string",
          "name": "string",
          "alertSubject": "string",
          "id": 4,
          "alertTransitionInterval": 6,
          "alertExpr": "string"
        },
        {
          "alertForNoData": 7,
          "maxValue": "string",
          "dataType": 4,
          "postProcessorMethod": "string",
          "postProcessorParam": "string",
          "maxDigits": 4,
          "rawDataFieldName": "string",
          "description": "string",
          "alertClearTransitionInterval": 5,
          "userParam3": "string",
          "userParam2": "string",
          "type": 5,
          "alertExprNote": "string",
          "dataSourceId": 3,
          "minValue": "string",
          "alertBody": "string",
          "userParam1": "string",
          "name": "string",
          "alertSubject": "string",
          "id": 5,
          "alertTransitionInterval": 3,
          "alertExpr": "string"
        }
      ],
      "id": 5,
      "group": "string"
    }
  ]
}