{
  "total": 1,
  "searchId": "string",
  "items": [
    {
      "lastmodifyUserId": 7,
      "delivery": "email",
      "userPermission": "string",
      "lastGenerateOn": 4,
      "reportLinkNum": 3,
      "groupId": 5,
      "format": "HTML",
      "description": "This is a daily alerts report",
      "lastGenerateSize": 9,
      "customReportTypeId": 6,
      "type": "Alert",
      "lastGeneratePages": 9,
      "schedule": "0 7 * * 1",
      "recipients": [
        {
          "additionInfo": "string",
          "method": "email",
          "type": "admin",
          "addr": "sarah"
        },
        {
          "additionInfo": "string",
          "method": "email",
          "type": "admin",
          "addr": "sarah"
        },
        {
          "additionInfo": "string",
          "method": "email",
          "type": "admin",
          "addr": "sarah"
        },
        {
          "additionInfo": "string",
          "method": "email",
          "type": "admin",
          "addr": "sarah"
        },
        {
          "additionInfo": "string",
          "method": "email",
          "type": "admin",
          "addr": "sarah"
        },
        {
          "additionInfo": "string",
          "method": "email",
          "type": "admin",
          "addr": "sarah"
        }
      ],
      "customReportTypeName": "string",
      "name": "Daily Alerts Report",
      "enableViewAsOtherUser": true,
      "lastmodifyUserName": "string",
      "id": 7,
      "scheduleTimezone": "America/Los_Angeles"
    },
    {
      "lastmodifyUserId": 5,
      "delivery": "email",
      "userPermission": "string",
      "lastGenerateOn": 4,
      "reportLinkNum": 5,
      "groupId": 5,
      "format": "HTML",
      "description": "This is a daily alerts report",
      "lastGenerateSize": 7,
      "customReportTypeId": 2,
      "type": "Alert",
      "lastGeneratePages": 3,
      "schedule": "0 7 * * 1",
      "recipients": [
        {
          "additionInfo": "string",
          "method": "email",
          "type": "admin",
          "addr": "sarah"
        }
      ],
      "customReportTypeName": "string",
      "name": "Daily Alerts Report",
      "enableViewAsOtherUser": false,
      "lastmodifyUserName": "string",
      "id": 3,
      "scheduleTimezone": "America/Los_Angeles"
    },
    {
      "lastmodifyUserId": 10,
      "delivery": "email",
      "userPermission": "string",
      "lastGenerateOn": 6,
      "reportLinkNum": 4,
      "groupId": 5,
      "format": "HTML",
      "description": "This is a daily alerts report",
      "lastGenerateSize": 10,
      "customReportTypeId": 2,
      "type": "Alert",
      "lastGeneratePages": 7,
      "schedule": "0 7 * * 1",
      "recipients": [
        {
          "additionInfo": "string",
          "method": "email",
          "type": "admin",
          "addr": "sarah"
        }
      ],
      "customReportTypeName": "string",
      "name": "Daily Alerts Report",
      "enableViewAsOtherUser": true,
      "lastmodifyUserName": "string",
      "id": 5,
      "scheduleTimezone": "America/Los_Angeles"
    },
    {
      "lastmodifyUserId": 3,
      "delivery": "email",
      "userPermission": "string",
      "lastGenerateOn": 2,
      "reportLinkNum": 3,
      "groupId": 5,
      "format": "HTML",
      "description": "This is a daily alerts report",
      "lastGenerateSize": 2,
      "customReportTypeId": 7,
      "type": "Alert",
      "lastGeneratePages": 1,
      "schedule": "0 7 * * 1",
      "recipients": [
        {
          "additionInfo": "string",
          "method": "email",
          "type": "admin",
          "addr": "sarah"
        },
        {
          "additionInfo": "string",
          "method": "email",
          "type": "admin",
          "addr": "sarah"
        },
        {
          "additionInfo": "string",
          "method": "email",
          "type": "admin",
          "addr": "sarah"
        }
      ],
      "customReportTypeName": "string",
      "name": "Daily Alerts Report",
      "enableViewAsOtherUser": true,
      "lastmodifyUserName": "string",
      "id": 7,
      "scheduleTimezone": "America/Los_Angeles"
    },
    {
      "lastmodifyUserId": 9,
      "delivery": "email",
      "userPermission": "string",
      "lastGenerateOn": 9,
      "reportLinkNum": 10,
      "groupId": 5,
      "format": "HTML",
      "description": "This is a daily alerts report",
      "lastGenerateSize": 9,
      "customReportTypeId": 2,
      "type": "Alert",
      "lastGeneratePages": 6,
      "schedule": "0 7 * * 1",
      "recipients": [
        {
          "additionInfo": "string",
          "method": "email",
          "type": "admin",
          "addr": "sarah"
        },
        {
          "additionInfo": "string",
          "method": "email",
          "type": "admin",
          "addr": "sarah"
        },
        {
          "additionInfo": "string",
          "method": "email",
          "type": "admin",
          "addr": "sarah"
        },
        {
          "additionInfo": "string",
          "method": "email",
          "type": "admin",
          "addr": "sarah"
        },
        {
          "additionInfo": "string",
          "method": "email",
          "type": "admin",
          "addr": "sarah"
        },
        {
          "additionInfo": "string",
          "method": "email",
          "type": "admin",
          "addr": "sarah"
        }
      ],
      "customReportTypeName": "string",
      "name": "Daily Alerts Report",
      "enableViewAsOtherUser": true,
      "lastmodifyUserName": "string",
      "id": 5,
      "scheduleTimezone": "America/Los_Angeles"
    },
    {
      "lastmodifyUserId": 2,
      "delivery": "email",
      "userPermission": "string",
      "lastGenerateOn": 6,
      "reportLinkNum": 1,
      "groupId": 5,
      "format": "HTML",
      "description": "This is a daily alerts report",
      "lastGenerateSize": 9,
      "customReportTypeId": 5,
      "type": "Alert",
      "lastGeneratePages": 3,
      "schedule": "0 7 * * 1",
      "recipients": [
        {
          "additionInfo": "string",
          "method": "email",
          "type": "admin",
          "addr": "sarah"
        },
        {
          "additionInfo": "string",
          "method": "email",
          "type": "admin",
          "addr": "sarah"
        },
        {
          "additionInfo": "string",
          "method": "email",
          "type": "admin",
          "addr": "sarah"
        },
        {
          "additionInfo": "string",
          "method": "email",
          "type": "admin",
          "addr": "sarah"
        },
        {
          "additionInfo": "string",
          "method": "email",
          "type": "admin",
          "addr": "sarah"
        },
        {
          "additionInfo": "string",
          "method": "email",
          "type": "admin",
          "addr": "sarah"
        },
        {
          "additionInfo": "string",
          "method": "email",
          "type": "admin",
          "addr": "sarah"
        }
      ],
      "customReportTypeName": "string",
      "name": "Daily Alerts Report",
      "enableViewAsOtherUser": true,
      "lastmodifyUserName": "string",
      "id": 3,
      "scheduleTimezone": "America/Los_Angeles"
    }
  ]
}