{
  "inheritList": [
    {
      "fullpath": "string",
      "id": 2,
      "type": "string",
      "value": "string"
    },
    {
      "fullpath": "string",
      "id": 7,
      "type": "string",
      "value": "string"
    },
    {
      "fullpath": "string",
      "id": 9,
      "type": "string",
      "value": "string"
    },
    {
      "fullpath": "string",
      "id": 10,
      "type": "string",
      "value": "string"
    }
  ],
  "name": "string",
  "type": "string",
  "value": "string"
}