{
  "actions": [
    {
      "name": "patchRecipientGroupById",
      "protocol": "REST",
      "method": "PATCH",
      "entitypath": "{base_path}/{version}/setting/recipientgroups/{pathv1}?{query}",
      "requestSchema": "schema.json",
      "responseSchema": "schema.json",
      "timeout": 0,
      "sendEmpty": false,
      "requestDatatype": "JSON",
      "responseDatatype": "JSON",
      "headers": {},
      "responseObjects": [
        {
          "type": "default",
          "key": "",
          "mockFile": "mockdatafiles/patchRecipientGroupById-default.json"
        }
      ]
    },
    {
      "name": "getRecipientGroupById",
      "protocol": "REST",
      "method": "GET",
      "entitypath": "{base_path}/{version}/setting/recipientgroups/{pathv1}?{query}",
      "requestSchema": "schema.json",
      "responseSchema": "schema.json",
      "timeout": 0,
      "sendEmpty": false,
      "sendGetBody": false,
      "requestDatatype": "JSON",
      "responseDatatype": "JSON",
      "headers": {},
      "responseObjects": [
        {
          "type": "default",
          "key": "",
          "mockFile": "mockdatafiles/getRecipientGroupById-default.json"
        }
      ]
    },
    {
      "name": "deleteRecipientGroupById",
      "protocol": "REST",
      "method": "DELETE",
      "entitypath": "{base_path}/{version}/setting/recipientgroups/{pathv1}?{query}",
      "requestSchema": "schema.json",
      "responseSchema": "schema.json",
      "timeout": 0,
      "sendEmpty": false,
      "requestDatatype": "JSON",
      "responseDatatype": "JSON",
      "headers": {},
      "responseObjects": [
        {
          "type": "default",
          "key": "",
          "mockFile": ""
        }
      ]
    },
    {
      "name": "updateRecipientGroupById",
      "protocol": "REST",
      "method": "PUT",
      "entitypath": "{base_path}/{version}/setting/recipientgroups/{pathv1}?{query}",
      "requestSchema": "schema.json",
      "responseSchema": "schema.json",
      "timeout": 0,
      "sendEmpty": false,
      "requestDatatype": "JSON",
      "responseDatatype": "JSON",
      "headers": {},
      "responseObjects": [
        {
          "type": "default",
          "key": "",
          "mockFile": "mockdatafiles/updateRecipientGroupById-default.json"
        }
      ]
    },
    {
      "name": "addRecipientGroup",
      "protocol": "REST",
      "method": "POST",
      "entitypath": "{base_path}/{version}/setting/recipientgroups?{query}",
      "requestSchema": "schema.json",
      "responseSchema": "schema.json",
      "timeout": 0,
      "sendEmpty": false,
      "requestDatatype": "JSON",
      "responseDatatype": "JSON",
      "headers": {},
      "responseObjects": [
        {
          "type": "default",
          "key": "",
          "mockFile": "mockdatafiles/addRecipientGroup-default.json"
        }
      ]
    },
    {
      "name": "getRecipientGroupList",
      "protocol": "REST",
      "method": "GET",
      "entitypath": "{base_path}/{version}/setting/recipientgroups?{query}",
      "requestSchema": "schema.json",
      "responseSchema": "schema.json",
      "timeout": 0,
      "sendEmpty": false,
      "sendGetBody": false,
      "requestDatatype": "JSON",
      "responseDatatype": "JSON",
      "headers": {},
      "responseObjects": [
        {
          "type": "default",
          "key": "",
          "mockFile": "mockdatafiles/getRecipientGroupList-default.json"
        }
      ]
    }
  ]
}