{
  "groupName": "Tier 1 Helpdesk",
  "recipients": [
    {
      "method": "EMAIL",
      "contact": "string",
      "type": "Admin",
      "addr": "john.doe@logicmonitor.com"
    },
    {
      "method": "EMAIL",
      "contact": "string",
      "type": "Admin",
      "addr": "john.doe@logicmonitor.com"
    }
  ],
  "description": "Tier 1 Helpdesk",
  "id": 8
}