{
  "stopMonitoring": true,
  "dataSourceId": 5,
  "dataSourceGroupName": "string",
  "deviceGroupId": 3,
  "dataSourceDisplayName": "string",
  "disableAlerting": true,
  "dataSourceName": "string",
  "dataSourceType": "string"
}