{
  "countBy": "host",
  "dataPointName": "InMbps",
  "dataSourceId": 396,
  "dataPointId": 2016,
  "minAlertLevel": 4,
  "dataSourceDisplayName": "Interfaces (64 bit)-",
  "disableAlerting": false,
  "id": 10,
  "suppressIndAlert": "true",
  "thresholdType": "absolute",
  "dataPointDescription": "Inbound throughput, in megabits per second.\n\nBest choice for reports, etc.",
  "alertExpr": ">=2"
}