{
  "actions": [
    {
      "name": "addApiTokenByAdminId",
      "protocol": "REST",
      "method": "POST",
      "entitypath": "{base_path}/{version}/setting/admins/{pathv1}/apitokens?{query}",
      "requestSchema": "schema.json",
      "responseSchema": "schema.json",
      "timeout": 0,
      "sendEmpty": false,
      "requestDatatype": "JSON",
      "responseDatatype": "JSON",
      "headers": {},
      "responseObjects": [
        {
          "type": "default",
          "key": "",
          "mockFile": "mockdatafiles/addApiTokenByAdminId-default.json"
        }
      ]
    },
    {
      "name": "getApiTokenListByAdminId",
      "protocol": "REST",
      "method": "GET",
      "entitypath": "{base_path}/{version}/setting/admins/{pathv1}/apitokens?{query}",
      "requestSchema": "schema.json",
      "responseSchema": "schema.json",
      "timeout": 0,
      "sendEmpty": false,
      "sendGetBody": false,
      "requestDatatype": "JSON",
      "responseDatatype": "JSON",
      "headers": {},
      "responseObjects": [
        {
          "type": "default",
          "key": "",
          "mockFile": "mockdatafiles/getApiTokenListByAdminId-default.json"
        }
      ]
    },
    {
      "name": "patchApiTokenByAdminId",
      "protocol": "REST",
      "method": "PATCH",
      "entitypath": "{base_path}/{version}/setting/admins/{pathv1}/apitokens/{pathv2}?{query}",
      "requestSchema": "schema.json",
      "responseSchema": "schema.json",
      "timeout": 0,
      "sendEmpty": false,
      "requestDatatype": "JSON",
      "responseDatatype": "JSON",
      "headers": {},
      "responseObjects": [
        {
          "type": "default",
          "key": "",
          "mockFile": "mockdatafiles/patchApiTokenByAdminId-default.json"
        }
      ]
    },
    {
      "name": "deleteApiTokenById",
      "protocol": "REST",
      "method": "DELETE",
      "entitypath": "{base_path}/{version}/setting/admins/{pathv1}/apitokens/{pathv2}?{query}",
      "requestSchema": "schema.json",
      "responseSchema": "schema.json",
      "timeout": 0,
      "sendEmpty": false,
      "requestDatatype": "JSON",
      "responseDatatype": "JSON",
      "headers": {},
      "responseObjects": [
        {
          "type": "default",
          "key": "",
          "mockFile": ""
        }
      ]
    },
    {
      "name": "updateApiTokenByAdminId",
      "protocol": "REST",
      "method": "PUT",
      "entitypath": "{base_path}/{version}/setting/admins/{pathv1}/apitokens/{pathv2}?{query}",
      "requestSchema": "schema.json",
      "responseSchema": "schema.json",
      "timeout": 0,
      "sendEmpty": false,
      "requestDatatype": "JSON",
      "responseDatatype": "JSON",
      "headers": {},
      "responseObjects": [
        {
          "type": "default",
          "key": "",
          "mockFile": "mockdatafiles/updateApiTokenByAdminId-default.json"
        }
      ]
    },
    {
      "name": "getApiTokenList",
      "protocol": "REST",
      "method": "GET",
      "entitypath": "{base_path}/{version}/setting/admins/apitokens?{query}",
      "requestSchema": "schema.json",
      "responseSchema": "schema.json",
      "timeout": 0,
      "sendEmpty": false,
      "sendGetBody": false,
      "requestDatatype": "JSON",
      "responseDatatype": "JSON",
      "headers": {},
      "responseObjects": [
        {
          "type": "default",
          "key": "",
          "mockFile": "mockdatafiles/getApiTokenList-default.json"
        }
      ]
    }
  ]
}