{
  "summary": "get alert list",
  "totalWaitingRequests": 10,
  "totNanoTime": 10,
  "totalProcessedRequests": 10,
  "totalRequests": 10,
  "api": "10",
  "maxNanoTime": 10,
  "tags": "Devices, Device Groups"
}