{
  "total": 6,
  "searchId": "string",
  "items": [
    {
      "userChangeOn": 9,
      "confVersion": "string",
      "updatedOnLocal": "string",
      "hostname": "string",
      "numberOfInstances": 1,
      "id": 2,
      "ea": true,
      "watchdogUpdatedOnLocal": "string",
      "hasFailOverDevice": true,
      "collectorGroupName": "string",
      "netscanVersion": "string",
      "inSDT": true,
      "updatedOn": 5,
      "automaticUpgradeInfo": null,
      "numberOfHosts": 5,
      "collectorConf": "string",
      "sbproxyConf": "string",
      "lastSentNotificationOnLocal": "string",
      "customProperties": [
        {
          "name": "addr",
          "value": "127.0.0.1"
        },
        {
          "name": "addr",
          "value": "127.0.0.1"
        },
        {
          "name": "addr",
          "value": "127.0.0.1"
        }
      ],
      "predefinedConfig": {},
      "onetimeUpgradeInfo": null,
      "wrapperConf": "string",
      "clearSent": false,
      "status": 3,
      "backupAgentId": 75,
      "specifiedCollectorDeviceGroupId": 6,
      "escalatingChainId": 80,
      "collectorSize": "string",
      "ackedOnLocal": "string",
      "watchdogConf": "string",
      "description": "Linux Collector",
      "createdOn": 4,
      "platform": "string",
      "isDown": true,
      "userVisibleHostsNum": 10,
      "canDowngrade": true,
      "ackComment": "string",
      "nextUpgradeInfo": null,
      "suppressAlertClear": true,
      "nextRecipient": 3,
      "ackedOn": 9,
      "userChangeOnLocal": "string",
      "collectorDeviceId": 6,
      "ackedBy": "string",
      "userPermission": "string",
      "needAutoCreateCollectorDevice": "true",
      "watchdogUpdatedOn": 4,
      "canDowngradeReason": "string",
      "lastSentNotificationOn": 9,
      "acked": false,
      "onetimeDowngradeInfo": null,
      "upTime": 3,
      "build": "string",
      "previousVersion": "string",
      "collectorGroupId": 10,
      "createdOnLocal": "string",
      "enableFailBack": "true",
      "resendIval": 15,
      "arch": "string",
      "enableFailOverOnCollectorDevice": true
    },
    {
      "userChangeOn": 1,
      "confVersion": "string",
      "updatedOnLocal": "string",
      "hostname": "string",
      "numberOfInstances": 9,
      "id": 10,
      "ea": true,
      "watchdogUpdatedOnLocal": "string",
      "hasFailOverDevice": true,
      "collectorGroupName": "string",
      "netscanVersion": "string",
      "inSDT": true,
      "updatedOn": 9,
      "automaticUpgradeInfo": null,
      "numberOfHosts": 10,
      "collectorConf": "string",
      "sbproxyConf": "string",
      "lastSentNotificationOnLocal": "string",
      "customProperties": [
        {
          "name": "addr",
          "value": "127.0.0.1"
        },
        {
          "name": "addr",
          "value": "127.0.0.1"
        },
        {
          "name": "addr",
          "value": "127.0.0.1"
        },
        {
          "name": "addr",
          "value": "127.0.0.1"
        },
        {
          "name": "addr",
          "value": "127.0.0.1"
        },
        {
          "name": "addr",
          "value": "127.0.0.1"
        },
        {
          "name": "addr",
          "value": "127.0.0.1"
        },
        {
          "name": "addr",
          "value": "127.0.0.1"
        },
        {
          "name": "addr",
          "value": "127.0.0.1"
        },
        {
          "name": "addr",
          "value": "127.0.0.1"
        }
      ],
      "predefinedConfig": {},
      "onetimeUpgradeInfo": null,
      "wrapperConf": "string",
      "clearSent": false,
      "status": 5,
      "backupAgentId": 75,
      "specifiedCollectorDeviceGroupId": 10,
      "escalatingChainId": 80,
      "collectorSize": "string",
      "ackedOnLocal": "string",
      "watchdogConf": "string",
      "description": "Linux Collector",
      "createdOn": 8,
      "platform": "string",
      "isDown": false,
      "userVisibleHostsNum": 7,
      "canDowngrade": true,
      "ackComment": "string",
      "nextUpgradeInfo": null,
      "suppressAlertClear": true,
      "nextRecipient": 2,
      "ackedOn": 6,
      "userChangeOnLocal": "string",
      "collectorDeviceId": 2,
      "ackedBy": "string",
      "userPermission": "string",
      "needAutoCreateCollectorDevice": "true",
      "watchdogUpdatedOn": 1,
      "canDowngradeReason": "string",
      "lastSentNotificationOn": 4,
      "acked": true,
      "onetimeDowngradeInfo": null,
      "upTime": 7,
      "build": "string",
      "previousVersion": "string",
      "collectorGroupId": 10,
      "createdOnLocal": "string",
      "enableFailBack": "true",
      "resendIval": 15,
      "arch": "string",
      "enableFailOverOnCollectorDevice": true
    },
    {
      "userChangeOn": 1,
      "confVersion": "string",
      "updatedOnLocal": "string",
      "hostname": "string",
      "numberOfInstances": 6,
      "id": 10,
      "ea": false,
      "watchdogUpdatedOnLocal": "string",
      "hasFailOverDevice": false,
      "collectorGroupName": "string",
      "netscanVersion": "string",
      "inSDT": true,
      "updatedOn": 10,
      "automaticUpgradeInfo": null,
      "numberOfHosts": 6,
      "collectorConf": "string",
      "sbproxyConf": "string",
      "lastSentNotificationOnLocal": "string",
      "customProperties": [
        {
          "name": "addr",
          "value": "127.0.0.1"
        },
        {
          "name": "addr",
          "value": "127.0.0.1"
        },
        {
          "name": "addr",
          "value": "127.0.0.1"
        },
        {
          "name": "addr",
          "value": "127.0.0.1"
        }
      ],
      "predefinedConfig": {},
      "onetimeUpgradeInfo": null,
      "wrapperConf": "string",
      "clearSent": false,
      "status": 7,
      "backupAgentId": 75,
      "specifiedCollectorDeviceGroupId": 10,
      "escalatingChainId": 80,
      "collectorSize": "string",
      "ackedOnLocal": "string",
      "watchdogConf": "string",
      "description": "Linux Collector",
      "createdOn": 7,
      "platform": "string",
      "isDown": false,
      "userVisibleHostsNum": 9,
      "canDowngrade": true,
      "ackComment": "string",
      "nextUpgradeInfo": null,
      "suppressAlertClear": true,
      "nextRecipient": 9,
      "ackedOn": 6,
      "userChangeOnLocal": "string",
      "collectorDeviceId": 5,
      "ackedBy": "string",
      "userPermission": "string",
      "needAutoCreateCollectorDevice": "true",
      "watchdogUpdatedOn": 6,
      "canDowngradeReason": "string",
      "lastSentNotificationOn": 10,
      "acked": true,
      "onetimeDowngradeInfo": null,
      "upTime": 8,
      "build": "string",
      "previousVersion": "string",
      "collectorGroupId": 10,
      "createdOnLocal": "string",
      "enableFailBack": "true",
      "resendIval": 15,
      "arch": "string",
      "enableFailOverOnCollectorDevice": true
    },
    {
      "userChangeOn": 1,
      "confVersion": "string",
      "updatedOnLocal": "string",
      "hostname": "string",
      "numberOfInstances": 7,
      "id": 10,
      "ea": false,
      "watchdogUpdatedOnLocal": "string",
      "hasFailOverDevice": true,
      "collectorGroupName": "string",
      "netscanVersion": "string",
      "inSDT": false,
      "updatedOn": 3,
      "automaticUpgradeInfo": null,
      "numberOfHosts": 9,
      "collectorConf": "string",
      "sbproxyConf": "string",
      "lastSentNotificationOnLocal": "string",
      "customProperties": [
        {
          "name": "addr",
          "value": "127.0.0.1"
        },
        {
          "name": "addr",
          "value": "127.0.0.1"
        },
        {
          "name": "addr",
          "value": "127.0.0.1"
        },
        {
          "name": "addr",
          "value": "127.0.0.1"
        },
        {
          "name": "addr",
          "value": "127.0.0.1"
        }
      ],
      "predefinedConfig": {},
      "onetimeUpgradeInfo": null,
      "wrapperConf": "string",
      "clearSent": true,
      "status": 6,
      "backupAgentId": 75,
      "specifiedCollectorDeviceGroupId": 2,
      "escalatingChainId": 80,
      "collectorSize": "string",
      "ackedOnLocal": "string",
      "watchdogConf": "string",
      "description": "Linux Collector",
      "createdOn": 6,
      "platform": "string",
      "isDown": false,
      "userVisibleHostsNum": 6,
      "canDowngrade": false,
      "ackComment": "string",
      "nextUpgradeInfo": null,
      "suppressAlertClear": true,
      "nextRecipient": 8,
      "ackedOn": 5,
      "userChangeOnLocal": "string",
      "collectorDeviceId": 9,
      "ackedBy": "string",
      "userPermission": "string",
      "needAutoCreateCollectorDevice": "true",
      "watchdogUpdatedOn": 9,
      "canDowngradeReason": "string",
      "lastSentNotificationOn": 1,
      "acked": false,
      "onetimeDowngradeInfo": null,
      "upTime": 10,
      "build": "string",
      "previousVersion": "string",
      "collectorGroupId": 10,
      "createdOnLocal": "string",
      "enableFailBack": "true",
      "resendIval": 15,
      "arch": "string",
      "enableFailOverOnCollectorDevice": true
    }
  ]
}