{
  "total": 5,
  "searchId": "string",
  "items": [
    {
      "endDateTimeOnLocal": "string",
      "timezone": "America/Los_Angeles",
      "sdtType": "oneTime",
      "monthDay": 7,
      "weekOfMonth": "1",
      "admin": "string",
      "endDateTime": 1534554000000,
      "type": "DeviceGroupSDT",
      "isEffective": true,
      "minute": 6,
      "duration": 138,
      "endHour": 5,
      "startDateTime": 1534460400000,
      "hour": 3,
      "startDateTimeOnLocal": "string",
      "weekDay": "Sunday",
      "comment": "Emergency prod deployment",
      "id": "string",
      "endMinute": 18
    },
    {
      "endDateTimeOnLocal": "string",
      "timezone": "America/Los_Angeles",
      "sdtType": "oneTime",
      "monthDay": 7,
      "weekOfMonth": "1",
      "admin": "string",
      "endDateTime": 1534554000000,
      "type": "DeviceGroupSDT",
      "isEffective": false,
      "minute": 6,
      "duration": 138,
      "endHour": 5,
      "startDateTime": 1534460400000,
      "hour": 3,
      "startDateTimeOnLocal": "string",
      "weekDay": "Sunday",
      "comment": "Emergency prod deployment",
      "id": "string",
      "endMinute": 18
    },
    {
      "endDateTimeOnLocal": "string",
      "timezone": "America/Los_Angeles",
      "sdtType": "oneTime",
      "monthDay": 7,
      "weekOfMonth": "1",
      "admin": "string",
      "endDateTime": 1534554000000,
      "type": "DeviceGroupSDT",
      "isEffective": true,
      "minute": 6,
      "duration": 138,
      "endHour": 5,
      "startDateTime": 1534460400000,
      "hour": 3,
      "startDateTimeOnLocal": "string",
      "weekDay": "Sunday",
      "comment": "Emergency prod deployment",
      "id": "string",
      "endMinute": 18
    },
    {
      "endDateTimeOnLocal": "string",
      "timezone": "America/Los_Angeles",
      "sdtType": "oneTime",
      "monthDay": 7,
      "weekOfMonth": "1",
      "admin": "string",
      "endDateTime": 1534554000000,
      "type": "DeviceGroupSDT",
      "isEffective": false,
      "minute": 6,
      "duration": 138,
      "endHour": 5,
      "startDateTime": 1534460400000,
      "hour": 3,
      "startDateTimeOnLocal": "string",
      "weekDay": "Sunday",
      "comment": "Emergency prod deployment",
      "id": "string",
      "endMinute": 18
    },
    {
      "endDateTimeOnLocal": "string",
      "timezone": "America/Los_Angeles",
      "sdtType": "oneTime",
      "monthDay": 7,
      "weekOfMonth": "1",
      "admin": "string",
      "endDateTime": 1534554000000,
      "type": "DeviceGroupSDT",
      "isEffective": false,
      "minute": 6,
      "duration": 138,
      "endHour": 5,
      "startDateTime": 1534460400000,
      "hour": 3,
      "startDateTimeOnLocal": "string",
      "weekDay": "Sunday",
      "comment": "Emergency prod deployment",
      "id": "string",
      "endMinute": 18
    }
  ]
}