{
  "total": 10,
  "searchId": "string",
  "items": [
    {
      "autoBalance": "string",
      "customProperties": [
        {
          "name": "addr",
          "value": "127.0.0.1"
        },
        {
          "name": "addr",
          "value": "127.0.0.1"
        },
        {
          "name": "addr",
          "value": "127.0.0.1"
        },
        {
          "name": "addr",
          "value": "127.0.0.1"
        },
        {
          "name": "addr",
          "value": "127.0.0.1"
        },
        {
          "name": "addr",
          "value": "127.0.0.1"
        },
        {
          "name": "addr",
          "value": "127.0.0.1"
        },
        {
          "name": "addr",
          "value": "127.0.0.1"
        },
        {
          "name": "addr",
          "value": "127.0.0.1"
        },
        {
          "name": "addr",
          "value": "127.0.0.1"
        }
      ],
      "userPermission": "string",
      "numOfCollectors": 3,
      "name": "Collector (Network Devices)",
      "autoBalanceInstanceCountThreshold": 2,
      "autoBalanceStrategy": "string",
      "description": "Group for collectors dedicated to Network Devices",
      "createOn": 1,
      "id": 9
    },
    {
      "autoBalance": "string",
      "customProperties": [
        {
          "name": "addr",
          "value": "127.0.0.1"
        },
        {
          "name": "addr",
          "value": "127.0.0.1"
        },
        {
          "name": "addr",
          "value": "127.0.0.1"
        },
        {
          "name": "addr",
          "value": "127.0.0.1"
        },
        {
          "name": "addr",
          "value": "127.0.0.1"
        },
        {
          "name": "addr",
          "value": "127.0.0.1"
        },
        {
          "name": "addr",
          "value": "127.0.0.1"
        },
        {
          "name": "addr",
          "value": "127.0.0.1"
        }
      ],
      "userPermission": "string",
      "numOfCollectors": 4,
      "name": "Collector (Network Devices)",
      "autoBalanceInstanceCountThreshold": 8,
      "autoBalanceStrategy": "string",
      "description": "Group for collectors dedicated to Network Devices",
      "createOn": 8,
      "id": 7
    },
    {
      "autoBalance": "string",
      "customProperties": [
        {
          "name": "addr",
          "value": "127.0.0.1"
        },
        {
          "name": "addr",
          "value": "127.0.0.1"
        },
        {
          "name": "addr",
          "value": "127.0.0.1"
        },
        {
          "name": "addr",
          "value": "127.0.0.1"
        },
        {
          "name": "addr",
          "value": "127.0.0.1"
        },
        {
          "name": "addr",
          "value": "127.0.0.1"
        }
      ],
      "userPermission": "string",
      "numOfCollectors": 4,
      "name": "Collector (Network Devices)",
      "autoBalanceInstanceCountThreshold": 1,
      "autoBalanceStrategy": "string",
      "description": "Group for collectors dedicated to Network Devices",
      "createOn": 1,
      "id": 4
    },
    {
      "autoBalance": "string",
      "customProperties": [
        {
          "name": "addr",
          "value": "127.0.0.1"
        },
        {
          "name": "addr",
          "value": "127.0.0.1"
        },
        {
          "name": "addr",
          "value": "127.0.0.1"
        },
        {
          "name": "addr",
          "value": "127.0.0.1"
        },
        {
          "name": "addr",
          "value": "127.0.0.1"
        }
      ],
      "userPermission": "string",
      "numOfCollectors": 5,
      "name": "Collector (Network Devices)",
      "autoBalanceInstanceCountThreshold": 3,
      "autoBalanceStrategy": "string",
      "description": "Group for collectors dedicated to Network Devices",
      "createOn": 4,
      "id": 5
    },
    {
      "autoBalance": "string",
      "customProperties": [
        {
          "name": "addr",
          "value": "127.0.0.1"
        },
        {
          "name": "addr",
          "value": "127.0.0.1"
        },
        {
          "name": "addr",
          "value": "127.0.0.1"
        },
        {
          "name": "addr",
          "value": "127.0.0.1"
        }
      ],
      "userPermission": "string",
      "numOfCollectors": 1,
      "name": "Collector (Network Devices)",
      "autoBalanceInstanceCountThreshold": 4,
      "autoBalanceStrategy": "string",
      "description": "Group for collectors dedicated to Network Devices",
      "createOn": 4,
      "id": 1
    },
    {
      "autoBalance": "string",
      "customProperties": [
        {
          "name": "addr",
          "value": "127.0.0.1"
        },
        {
          "name": "addr",
          "value": "127.0.0.1"
        },
        {
          "name": "addr",
          "value": "127.0.0.1"
        },
        {
          "name": "addr",
          "value": "127.0.0.1"
        },
        {
          "name": "addr",
          "value": "127.0.0.1"
        },
        {
          "name": "addr",
          "value": "127.0.0.1"
        },
        {
          "name": "addr",
          "value": "127.0.0.1"
        },
        {
          "name": "addr",
          "value": "127.0.0.1"
        }
      ],
      "userPermission": "string",
      "numOfCollectors": 4,
      "name": "Collector (Network Devices)",
      "autoBalanceInstanceCountThreshold": 5,
      "autoBalanceStrategy": "string",
      "description": "Group for collectors dedicated to Network Devices",
      "createOn": 7,
      "id": 4
    },
    {
      "autoBalance": "string",
      "customProperties": [
        {
          "name": "addr",
          "value": "127.0.0.1"
        },
        {
          "name": "addr",
          "value": "127.0.0.1"
        },
        {
          "name": "addr",
          "value": "127.0.0.1"
        },
        {
          "name": "addr",
          "value": "127.0.0.1"
        }
      ],
      "userPermission": "string",
      "numOfCollectors": 3,
      "name": "Collector (Network Devices)",
      "autoBalanceInstanceCountThreshold": 4,
      "autoBalanceStrategy": "string",
      "description": "Group for collectors dedicated to Network Devices",
      "createOn": 9,
      "id": 5
    },
    {
      "autoBalance": "string",
      "customProperties": [
        {
          "name": "addr",
          "value": "127.0.0.1"
        },
        {
          "name": "addr",
          "value": "127.0.0.1"
        }
      ],
      "userPermission": "string",
      "numOfCollectors": 3,
      "name": "Collector (Network Devices)",
      "autoBalanceInstanceCountThreshold": 5,
      "autoBalanceStrategy": "string",
      "description": "Group for collectors dedicated to Network Devices",
      "createOn": 8,
      "id": 2
    }
  ]
}