{
  "enableRemoteSessionInCompanyLevel": true,
  "customHelpLabel": "Internal Support Resources",
  "customHelpURL": "https://logicmonitor.com/support",
  "privileges": [
    {
      "objectName": "string",
      "subOperation": "string",
      "operation": "write",
      "objectId": "123",
      "objectType": "dashboard group"
    },
    {
      "objectName": "string",
      "subOperation": "string",
      "operation": "write",
      "objectId": "123",
      "objectType": "dashboard group"
    },
    {
      "objectName": "string",
      "subOperation": "string",
      "operation": "write",
      "objectId": "123",
      "objectType": "dashboard group"
    },
    {
      "objectName": "string",
      "subOperation": "string",
      "operation": "write",
      "objectId": "123",
      "objectType": "dashboard group"
    },
    {
      "objectName": "string",
      "subOperation": "string",
      "operation": "write",
      "objectId": "123",
      "objectType": "dashboard group"
    },
    {
      "objectName": "string",
      "subOperation": "string",
      "operation": "write",
      "objectId": "123",
      "objectType": "dashboard group"
    },
    {
      "objectName": "string",
      "subOperation": "string",
      "operation": "write",
      "objectId": "123",
      "objectType": "dashboard group"
    }
  ],
  "associatedUserCount": 4,
  "name": "administrator",
  "description": "Administrator can do everything, including security-sensitive actions",
  "id": 8,
  "twoFARequired": true,
  "requireEULA": true,
  "acctRequireTwoFA": true
}