{
  "actions": [
    {
      "name": "addReportGroup",
      "protocol": "REST",
      "method": "POST",
      "entitypath": "{base_path}/{version}/report/groups?{query}",
      "requestSchema": "schema.json",
      "responseSchema": "schema.json",
      "timeout": 0,
      "sendEmpty": false,
      "requestDatatype": "JSON",
      "responseDatatype": "JSON",
      "headers": {},
      "responseObjects": [
        {
          "type": "default",
          "key": "",
          "mockFile": "mockdatafiles/addReportGroup-default.json"
        }
      ]
    },
    {
      "name": "getReportGroupList",
      "protocol": "REST",
      "method": "GET",
      "entitypath": "{base_path}/{version}/report/groups?{query}",
      "requestSchema": "schema.json",
      "responseSchema": "schema.json",
      "timeout": 0,
      "sendEmpty": false,
      "sendGetBody": false,
      "requestDatatype": "JSON",
      "responseDatatype": "JSON",
      "headers": {},
      "responseObjects": [
        {
          "type": "default",
          "key": "",
          "mockFile": "mockdatafiles/getReportGroupList-default.json"
        }
      ]
    },
    {
      "name": "patchReportGroupById",
      "protocol": "REST",
      "method": "PATCH",
      "entitypath": "{base_path}/{version}/report/groups/{pathv1}?{query}",
      "requestSchema": "schema.json",
      "responseSchema": "schema.json",
      "timeout": 0,
      "sendEmpty": false,
      "requestDatatype": "JSON",
      "responseDatatype": "JSON",
      "headers": {},
      "responseObjects": [
        {
          "type": "default",
          "key": "",
          "mockFile": "mockdatafiles/patchReportGroupById-default.json"
        }
      ]
    },
    {
      "name": "getReportGroupById",
      "protocol": "REST",
      "method": "GET",
      "entitypath": "{base_path}/{version}/report/groups/{pathv1}?{query}",
      "requestSchema": "schema.json",
      "responseSchema": "schema.json",
      "timeout": 0,
      "sendEmpty": false,
      "sendGetBody": false,
      "requestDatatype": "JSON",
      "responseDatatype": "JSON",
      "headers": {},
      "responseObjects": [
        {
          "type": "default",
          "key": "",
          "mockFile": "mockdatafiles/getReportGroupById-default.json"
        }
      ]
    },
    {
      "name": "deleteReportGroupById",
      "protocol": "REST",
      "method": "DELETE",
      "entitypath": "{base_path}/{version}/report/groups/{pathv1}?{query}",
      "requestSchema": "schema.json",
      "responseSchema": "schema.json",
      "timeout": 0,
      "sendEmpty": false,
      "requestDatatype": "JSON",
      "responseDatatype": "JSON",
      "headers": {},
      "responseObjects": [
        {
          "type": "default",
          "key": "",
          "mockFile": ""
        }
      ]
    },
    {
      "name": "updateReportGroupById",
      "protocol": "REST",
      "method": "PUT",
      "entitypath": "{base_path}/{version}/report/groups/{pathv1}?{query}",
      "requestSchema": "schema.json",
      "responseSchema": "schema.json",
      "timeout": 0,
      "sendEmpty": false,
      "requestDatatype": "JSON",
      "responseDatatype": "JSON",
      "headers": {},
      "responseObjects": [
        {
          "type": "default",
          "key": "",
          "mockFile": "mockdatafiles/updateReportGroupById-default.json"
        }
      ]
    }
  ]
}