{
  "total": 1,
  "searchId": "string",
  "items": [
    {
      "template": {},
      "fullPath": "string",
      "userPermission": "string",
      "widgetTokens": [
        {
          "inheritList": [
            {
              "fullpath": "string",
              "value": "string"
            }
          ],
          "name": "Default Device Group",
          "type": "string",
          "value": "Devices by Type/Network"
        },
        {
          "inheritList": [
            {
              "fullpath": "string",
              "value": "string"
            },
            {
              "fullpath": "string",
              "value": "string"
            },
            {
              "fullpath": "string",
              "value": "string"
            },
            {
              "fullpath": "string",
              "value": "string"
            },
            {
              "fullpath": "string",
              "value": "string"
            },
            {
              "fullpath": "string",
              "value": "string"
            },
            {
              "fullpath": "string",
              "value": "string"
            },
            {
              "fullpath": "string",
              "value": "string"
            },
            {
              "fullpath": "string",
              "value": "string"
            },
            {
              "fullpath": "string",
              "value": "string"
            }
          ],
          "name": "Default Device Group",
          "type": "string",
          "value": "Devices by Type/Network"
        },
        {
          "inheritList": [
            {
              "fullpath": "string",
              "value": "string"
            },
            {
              "fullpath": "string",
              "value": "string"
            },
            {
              "fullpath": "string",
              "value": "string"
            },
            {
              "fullpath": "string",
              "value": "string"
            },
            {
              "fullpath": "string",
              "value": "string"
            },
            {
              "fullpath": "string",
              "value": "string"
            },
            {
              "fullpath": "string",
              "value": "string"
            },
            {
              "fullpath": "string",
              "value": "string"
            },
            {
              "fullpath": "string",
              "value": "string"
            },
            {
              "fullpath": "string",
              "value": "string"
            }
          ],
          "name": "Default Device Group",
          "type": "string",
          "value": "Devices by Type/Network"
        },
        {
          "inheritList": [
            {
              "fullpath": "string",
              "value": "string"
            },
            {
              "fullpath": "string",
              "value": "string"
            },
            {
              "fullpath": "string",
              "value": "string"
            }
          ],
          "name": "Default Device Group",
          "type": "string",
          "value": "Devices by Type/Network"
        },
        {
          "inheritList": [
            {
              "fullpath": "string",
              "value": "string"
            },
            {
              "fullpath": "string",
              "value": "string"
            },
            {
              "fullpath": "string",
              "value": "string"
            },
            {
              "fullpath": "string",
              "value": "string"
            },
            {
              "fullpath": "string",
              "value": "string"
            },
            {
              "fullpath": "string",
              "value": "string"
            },
            {
              "fullpath": "string",
              "value": "string"
            }
          ],
          "name": "Default Device Group",
          "type": "string",
          "value": "Devices by Type/Network"
        }
      ],
      "name": "LogicMonitor Dashboards",
      "numOfDirectSubGroups": 5,
      "numOfDashboards": 8,
      "description": "Servers in LA DataCenter",
      "id": 5,
      "dashboards": [
        {
          "userPermission": "string",
          "name": "string",
          "sharable": false,
          "id": 3
        },
        {
          "userPermission": "string",
          "name": "string",
          "sharable": false,
          "id": 6
        },
        {
          "userPermission": "string",
          "name": "string",
          "sharable": false,
          "id": 7
        },
        {
          "userPermission": "string",
          "name": "string",
          "sharable": false,
          "id": 10
        },
        {
          "userPermission": "string",
          "name": "string",
          "sharable": true,
          "id": 6
        },
        {
          "userPermission": "string",
          "name": "string",
          "sharable": true,
          "id": 1
        },
        {
          "userPermission": "string",
          "name": "string",
          "sharable": true,
          "id": 8
        },
        {
          "userPermission": "string",
          "name": "string",
          "sharable": false,
          "id": 3
        },
        {
          "userPermission": "string",
          "name": "string",
          "sharable": false,
          "id": 1
        },
        {
          "userPermission": "string",
          "name": "string",
          "sharable": true,
          "id": 5
        }
      ],
      "parentId": 1,
      "numOfDirectDashboards": 10
    }
  ]
}