{
  "creator": "sarah@logicmonitor.com",
  "collectorGroupName": "Prod",
  "method": "nmap",
  "collectorGroup": 4,
  "description": "Discovers devices within the office network for monitoring",
  "nextStart": "2018-09-07 15:12:00 PDT",
  "duplicate": null,
  "version": 2,
  "collector": 148,
  "ignoreSystemIPsDuplicates": true,
  "schedule": null,
  "collectorDescription": "Prod CollectorA",
  "name": "Office Network",
  "nextStartEpoch": 1536358320,
  "id": 208,
  "nsgId": 47,
  "group": "RT_check"
}