{
  "total": 6,
  "searchId": "string",
  "items": [
    {
      "duration": 456,
      "itemId": 1,
      "endEpoch": 1475902808000,
      "admin": "sarah@logicmonitor.com",
      "comment": "migrating devices to new network and new IP addresses",
      "id": "b-nTH4ECTH2rZ-Q548GOKg",
      "type": "DeviceGroupSDT",
      "startEpoch": 1475875446000
    },
    {
      "duration": 456,
      "itemId": 1,
      "endEpoch": 1475902808000,
      "admin": "sarah@logicmonitor.com",
      "comment": "migrating devices to new network and new IP addresses",
      "id": "b-nTH4ECTH2rZ-Q548GOKg",
      "type": "DeviceGroupSDT",
      "startEpoch": 1475875446000
    },
    {
      "duration": 456,
      "itemId": 1,
      "endEpoch": 1475902808000,
      "admin": "sarah@logicmonitor.com",
      "comment": "migrating devices to new network and new IP addresses",
      "id": "b-nTH4ECTH2rZ-Q548GOKg",
      "type": "DeviceGroupSDT",
      "startEpoch": 1475875446000
    },
    {
      "duration": 456,
      "itemId": 1,
      "endEpoch": 1475902808000,
      "admin": "sarah@logicmonitor.com",
      "comment": "migrating devices to new network and new IP addresses",
      "id": "b-nTH4ECTH2rZ-Q548GOKg",
      "type": "DeviceGroupSDT",
      "startEpoch": 1475875446000
    },
    {
      "duration": 456,
      "itemId": 1,
      "endEpoch": 1475902808000,
      "admin": "sarah@logicmonitor.com",
      "comment": "migrating devices to new network and new IP addresses",
      "id": "b-nTH4ECTH2rZ-Q548GOKg",
      "type": "DeviceGroupSDT",
      "startEpoch": 1475875446000
    },
    {
      "duration": 456,
      "itemId": 1,
      "endEpoch": 1475902808000,
      "admin": "sarah@logicmonitor.com",
      "comment": "migrating devices to new network and new IP addresses",
      "id": "b-nTH4ECTH2rZ-Q548GOKg",
      "type": "DeviceGroupSDT",
      "startEpoch": 1475875446000
    },
    {
      "duration": 456,
      "itemId": 1,
      "endEpoch": 1475902808000,
      "admin": "sarah@logicmonitor.com",
      "comment": "migrating devices to new network and new IP addresses",
      "id": "b-nTH4ECTH2rZ-Q548GOKg",
      "type": "DeviceGroupSDT",
      "startEpoch": 1475875446000
    }
  ]
}