{
  "actions": [
    {
      "name": "patchWidgetById",
      "protocol": "REST",
      "method": "PATCH",
      "entitypath": "{base_path}/{version}/dashboard/widgets/{pathv1}?{query}",
      "requestSchema": "schema.json",
      "responseSchema": "schema.json",
      "timeout": 0,
      "sendEmpty": false,
      "requestDatatype": "JSON",
      "responseDatatype": "JSON",
      "headers": {},
      "responseObjects": [
        {
          "type": "default",
          "key": "",
          "mockFile": "mockdatafiles/patchWidgetById-default.json"
        }
      ]
    },
    {
      "name": "getWidgetById",
      "protocol": "REST",
      "method": "GET",
      "entitypath": "{base_path}/{version}/dashboard/widgets/{pathv1}?{query}",
      "requestSchema": "schema.json",
      "responseSchema": "schema.json",
      "timeout": 0,
      "sendEmpty": false,
      "sendGetBody": false,
      "requestDatatype": "JSON",
      "responseDatatype": "JSON",
      "headers": {},
      "responseObjects": [
        {
          "type": "default",
          "key": "",
          "mockFile": "mockdatafiles/getWidgetById-default.json"
        }
      ]
    },
    {
      "name": "deleteWidgetById",
      "protocol": "REST",
      "method": "DELETE",
      "entitypath": "{base_path}/{version}/dashboard/widgets/{pathv1}?{query}",
      "requestSchema": "schema.json",
      "responseSchema": "schema.json",
      "timeout": 0,
      "sendEmpty": false,
      "requestDatatype": "JSON",
      "responseDatatype": "JSON",
      "headers": {},
      "responseObjects": [
        {
          "type": "default",
          "key": "",
          "mockFile": ""
        }
      ]
    },
    {
      "name": "updateWidgetById",
      "protocol": "REST",
      "method": "PUT",
      "entitypath": "{base_path}/{version}/dashboard/widgets/{pathv1}?{query}",
      "requestSchema": "schema.json",
      "responseSchema": "schema.json",
      "timeout": 0,
      "sendEmpty": false,
      "requestDatatype": "JSON",
      "responseDatatype": "JSON",
      "headers": {},
      "responseObjects": [
        {
          "type": "default",
          "key": "",
          "mockFile": "mockdatafiles/updateWidgetById-default.json"
        }
      ]
    },
    {
      "name": "addWidget",
      "protocol": "REST",
      "method": "POST",
      "entitypath": "{base_path}/{version}/dashboard/widgets?{query}",
      "requestSchema": "schema.json",
      "responseSchema": "schema.json",
      "timeout": 0,
      "sendEmpty": false,
      "requestDatatype": "JSON",
      "responseDatatype": "JSON",
      "headers": {},
      "responseObjects": [
        {
          "type": "default",
          "key": "",
          "mockFile": "mockdatafiles/addWidget-default.json"
        }
      ]
    },
    {
      "name": "getWidgetList",
      "protocol": "REST",
      "method": "GET",
      "entitypath": "{base_path}/{version}/dashboard/widgets?{query}",
      "requestSchema": "schema.json",
      "responseSchema": "schema.json",
      "timeout": 0,
      "sendEmpty": false,
      "sendGetBody": false,
      "requestDatatype": "JSON",
      "responseDatatype": "JSON",
      "headers": {},
      "responseObjects": [
        {
          "type": "default",
          "key": "",
          "mockFile": "mockdatafiles/getWidgetList-default.json"
        }
      ]
    }
  ]
}