{
  "actions": [
    {
      "name": "addCollector",
      "protocol": "REST",
      "method": "POST",
      "entitypath": "{base_path}/{version}/setting/collector/collectors?{query}",
      "requestSchema": "schema.json",
      "responseSchema": "schema.json",
      "timeout": 0,
      "sendEmpty": false,
      "requestDatatype": "JSON",
      "responseDatatype": "JSON",
      "headers": {},
      "responseObjects": [
        {
          "type": "default",
          "key": "",
          "mockFile": "mockdatafiles/addCollector-default.json"
        }
      ]
    },
    {
      "name": "getCollectorList",
      "protocol": "REST",
      "method": "GET",
      "entitypath": "{base_path}/{version}/setting/collector/collectors?{query}",
      "requestSchema": "schema.json",
      "responseSchema": "schema.json",
      "timeout": 0,
      "sendEmpty": false,
      "sendGetBody": false,
      "requestDatatype": "JSON",
      "responseDatatype": "JSON",
      "headers": {},
      "responseObjects": [
        {
          "type": "default",
          "key": "",
          "mockFile": "mockdatafiles/getCollectorList-default.json"
        }
      ]
    },
    {
      "name": "patchCollectorById",
      "protocol": "REST",
      "method": "PATCH",
      "entitypath": "{base_path}/{version}/setting/collector/collectors/{pathv1}?{query}",
      "requestSchema": "schema.json",
      "responseSchema": "schema.json",
      "timeout": 0,
      "sendEmpty": false,
      "requestDatatype": "JSON",
      "responseDatatype": "JSON",
      "headers": {},
      "responseObjects": [
        {
          "type": "default",
          "key": "",
          "mockFile": "mockdatafiles/patchCollectorById-default.json"
        }
      ]
    },
    {
      "name": "getCollectorById",
      "protocol": "REST",
      "method": "GET",
      "entitypath": "{base_path}/{version}/setting/collector/collectors/{pathv1}?{query}",
      "requestSchema": "schema.json",
      "responseSchema": "schema.json",
      "timeout": 0,
      "sendEmpty": false,
      "sendGetBody": false,
      "requestDatatype": "JSON",
      "responseDatatype": "JSON",
      "headers": {},
      "responseObjects": [
        {
          "type": "default",
          "key": "",
          "mockFile": "mockdatafiles/getCollectorById-default.json"
        }
      ]
    },
    {
      "name": "deleteCollectorById",
      "protocol": "REST",
      "method": "DELETE",
      "entitypath": "{base_path}/{version}/setting/collector/collectors/{pathv1}?{query}",
      "requestSchema": "schema.json",
      "responseSchema": "schema.json",
      "timeout": 0,
      "sendEmpty": false,
      "requestDatatype": "JSON",
      "responseDatatype": "JSON",
      "headers": {},
      "responseObjects": [
        {
          "type": "default",
          "key": "",
          "mockFile": ""
        }
      ]
    },
    {
      "name": "updateCollectorById",
      "protocol": "REST",
      "method": "PUT",
      "entitypath": "{base_path}/{version}/setting/collector/collectors/{pathv1}?{query}",
      "requestSchema": "schema.json",
      "responseSchema": "schema.json",
      "timeout": 0,
      "sendEmpty": false,
      "requestDatatype": "JSON",
      "responseDatatype": "JSON",
      "headers": {},
      "responseObjects": [
        {
          "type": "default",
          "key": "",
          "mockFile": "mockdatafiles/updateCollectorById-default.json"
        }
      ]
    },
    {
      "name": "getCollectorInstaller",
      "protocol": "REST",
      "method": "GET",
      "entitypath": "{base_path}/{version}/setting/collector/collectors/{pathv1}/installers/{pathv2}?{query}",
      "requestSchema": "schema.json",
      "responseSchema": "schema.json",
      "timeout": 0,
      "sendEmpty": false,
      "sendGetBody": false,
      "requestDatatype": "JSON",
      "responseDatatype": "JSON",
      "headers": {},
      "responseObjects": [
        {
          "type": "default",
          "key": "",
          "mockFile": ""
        }
      ]
    },
    {
      "name": "ackCollectorDownAlertById",
      "protocol": "REST",
      "method": "POST",
      "entitypath": "{base_path}/{version}/setting/collector/collectors/{pathv1}/ackdown?{query}",
      "requestSchema": "schema.json",
      "responseSchema": "schema.json",
      "timeout": 0,
      "sendEmpty": false,
      "requestDatatype": "JSON",
      "responseDatatype": "JSON",
      "headers": {},
      "responseObjects": [
        {
          "type": "default",
          "key": "",
          "mockFile": ""
        }
      ]
    }
  ]
}