{
  "total": 2,
  "searchId": "string",
  "items": [
    {
      "stopMonitoring": true,
      "deviceDataSourceId": 6,
      "displayName": "Ping",
      "wildValue2": "1",
      "groupId": 211,
      "description": "Ping Test",
      "disableAlerting": true,
      "deviceId": 9,
      "deviceDisplayName": "string",
      "systemProperties": [
        {
          "name": "addr",
          "value": "127.0.0.1"
        }
      ],
      "autoProperties": [
        {
          "name": "addr",
          "value": "127.0.0.1"
        },
        {
          "name": "addr",
          "value": "127.0.0.1"
        },
        {
          "name": "addr",
          "value": "127.0.0.1"
        },
        {
          "name": "addr",
          "value": "127.0.0.1"
        }
      ],
      "dataSourceId": 10,
      "groupName": "string",
      "customProperties": [
        {
          "name": "addr",
          "value": "127.0.0.1"
        },
        {
          "name": "addr",
          "value": "127.0.0.1"
        },
        {
          "name": "addr",
          "value": "127.0.0.1"
        },
        {
          "name": "addr",
          "value": "127.0.0.1"
        },
        {
          "name": "addr",
          "value": "127.0.0.1"
        },
        {
          "name": "addr",
          "value": "127.0.0.1"
        }
      ],
      "lockDescription": true,
      "name": "string",
      "id": 6,
      "wildValue": "1",
      "dataSourceType": "string"
    },
    {
      "stopMonitoring": true,
      "deviceDataSourceId": 9,
      "displayName": "Ping",
      "wildValue2": "1",
      "groupId": 211,
      "description": "Ping Test",
      "disableAlerting": true,
      "deviceId": 10,
      "deviceDisplayName": "string",
      "systemProperties": [
        {
          "name": "addr",
          "value": "127.0.0.1"
        },
        {
          "name": "addr",
          "value": "127.0.0.1"
        },
        {
          "name": "addr",
          "value": "127.0.0.1"
        },
        {
          "name": "addr",
          "value": "127.0.0.1"
        },
        {
          "name": "addr",
          "value": "127.0.0.1"
        },
        {
          "name": "addr",
          "value": "127.0.0.1"
        },
        {
          "name": "addr",
          "value": "127.0.0.1"
        },
        {
          "name": "addr",
          "value": "127.0.0.1"
        },
        {
          "name": "addr",
          "value": "127.0.0.1"
        },
        {
          "name": "addr",
          "value": "127.0.0.1"
        }
      ],
      "autoProperties": [
        {
          "name": "addr",
          "value": "127.0.0.1"
        },
        {
          "name": "addr",
          "value": "127.0.0.1"
        },
        {
          "name": "addr",
          "value": "127.0.0.1"
        },
        {
          "name": "addr",
          "value": "127.0.0.1"
        },
        {
          "name": "addr",
          "value": "127.0.0.1"
        },
        {
          "name": "addr",
          "value": "127.0.0.1"
        },
        {
          "name": "addr",
          "value": "127.0.0.1"
        },
        {
          "name": "addr",
          "value": "127.0.0.1"
        }
      ],
      "dataSourceId": 6,
      "groupName": "string",
      "customProperties": [
        {
          "name": "addr",
          "value": "127.0.0.1"
        },
        {
          "name": "addr",
          "value": "127.0.0.1"
        },
        {
          "name": "addr",
          "value": "127.0.0.1"
        },
        {
          "name": "addr",
          "value": "127.0.0.1"
        },
        {
          "name": "addr",
          "value": "127.0.0.1"
        },
        {
          "name": "addr",
          "value": "127.0.0.1"
        }
      ],
      "lockDescription": true,
      "name": "string",
      "id": 2,
      "wildValue": "1",
      "dataSourceType": "string"
    },
    {
      "stopMonitoring": true,
      "deviceDataSourceId": 1,
      "displayName": "Ping",
      "wildValue2": "1",
      "groupId": 211,
      "description": "Ping Test",
      "disableAlerting": true,
      "deviceId": 9,
      "deviceDisplayName": "string",
      "systemProperties": [
        {
          "name": "addr",
          "value": "127.0.0.1"
        },
        {
          "name": "addr",
          "value": "127.0.0.1"
        }
      ],
      "autoProperties": [
        {
          "name": "addr",
          "value": "127.0.0.1"
        },
        {
          "name": "addr",
          "value": "127.0.0.1"
        },
        {
          "name": "addr",
          "value": "127.0.0.1"
        },
        {
          "name": "addr",
          "value": "127.0.0.1"
        },
        {
          "name": "addr",
          "value": "127.0.0.1"
        },
        {
          "name": "addr",
          "value": "127.0.0.1"
        },
        {
          "name": "addr",
          "value": "127.0.0.1"
        },
        {
          "name": "addr",
          "value": "127.0.0.1"
        }
      ],
      "dataSourceId": 1,
      "groupName": "string",
      "customProperties": [
        {
          "name": "addr",
          "value": "127.0.0.1"
        },
        {
          "name": "addr",
          "value": "127.0.0.1"
        },
        {
          "name": "addr",
          "value": "127.0.0.1"
        },
        {
          "name": "addr",
          "value": "127.0.0.1"
        },
        {
          "name": "addr",
          "value": "127.0.0.1"
        },
        {
          "name": "addr",
          "value": "127.0.0.1"
        },
        {
          "name": "addr",
          "value": "127.0.0.1"
        }
      ],
      "lockDescription": true,
      "name": "string",
      "id": 5,
      "wildValue": "1",
      "dataSourceType": "string"
    },
    {
      "stopMonitoring": true,
      "deviceDataSourceId": 9,
      "displayName": "Ping",
      "wildValue2": "1",
      "groupId": 211,
      "description": "Ping Test",
      "disableAlerting": true,
      "deviceId": 7,
      "deviceDisplayName": "string",
      "systemProperties": [
        {
          "name": "addr",
          "value": "127.0.0.1"
        },
        {
          "name": "addr",
          "value": "127.0.0.1"
        },
        {
          "name": "addr",
          "value": "127.0.0.1"
        },
        {
          "name": "addr",
          "value": "127.0.0.1"
        }
      ],
      "autoProperties": [
        {
          "name": "addr",
          "value": "127.0.0.1"
        },
        {
          "name": "addr",
          "value": "127.0.0.1"
        },
        {
          "name": "addr",
          "value": "127.0.0.1"
        },
        {
          "name": "addr",
          "value": "127.0.0.1"
        },
        {
          "name": "addr",
          "value": "127.0.0.1"
        },
        {
          "name": "addr",
          "value": "127.0.0.1"
        }
      ],
      "dataSourceId": 7,
      "groupName": "string",
      "customProperties": [
        {
          "name": "addr",
          "value": "127.0.0.1"
        },
        {
          "name": "addr",
          "value": "127.0.0.1"
        },
        {
          "name": "addr",
          "value": "127.0.0.1"
        },
        {
          "name": "addr",
          "value": "127.0.0.1"
        },
        {
          "name": "addr",
          "value": "127.0.0.1"
        },
        {
          "name": "addr",
          "value": "127.0.0.1"
        }
      ],
      "lockDescription": true,
      "name": "string",
      "id": 7,
      "wildValue": "1",
      "dataSourceType": "string"
    }
  ]
}