{
  "numOfStoppedAzureDevices": 10,
  "numOfServices": 9,
  "numOfTerminatedAzureDevices": 2,
  "numberOfStandardDevices": 5,
  "numOfStoppedGcpDevices": 5,
  "numOfCombinedGcpDevices": 3,
  "numOfAWSDevices": 6,
  "numberOfKubernetesDevices": 10,
  "numOfGcpDevices": 1,
  "numOfAzureDevices": 1,
  "numOfCombinedAzureDevices": 6,
  "numOfTerminatedAWSDevices": 3,
  "numOfTerminatedGcpCloudDevices": 5,
  "numOfStoppedAWSDevices": 4,
  "numberOfDevices": 7,
  "numOfConfigSourceDevices": 7,
  "numOfWebsites": 8,
  "numOfCombinedAWSDevices": 5
}