{
  "$id": "schema.json",
  "type": "object",
  "schema": "http://json-schema.org/draft-07/schema#",
  "translate": true,
  "dynamicfields": true,
  "properties": {
    "ph_request_type": {
      "type": "string",
      "description": "type of request (internal to adapter)",
      "default": "updateAnApplicationPack",
      "enum": [
        "updateAnApplicationPack",
        "deleteApplicationPack",
        "retrieveAnExistingApplicationPackByID",
        "updateApplicationInterfacesAndTagMapping",
        "removeApplicationInterfacesFromApplicationPack",
        "listAllApplicationPackTags",
        "modifyTagsOfAnApplicationPack",
        "createNewTagUnderAnApplicationPack",
        "deleteTagsFromApplicationPack",
        "deleteAConnectionToApplicationPack",
        "retrieveAnExistingConnectionToApplicationPackByID",
        "putSecurechangeworkflowApiSecureappRepositoryApplicationsApplicationIdConnectionToApplicationPacksConnectionToApplicationPackId",
        "updateApplicationPacks",
        "listAllApplicationPacks",
        "createNewApplicationPacks",
        "getTagByID",
        "createNewConnectionToApplicationPacks",
        "retrieveAListOfAllConnectionToApplicationPackByApplicationID",
        "retrieveAListOfAllConnectionToApplicationPackByApplicationIDQuery",
        "deleteTagsFromApplicationPackQuery",
        "listAllApplicationPacksQuery",
        "removeApplicationInterfacesFromApplicationPackQuery"
      ],
      "external_name": "ph_request_type"
    },
    "customerId": {
      "type": "string",
      "description": "path parameter",
      "parse": false,
      "encode": false,
      "encrypt": {
        "type": "AES",
        "key": ""
      },
      "external_name": "customer_id"
    },
    "applicationPackId": {
      "type": "string",
      "description": "path parameter",
      "parse": false,
      "encode": false,
      "encrypt": {
        "type": "AES",
        "key": ""
      },
      "external_name": "application_pack_id"
    },
    "applicationId": {
      "type": "string",
      "description": "path parameter",
      "parse": false,
      "encode": false,
      "encrypt": {
        "type": "AES",
        "key": ""
      },
      "external_name": "application_id"
    },
    "connectionToApplicationPackId": {
      "type": "string",
      "description": "path parameter",
      "parse": false,
      "encode": false,
      "encrypt": {
        "type": "AES",
        "key": ""
      },
      "external_name": "connection_to_application_pack_id"
    },
    "tagId": {
      "type": "string",
      "description": "path parameter",
      "parse": false,
      "encode": false,
      "encrypt": {
        "type": "AES",
        "key": ""
      },
      "external_name": "tag_id"
    }
  },
  "definitions": {}
}