{
  "actions": [
    {
      "name": "modifyUnusedAndNonPredefinedGlobalServices",
      "protocol": "REST",
      "method": "PUT",
      "entitypath": "{base_path}/{version}/securechangeworkflow/api/secureapp/repository/services/?{query}",
      "requestSchema": "schema.json",
      "responseSchema": "schema.json",
      "timeout": 0,
      "sendEmpty": false,
      "sendGetBody": false,
      "requestDatatype": "JSON",
      "responseDatatype": "JSON",
      "headers": {},
      "responseObjects": [
        {
          "type": "default",
          "key": "",
          "mockFile": ""
        }
      ]
    },
    {
      "name": "deleteUnusedAndNonPredefinedGlobalServiceByName",
      "protocol": "REST",
      "method": "DELETE",
      "entitypath": "{base_path}/{version}/securechangeworkflow/api/secureapp/repository/services?{query}",
      "requestSchema": "schema.json",
      "responseSchema": "schema.json",
      "timeout": 0,
      "sendEmpty": false,
      "sendGetBody": false,
      "requestDatatype": "JSON",
      "responseDatatype": "JSON",
      "headers": {},
      "responseObjects": [
        {
          "type": "default",
          "key": "",
          "mockFile": ""
        }
      ]
    },
    {
      "name": "fetchesServices",
      "protocol": "REST",
      "method": "GET",
      "entitypath": "{base_path}/{version}/securechangeworkflow/api/secureapp/repository/services?{query}",
      "requestSchema": "schema.json",
      "responseSchema": "schema.json",
      "timeout": 0,
      "sendEmpty": false,
      "sendGetBody": false,
      "requestDatatype": "JSON",
      "responseDatatype": "JSON",
      "headers": {},
      "responseObjects": [
        {
          "type": "default",
          "key": "",
          "mockFile": ""
        }
      ]
    },
    {
      "name": "createGlobalServices",
      "protocol": "REST",
      "method": "POST",
      "entitypath": "{base_path}/{version}/securechangeworkflow/api/secureapp/repository/services?{query}",
      "requestSchema": "schema.json",
      "responseSchema": "schema.json",
      "timeout": 0,
      "sendEmpty": false,
      "sendGetBody": false,
      "requestDatatype": "JSON",
      "responseDatatype": "JSON",
      "headers": {},
      "responseObjects": [
        {
          "type": "default",
          "key": "",
          "mockFile": ""
        }
      ]
    },
    {
      "name": "fetchesServiceByID",
      "protocol": "REST",
      "method": "GET",
      "entitypath": "{base_path}/{version}/securechangeworkflow/api/secureapp/repository/services/{pathv1}?{query}",
      "requestSchema": "schema.json",
      "responseSchema": "schema.json",
      "timeout": 0,
      "sendEmpty": false,
      "sendGetBody": false,
      "requestDatatype": "JSON",
      "responseDatatype": "JSON",
      "headers": {},
      "responseObjects": [
        {
          "type": "default",
          "key": "",
          "mockFile": ""
        }
      ]
    },
    {
      "name": "deleteUnusedAndNonPredefinedGlobalService",
      "protocol": "REST",
      "method": "DELETE",
      "entitypath": "{base_path}/{version}/securechangeworkflow/api/secureapp/repository/services/{pathv1}?{query}",
      "requestSchema": "schema.json",
      "responseSchema": "schema.json",
      "timeout": 0,
      "sendEmpty": false,
      "sendGetBody": false,
      "requestDatatype": "JSON",
      "responseDatatype": "JSON",
      "headers": {},
      "responseObjects": [
        {
          "type": "default",
          "key": "",
          "mockFile": ""
        }
      ]
    },
    {
      "name": "fetchesServicesQuery",
      "protocol": "REST",
      "method": "GET",
      "entitypath": "{base_path}/{version}/securechangeworkflow/api/secureapp/repository/services?{query}",
      "requestSchema": "schema.json",
      "responseSchema": "schema.json",
      "timeout": 0,
      "sendEmpty": false,
      "sendGetBody": false,
      "requestDatatype": "JSON",
      "responseDatatype": "JSON",
      "headers": {},
      "responseObjects": [
        {
          "type": "default",
          "key": "",
          "mockFile": ""
        }
      ]
    },
    {
      "name": "deleteUnusedAndNonPredefinedGlobalServiceByNameQuery",
      "protocol": "REST",
      "method": "DELETE",
      "entitypath": "{base_path}/{version}/securechangeworkflow/api/secureapp/repository/services?{query}",
      "requestSchema": "schema.json",
      "responseSchema": "schema.json",
      "timeout": 0,
      "sendEmpty": false,
      "requestDatatype": "JSON",
      "responseDatatype": "JSON",
      "headers": {},
      "responseObjects": [
        {
          "type": "default",
          "key": "",
          "mockFile": ""
        }
      ]
    }
  ]
}