[
  {
    "usedInList": [
      {
        "name": "browser-trusted",
        "type": "ccls,",
        "alias": "RSA_2048_v3"
      },
      {
        "name": "browser-trusted",
        "type": "ccls,",
        "alias": "RSA_2048_v3"
      }
    ],
    "issueDate": "1999-07-07T17:08:00",
    "expirationDate": "2019-07-06T23:59:59",
    "issuer": "CN=Class 3 Primary CA,O=Flexbot,CO=US",
    "subject": "CN=My System,OU=Development,O=Flexbot,CO=US",
    "serialNumber": "59dfac7e8a661511e58824ceefa9bca9",
    "fingerprint": "d2edf88b41b6fe01461d6e2834ec7c8f6c77721e",
    "pubKeyFingerprint": "1c8a7d8f271c1b351754e33023477e33608ef5bb",
    "subjectKeyIdentifier": "6a643676509c4ef4f74f15f50ded332560eccb20",
    "dateRevoked": "2019-07-06T23:59:59",
    "signatureAlgorithm": "SHA1WITHRSA",
    "keyUsage": 6,
    "keyUsageNames": [
      "CLR_SIGN",
      "CLR_SIGN"
    ],
    "selfSigned": false,
    "authorityKeyIdentifier": "7fd365a7c2ddecbbf03009f34339fa02af333133"
  }
]