{
  "uuid": "D1055376-3448-4A94-82DB-D9BD30BBB420",
  "name": "MY-POLICY",
  "contentType": "cpl",
  "description": "My new policy",
  "referenceId": "my_policy",
  "tenant": "null",
  "author": "api_user",
  "shared": false,
  "replaceVariables": true
}