{
  "userName": "emma.golden",
  "readOnly": false,
  "externalUserName": "cn=emma.golden",
  "firstName": "Emma",
  "lastName": "Golden",
  "description": "Emma Golden - Security Ops Group",
  "expiresOn": "2020-01-01",
  "lastAccess": "2017-01-03T21:03:00",
  "failureCount": 0,
  "emailAddress": "emma.golden@localhost.com",
  "phoneNumber": "...",
  "mobileNumber": "999.999.9999",
  "userType": "EXTERNAL",
  "lastChangedBy": "emma.golden",
  "lastChanged": "2017-07-26T10:23:56",
  "memberOf": [
    "...",
    "..."
  ],
  "roles": [
    "...",
    "..."
  ],
  "permissions": [
    {
      "assignmentType": "GROUP",
      "roleName": "OperatorRole",
      "roleUuid": "925CF22B-BC7E-4AD7-84C1-1FCA6D676A91",
      "groupName": "Operators",
      "groupUuid": "542CF22B-BCFF-4AD7-84C1-1FCA6D676A91",
      "permissions": [
        {
          "targetType": "DEVICE",
          "operation": "ANY",
          "filter": "idIs('7F829DFA-0466-4145-9718-72C69EB7A261')"
        },
        {
          "targetType": "DEVICE",
          "operation": "ANY",
          "filter": "idIs('7F829DFA-0466-4145-9718-72C69EB7A261')"
        }
      ],
      "reportPermissions": [
        {
          "reporterDatabases": [
            "\"allReporters|allDatabases\"",
            "\"allReporters|allDatabases\""
          ],
          "restrictedFields": [
            "\"userName\"",
            "\"userName\""
          ],
          "dataFilter": "...",
          "obfuscatedFields": [
            "...",
            "..."
          ]
        },
        {
          "reporterDatabases": [
            "\"allReporters|allDatabases\"",
            "\"allReporters|allDatabases\""
          ],
          "restrictedFields": [
            "\"userName\"",
            "\"userName\""
          ],
          "dataFilter": "...",
          "obfuscatedFields": [
            "...",
            "..."
          ]
        }
      ]
    },
    {
      "assignmentType": "GROUP",
      "roleName": "OperatorRole",
      "roleUuid": "925CF22B-BC7E-4AD7-84C1-1FCA6D676A91",
      "groupName": "Operators",
      "groupUuid": "542CF22B-BCFF-4AD7-84C1-1FCA6D676A91",
      "permissions": [
        {
          "targetType": "DEVICE",
          "operation": "ANY",
          "filter": "idIs('7F829DFA-0466-4145-9718-72C69EB7A261')"
        },
        {
          "targetType": "DEVICE",
          "operation": "ANY",
          "filter": "idIs('7F829DFA-0466-4145-9718-72C69EB7A261')"
        }
      ],
      "reportPermissions": [
        {
          "reporterDatabases": [
            "\"allReporters|allDatabases\"",
            "\"allReporters|allDatabases\""
          ],
          "restrictedFields": [
            "\"userName\"",
            "\"userName\""
          ],
          "dataFilter": "...",
          "obfuscatedFields": [
            "...",
            "..."
          ]
        },
        {
          "reporterDatabases": [
            "\"allReporters|allDatabases\"",
            "\"allReporters|allDatabases\""
          ],
          "restrictedFields": [
            "\"userName\"",
            "\"userName\""
          ],
          "dataFilter": "...",
          "obfuscatedFields": [
            "...",
            "..."
          ]
        }
      ]
    }
  ]
}