{
  "uuid": "D1055376-3448-4A94-82DB-D9BD30BBB420",
  "name": "SSLV-BXB27-CORP",
  "lastChangedBy": "...",
  "lastChanged": "...",
  "description": "...",
  "model": "...",
  "type": "...",
  "osVersion": "...",
  "serialNumber": "...",
  "hardwareSerialNumber": "...",
  "applianceId": "...",
  "platform": "...",
  "build": "...",
  "host": "...",
  "managementStatus": "FULLY_MANAGED",
  "deploymentStatus": "DEPLOYED"
}