{
  "actions": [
    {
      "name": "getDevices",
      "protocol": "REST",
      "method": "GET",
      "entitypath": "{base_path}/{version}/devices?{query}",
      "requestSchema": "schema.json",
      "responseSchema": "schema.json",
      "timeout": 0,
      "sendEmpty": false,
      "sendGetBody": false,
      "requestDatatype": "JSON",
      "responseDatatype": "JSON",
      "headers": {},
      "responseObjects": [
        {
          "type": "default",
          "key": "",
          "mockFile": "mockdatafiles/getDevices-default.json"
        }
      ]
    },
    {
      "name": "addDevice",
      "protocol": "REST",
      "method": "POST",
      "entitypath": "{base_path}/{version}/devices?{query}",
      "requestSchema": "schema.json",
      "responseSchema": "schema.json",
      "timeout": 0,
      "sendEmpty": false,
      "requestDatatype": "JSON",
      "responseDatatype": "JSON",
      "headers": {},
      "responseObjects": [
        {
          "type": "default",
          "key": "",
          "mockFile": "mockdatafiles/addDevice-default.json"
        }
      ]
    },
    {
      "name": "getCertificates",
      "protocol": "REST",
      "method": "GET",
      "entitypath": "{base_path}/{version}/devices/certificates?{query}",
      "requestSchema": "schema.json",
      "responseSchema": "schema.json",
      "timeout": 0,
      "sendEmpty": false,
      "sendGetBody": false,
      "requestDatatype": "JSON",
      "responseDatatype": "JSON",
      "headers": {},
      "responseObjects": [
        {
          "type": "default",
          "key": "",
          "mockFile": "mockdatafiles/getCertificates-default.json"
        }
      ]
    },
    {
      "name": "getAllCertificates",
      "protocol": "REST",
      "method": "GET",
      "entitypath": "{base_path}/{version}/devices/certificates/usage?{query}",
      "requestSchema": "schema.json",
      "responseSchema": "schema.json",
      "timeout": 0,
      "sendEmpty": false,
      "sendGetBody": false,
      "requestDatatype": "JSON",
      "responseDatatype": "JSON",
      "headers": {},
      "responseObjects": [
        {
          "type": "default",
          "key": "",
          "mockFile": "mockdatafiles/getAllCertificates-default.json"
        }
      ]
    },
    {
      "name": "getConnection",
      "protocol": "REST",
      "method": "GET",
      "entitypath": "{base_path}/{version}/devices/connection?{query}",
      "requestSchema": "schema.json",
      "responseSchema": "schema.json",
      "timeout": 0,
      "sendEmpty": false,
      "sendGetBody": false,
      "requestDatatype": "JSON",
      "responseDatatype": "JSON",
      "headers": {},
      "responseObjects": [
        {
          "type": "default",
          "key": "",
          "mockFile": "mockdatafiles/getConnection-default.json"
        }
      ]
    },
    {
      "name": "getHealth",
      "protocol": "REST",
      "method": "GET",
      "entitypath": "{base_path}/{version}/devices/health?{query}",
      "requestSchema": "schema.json",
      "responseSchema": "schema.json",
      "timeout": 0,
      "sendEmpty": false,
      "sendGetBody": false,
      "requestDatatype": "JSON",
      "responseDatatype": "JSON",
      "headers": {},
      "responseObjects": [
        {
          "type": "default",
          "key": "",
          "mockFile": "mockdatafiles/getHealth-default.json"
        }
      ]
    },
    {
      "name": "getLicense",
      "protocol": "REST",
      "method": "GET",
      "entitypath": "{base_path}/{version}/devices/license?{query}",
      "requestSchema": "schema.json",
      "responseSchema": "schema.json",
      "timeout": 0,
      "sendEmpty": false,
      "sendGetBody": false,
      "requestDatatype": "JSON",
      "responseDatatype": "JSON",
      "headers": {},
      "responseObjects": [
        {
          "type": "default",
          "key": "",
          "mockFile": "mockdatafiles/getLicense-default.json"
        }
      ]
    },
    {
      "name": "getSoftware",
      "protocol": "REST",
      "method": "GET",
      "entitypath": "{base_path}/{version}/devices/software?{query}",
      "requestSchema": "schema.json",
      "responseSchema": "schema.json",
      "timeout": 0,
      "sendEmpty": false,
      "sendGetBody": false,
      "requestDatatype": "JSON",
      "responseDatatype": "JSON",
      "headers": {},
      "responseObjects": [
        {
          "type": "default",
          "key": "",
          "mockFile": "mockdatafiles/getSoftware-default.json"
        }
      ]
    },
    {
      "name": "getDeviceStatusList",
      "protocol": "REST",
      "method": "GET",
      "entitypath": "{base_path}/{version}/devices/status?{query}",
      "requestSchema": "schema.json",
      "responseSchema": "schema.json",
      "timeout": 0,
      "sendEmpty": false,
      "sendGetBody": false,
      "requestDatatype": "JSON",
      "responseDatatype": "JSON",
      "headers": {},
      "responseObjects": [
        {
          "type": "default",
          "key": "",
          "mockFile": "mockdatafiles/getDeviceStatusList-default.json"
        }
      ]
    },
    {
      "name": "getDeviceTypes",
      "protocol": "REST",
      "method": "GET",
      "entitypath": "{base_path}/{version}/devices/types?{query}",
      "requestSchema": "schema.json",
      "responseSchema": "schema.json",
      "timeout": 0,
      "sendEmpty": false,
      "sendGetBody": false,
      "requestDatatype": "JSON",
      "responseDatatype": "JSON",
      "headers": {},
      "responseObjects": [
        {
          "type": "default",
          "key": "",
          "mockFile": "mockdatafiles/getDeviceTypes-default.json"
        }
      ]
    },
    {
      "name": "removeDevice",
      "protocol": "REST",
      "method": "DELETE",
      "entitypath": "{base_path}/{version}/devices/{pathv1}?{query}",
      "requestSchema": "schema.json",
      "responseSchema": "schema.json",
      "timeout": 0,
      "sendEmpty": false,
      "requestDatatype": "JSON",
      "responseDatatype": "JSON",
      "headers": {},
      "responseObjects": [
        {
          "type": "default",
          "key": "",
          "mockFile": "mockdatafiles/removeDevice-default.json"
        }
      ]
    },
    {
      "name": "getDevice",
      "protocol": "REST",
      "method": "GET",
      "entitypath": "{base_path}/{version}/devices/{pathv1}?{query}",
      "requestSchema": "schema.json",
      "responseSchema": "schema.json",
      "timeout": 0,
      "sendEmpty": false,
      "sendGetBody": false,
      "requestDatatype": "JSON",
      "responseDatatype": "JSON",
      "headers": {},
      "responseObjects": [
        {
          "type": "default",
          "key": "",
          "mockFile": "mockdatafiles/getDevice-default.json"
        }
      ]
    },
    {
      "name": "listAttributesForDevice",
      "protocol": "REST",
      "method": "GET",
      "entitypath": "{base_path}/{version}/devices/{pathv1}/attributes?{query}",
      "requestSchema": "schema.json",
      "responseSchema": "schema.json",
      "timeout": 0,
      "sendEmpty": false,
      "sendGetBody": false,
      "requestDatatype": "JSON",
      "responseDatatype": "JSON",
      "headers": {},
      "responseObjects": [
        {
          "type": "default",
          "key": "",
          "mockFile": "mockdatafiles/listAttributesForDevice-default.json"
        }
      ]
    },
    {
      "name": "updateAttributesForDevice",
      "protocol": "REST",
      "method": "PUT",
      "entitypath": "{base_path}/{version}/devices/{pathv1}/attributes/{pathv2}?{query}",
      "requestSchema": "schema.json",
      "responseSchema": "schema.json",
      "timeout": 0,
      "sendEmpty": false,
      "requestDatatype": "PLAIN",
      "responseDatatype": "JSON",
      "headers": {},
      "responseObjects": [
        {
          "type": "default",
          "key": "",
          "mockFile": ""
        }
      ]
    },
    {
      "name": "getDeviceCertificates",
      "protocol": "REST",
      "method": "GET",
      "entitypath": "{base_path}/{version}/devices/{pathv1}/certificates?{query}",
      "requestSchema": "schema.json",
      "responseSchema": "schema.json",
      "timeout": 0,
      "sendEmpty": false,
      "sendGetBody": false,
      "requestDatatype": "JSON",
      "responseDatatype": "JSON",
      "headers": {},
      "responseObjects": [
        {
          "type": "default",
          "key": "",
          "mockFile": "mockdatafiles/getDeviceCertificates-default.json"
        }
      ]
    },
    {
      "name": "executeCommand",
      "protocol": "REST",
      "method": "PUT",
      "entitypath": "{base_path}/{version}/devices/{pathv1}/command?{query}",
      "requestSchema": "schema.json",
      "responseSchema": "schema.json",
      "timeout": 0,
      "sendEmpty": false,
      "requestDatatype": "PLAIN",
      "responseDatatype": "JSON",
      "headers": {},
      "responseObjects": [
        {
          "type": "default",
          "key": "",
          "mockFile": "mockdatafiles/executeCommand-default.json"
        }
      ]
    },
    {
      "name": "getDeviceConnection",
      "protocol": "REST",
      "method": "GET",
      "entitypath": "{base_path}/{version}/devices/{pathv1}/connection?{query}",
      "requestSchema": "schema.json",
      "responseSchema": "schema.json",
      "timeout": 0,
      "sendEmpty": false,
      "sendGetBody": false,
      "requestDatatype": "JSON",
      "responseDatatype": "JSON",
      "headers": {},
      "responseObjects": [
        {
          "type": "default",
          "key": "",
          "mockFile": "mockdatafiles/getDeviceConnection-default.json"
        }
      ]
    },
    {
      "name": "getDeviceHealth",
      "protocol": "REST",
      "method": "GET",
      "entitypath": "{base_path}/{version}/devices/{pathv1}/health?{query}",
      "requestSchema": "schema.json",
      "responseSchema": "schema.json",
      "timeout": 0,
      "sendEmpty": false,
      "sendGetBody": false,
      "requestDatatype": "JSON",
      "responseDatatype": "JSON",
      "headers": {},
      "responseObjects": [
        {
          "type": "default",
          "key": "",
          "mockFile": "mockdatafiles/getDeviceHealth-default.json"
        }
      ]
    },
    {
      "name": "getDeviceLicense",
      "protocol": "REST",
      "method": "GET",
      "entitypath": "{base_path}/{version}/devices/{pathv1}/license?{query}",
      "requestSchema": "schema.json",
      "responseSchema": "schema.json",
      "timeout": 0,
      "sendEmpty": false,
      "sendGetBody": false,
      "requestDatatype": "JSON",
      "responseDatatype": "JSON",
      "headers": {},
      "responseObjects": [
        {
          "type": "default",
          "key": "",
          "mockFile": "mockdatafiles/getDeviceLicense-default.json"
        }
      ]
    },
    {
      "name": "monitorDevice",
      "protocol": "REST",
      "method": "PUT",
      "entitypath": "{base_path}/{version}/devices/{pathv1}/monitor?{query}",
      "requestSchema": "schema.json",
      "responseSchema": "schema.json",
      "timeout": 0,
      "sendEmpty": false,
      "requestDatatype": "JSON",
      "responseDatatype": "JSON",
      "headers": {},
      "responseObjects": [
        {
          "type": "default",
          "key": "",
          "mockFile": ""
        }
      ]
    },
    {
      "name": "changePassword",
      "protocol": "REST",
      "method": "PUT",
      "entitypath": "{base_path}/{version}/devices/{pathv1}/password?{query}",
      "requestSchema": "schema.json",
      "responseSchema": "schema.json",
      "timeout": 0,
      "sendEmpty": false,
      "requestDatatype": "JSON",
      "responseDatatype": "JSON",
      "headers": {},
      "responseObjects": [
        {
          "type": "default",
          "key": "",
          "mockFile": ""
        }
      ]
    },
    {
      "name": "getDeviceSoftware",
      "protocol": "REST",
      "method": "GET",
      "entitypath": "{base_path}/{version}/devices/{pathv1}/software?{query}",
      "requestSchema": "schema.json",
      "responseSchema": "schema.json",
      "timeout": 0,
      "sendEmpty": false,
      "sendGetBody": false,
      "requestDatatype": "JSON",
      "responseDatatype": "JSON",
      "headers": {},
      "responseObjects": [
        {
          "type": "default",
          "key": "",
          "mockFile": "mockdatafiles/getDeviceSoftware-default.json"
        }
      ]
    },
    {
      "name": "getDeviceStatus",
      "protocol": "REST",
      "method": "GET",
      "entitypath": "{base_path}/{version}/devices/{pathv1}/status?{query}",
      "requestSchema": "schema.json",
      "responseSchema": "schema.json",
      "timeout": 0,
      "sendEmpty": false,
      "sendGetBody": false,
      "requestDatatype": "JSON",
      "responseDatatype": "JSON",
      "headers": {},
      "responseObjects": [
        {
          "type": "default",
          "key": "",
          "mockFile": "mockdatafiles/getDeviceStatus-default.json"
        }
      ]
    },
    {
      "name": "unmonitorDevice",
      "protocol": "REST",
      "method": "PUT",
      "entitypath": "{base_path}/{version}/devices/{pathv1}/unmonitor?{query}",
      "requestSchema": "schema.json",
      "responseSchema": "schema.json",
      "timeout": 0,
      "sendEmpty": false,
      "requestDatatype": "JSON",
      "responseDatatype": "JSON",
      "headers": {},
      "responseObjects": [
        {
          "type": "default",
          "key": "",
          "mockFile": ""
        }
      ]
    }
  ]
}