{
  "$id": "schema.json",
  "type": "object",
  "schema": "http://json-schema.org/draft-07/schema#",
  "translate": false,
  "dynamicfields": true,
  "properties": {
    "ph_request_type": {
      "type": "string",
      "description": "type of request (internal to adapter)",
      "default": "getDevices",
      "enum": [
        "getDevices",
        "addDevice",
        "getCertificates",
        "getAllCertificates",
        "getConnection",
        "getHealth",
        "getLicense",
        "getSoftware",
        "getDeviceStatusList",
        "getDeviceTypes",
        "removeDevice",
        "getDevice",
        "listAttributesForDevice",
        "updateAttributesForDevice",
        "getDeviceCertificates",
        "executeCommand",
        "getDeviceConnection",
        "getDeviceHealth",
        "getDeviceLicense",
        "monitorDevice",
        "changePassword",
        "getDeviceSoftware",
        "getDeviceStatus",
        "unmonitorDevice"
      ],
      "external_name": "ph_request_type"
    }
  },
  "definitions": {}
}