[
  {
    "device": {},
    "deployedOn": "string",
    "mostRecent": false,
    "contentRevision": "string",
    "contentHash": "string"
  },
  {
    "device": {},
    "deployedOn": "string",
    "mostRecent": true,
    "contentRevision": "string",
    "contentHash": "string"
  },
  {
    "device": {},
    "deployedOn": "string",
    "mostRecent": true,
    "contentRevision": "string",
    "contentHash": "string"
  },
  {
    "device": {},
    "deployedOn": "string",
    "mostRecent": true,
    "contentRevision": "string",
    "contentHash": "string"
  }
]