{
  "actions": [
    {
      "name": "getAlerts",
      "protocol": "REST",
      "method": "GET",
      "entitypath": "{base_path}/{version}/alerts?{query}",
      "requestSchema": "schema.json",
      "responseSchema": "schema.json",
      "timeout": 0,
      "sendEmpty": false,
      "sendGetBody": false,
      "requestDatatype": "JSON",
      "responseDatatype": "JSON",
      "headers": {},
      "responseObjects": [
        {
          "type": "default",
          "key": "",
          "mockFile": "mockdatafiles/getAlerts-default.json"
        }
      ]
    },
    {
      "name": "raiseAlert",
      "protocol": "REST",
      "method": "POST",
      "entitypath": "{base_path}/{version}/alerts?{query}",
      "requestSchema": "schema.json",
      "responseSchema": "schema.json",
      "timeout": 0,
      "sendEmpty": false,
      "requestDatatype": "JSON",
      "responseDatatype": "JSON",
      "headers": {},
      "responseObjects": [
        {
          "type": "default",
          "key": "",
          "mockFile": "mockdatafiles/raiseAlert-default.json"
        }
      ]
    },
    {
      "name": "getAlert",
      "protocol": "REST",
      "method": "GET",
      "entitypath": "{base_path}/{version}/alerts/{pathv1}?{query}",
      "requestSchema": "schema.json",
      "responseSchema": "schema.json",
      "timeout": 0,
      "sendEmpty": false,
      "sendGetBody": false,
      "requestDatatype": "JSON",
      "responseDatatype": "JSON",
      "headers": {},
      "responseObjects": [
        {
          "type": "default",
          "key": "",
          "mockFile": "mockdatafiles/getAlert-default.json"
        }
      ]
    },
    {
      "name": "updateAlert",
      "protocol": "REST",
      "method": "PUT",
      "entitypath": "{base_path}/{version}/alerts/{pathv1}?{query}",
      "requestSchema": "schema.json",
      "responseSchema": "schema.json",
      "timeout": 0,
      "sendEmpty": false,
      "requestDatatype": "JSON",
      "responseDatatype": "JSON",
      "headers": {},
      "responseObjects": [
        {
          "type": "default",
          "key": "",
          "mockFile": "mockdatafiles/updateAlert-default.json"
        }
      ]
    },
    {
      "name": "ackAlert",
      "protocol": "REST",
      "method": "PUT",
      "entitypath": "{base_path}/{version}/alerts/{pathv1}/acknowledge?{query}",
      "requestSchema": "schema.json",
      "responseSchema": "schema.json",
      "timeout": 0,
      "sendEmpty": false,
      "requestDatatype": "JSON",
      "responseDatatype": "JSON",
      "headers": {},
      "responseObjects": [
        {
          "type": "default",
          "key": "",
          "mockFile": "mockdatafiles/ackAlert-default.json"
        }
      ]
    },
    {
      "name": "addNoteToAlert",
      "protocol": "REST",
      "method": "POST",
      "entitypath": "{base_path}/{version}/alerts/{pathv1}/note?{query}",
      "requestSchema": "schema.json",
      "responseSchema": "schema.json",
      "timeout": 0,
      "sendEmpty": false,
      "requestDatatype": "JSON",
      "responseDatatype": "JSON",
      "headers": {},
      "responseObjects": [
        {
          "type": "default",
          "key": "",
          "mockFile": "mockdatafiles/addNoteToAlert-default.json"
        }
      ]
    },
    {
      "name": "unackAlert",
      "protocol": "REST",
      "method": "PUT",
      "entitypath": "{base_path}/{version}/alerts/{pathv1}/unacknowledge?{query}",
      "requestSchema": "schema.json",
      "responseSchema": "schema.json",
      "timeout": 0,
      "sendEmpty": false,
      "requestDatatype": "JSON",
      "responseDatatype": "JSON",
      "headers": {},
      "responseObjects": [
        {
          "type": "default",
          "key": "",
          "mockFile": "mockdatafiles/unackAlert-default.json"
        }
      ]
    }
  ]
}