[
  {
    "groupName": "AllOperators",
    "description": "All Operators",
    "readOnly": false,
    "externalName": "...",
    "users": [
      "\"admin\",\"emma.golden\"",
      "\"admin\",\"emma.golden\""
    ],
    "roles": [
      "OperatorRole",
      "OperatorRole"
    ],
    "lastChangedBy": "bob.smith",
    "lastChanged": "2017-07-01T12:30:20",
    "permissions": [
      {
        "assignmentType": "GROUP",
        "roleName": "OperatorRole",
        "roleUuid": "925CF22B-BC7E-4AD7-84C1-1FCA6D676A91",
        "groupName": "Operators",
        "groupUuid": "542CF22B-BCFF-4AD7-84C1-1FCA6D676A91",
        "permissions": [
          {
            "targetType": "DEVICE",
            "operation": "ANY",
            "filter": "idIs('7F829DFA-0466-4145-9718-72C69EB7A261')"
          },
          {
            "targetType": "DEVICE",
            "operation": "ANY",
            "filter": "idIs('7F829DFA-0466-4145-9718-72C69EB7A261')"
          }
        ],
        "reportPermissions": [
          {
            "reporterDatabases": [
              "\"allReporters|allDatabases\"",
              "\"allReporters|allDatabases\""
            ],
            "restrictedFields": [
              "\"userName\"",
              "\"userName\""
            ],
            "dataFilter": "...",
            "obfuscatedFields": [
              "...",
              "..."
            ]
          },
          {
            "reporterDatabases": [
              "\"allReporters|allDatabases\"",
              "\"allReporters|allDatabases\""
            ],
            "restrictedFields": [
              "\"userName\"",
              "\"userName\""
            ],
            "dataFilter": "...",
            "obfuscatedFields": [
              "...",
              "..."
            ]
          }
        ]
      },
      {
        "assignmentType": "GROUP",
        "roleName": "OperatorRole",
        "roleUuid": "925CF22B-BC7E-4AD7-84C1-1FCA6D676A91",
        "groupName": "Operators",
        "groupUuid": "542CF22B-BCFF-4AD7-84C1-1FCA6D676A91",
        "permissions": [
          {
            "targetType": "DEVICE",
            "operation": "ANY",
            "filter": "idIs('7F829DFA-0466-4145-9718-72C69EB7A261')"
          },
          {
            "targetType": "DEVICE",
            "operation": "ANY",
            "filter": "idIs('7F829DFA-0466-4145-9718-72C69EB7A261')"
          }
        ],
        "reportPermissions": [
          {
            "reporterDatabases": [
              "\"allReporters|allDatabases\"",
              "\"allReporters|allDatabases\""
            ],
            "restrictedFields": [
              "\"userName\"",
              "\"userName\""
            ],
            "dataFilter": "...",
            "obfuscatedFields": [
              "...",
              "..."
            ]
          },
          {
            "reporterDatabases": [
              "\"allReporters|allDatabases\"",
              "\"allReporters|allDatabases\""
            ],
            "restrictedFields": [
              "\"userName\"",
              "\"userName\""
            ],
            "dataFilter": "...",
            "obfuscatedFields": [
              "...",
              "..."
            ]
          }
        ]
      }
    ]
  }
]