{
  "id": "55f6e0e5-8cbf-4f7b-a623-f5b9689a0dc2",
  "name": "Example authentication CA template",
  "certificate_attributes": [
    "subject.common_name",
    "subject.organization_name"
  ],
  "registered_values": [
    {
      "certificate_field": "subject.country",
      "matcher": "equals",
      "value": "US",
      "multiple": false
    }
  ],
  "enrollment_profile_id": "IOT_58b96f06-bf12-49a4-939e-7247f147ec3e",
  "enrollment_profile_name": "Example enrollment profile",
  "ica_common_name": "IoT Example ICA",
  "ica_body": "-----BEGIN CERTIFICATE-----\n...\n-----END CERTIFICATE-----\n",
  "organization": "IoT Example Organization",
  "parent_ca": "IoT Example Root",
  "signature_algorithm": "1.2.840.10045.4.3.2",
  "key_type": "EC prime256v1",
  "can_be_used_for_any_certificate": false,
  "certificate_authentication_type": "certificate_body_and_attributes",
  "usage_limit": 20,
  "start_date": "2022-07-21T00:00:00Z",
  "end_date": "2022-07-31T00:00:00Z",
  "expiry_date": "2049-01-01",
  "status": "ACTIVE",
  "created_at": "2022-07-21T10:09:13Z",
  "force_passcode_for_auth_cert": false
}