{
  "$id": "schema.json",
  "type": "object",
  "schema": "http://json-schema.org/draft-07/schema#",
  "translate": false,
  "dynamicfields": true,
  "properties": {
    "ph_request_type": {
      "type": "string",
      "description": "type of request (internal to adapter)",
      "default": "",
      "enum": [
        "batchEnrollExternal",
        "downloadMapping",
        "downloadByJobIdAndUniqueId",
        "downloadByCommonName",
        "downloadByJobIdAndCommonName",
        "downloadByCertificateValue",
        "downloadByJobIdAndCertificateValue"
      ],
      "external_name": "ph_request_type"
    },
    "enrollmentProfileId": {
      "type": "string",
      "description": "Enrollment profile ID.",
      "parse": false,
      "encode": false,
      "encrypt": {
        "type": "AES",
        "key": ""
      },
      "external_name": "enrollment_profile_id"
    },    
    "keyType": {
      "type": "",
      "description": "",
      "parse": false,
      "encode": false,
      "encrypt": {
        "type": "AES",
        "key": ""
      },
      "external_name": "key_type"
    },    
    "signatureAlgorithm": {
      "type": "",
      "description": "",
      "parse": false,
      "encode": false,
      "encrypt": {
        "type": "AES",
        "key": ""
      },
      "external_name": "signature_algorithm"
    },    
    "jobId": {
      "type": "string",
      "description": "Batch certificate enrollment job ID.",
      "parse": false,
      "encode": false,
      "encrypt": {
        "type": "AES",
        "key": ""
      },
      "external_name": "job_id"
    },    
    "uniqueIdentifier": {
      "type": "string",
      "description": "Unique identifier for the certificate. To get the unique identifier for each certificate in a batch job, use the **Download certificate ID mapping** endpoint.",
      "parse": false,
      "encode": false,
      "encrypt": {
        "type": "AES",
        "key": ""
      },
      "external_name": "unique_identifier"
    },    
    "commonName": {
      "type": "string",
      "description": "Common name on the certificate.",
      "parse": false,
      "encode": false,
      "encrypt": {
        "type": "AES",
        "key": ""
      },
      "external_name": "common_name"
    },    
    "certificateValue": {
      "type": "string",
      "description": "Certificate value for the certificate.",
      "parse": false,
      "encode": false,
      "encrypt": {
        "type": "AES",
        "key": ""
      },
      "external_name": "certificate_value"
    } 
  },
  "definitions": {}
}