[
  {
    "authentication": {
      "approval": "string",
      "attributes": [
        {
          "display_name": "string",
          "id": "string",
          "mandatory": false,
          "type": "string",
          "value": "string"
        },
        {
          "display_name": "string",
          "id": "string",
          "mandatory": false,
          "type": "string",
          "value": "string"
        }
      ],
      "method": "string",
      "method_id": "string"
    },
    "certificate": {
      "extensions": {
        "san": {
          "attributes": [
            {
              "id": "string",
              "mandatory": true,
              "type": "string",
              "value": "string"
            },
            {
              "id": "string",
              "mandatory": true,
              "type": "string",
              "value": "string"
            },
            {
              "id": "string",
              "mandatory": true,
              "type": "string",
              "value": "string"
            },
            {
              "id": "string",
              "mandatory": false,
              "type": "string",
              "value": "string"
            },
            {
              "id": "string",
              "mandatory": true,
              "type": "string",
              "value": "string"
            },
            {
              "id": "string",
              "mandatory": true,
              "type": "string",
              "value": "string"
            },
            {
              "id": "string",
              "mandatory": true,
              "type": "string",
              "value": "string"
            }
          ],
          "critical": true
        }
      },
      "issuer": {
        "certificate": "string",
        "chain": [
          {
            "certificate": "string",
            "root": false,
            "serial_number": "string",
            "subject_dn": "string"
          },
          {
            "certificate": "string",
            "root": false,
            "serial_number": "string",
            "subject_dn": "string"
          }
        ],
        "root": true,
        "serial_number": "string",
        "subject_dn": "string"
      },
      "subject": {
        "attributes": [
          {
            "id": "string",
            "mandatory": true,
            "multiple": true,
            "sources": [
              {
                "mandatory": true,
                "value": {}
              },
              {
                "mandatory": false,
                "value": {}
              },
              {
                "mandatory": true,
                "value": {}
              },
              {
                "mandatory": false,
                "value": {}
              },
              {
                "mandatory": false,
                "value": {}
              },
              {
                "mandatory": false,
                "value": {}
              },
              {
                "mandatory": true,
                "value": {}
              }
            ],
            "type": "string",
            "value": "string"
          },
          {
            "id": "string",
            "mandatory": true,
            "multiple": false,
            "sources": [
              {
                "mandatory": true,
                "value": {}
              },
              {
                "mandatory": false,
                "value": {}
              }
            ],
            "type": "string",
            "value": "string"
          },
          {
            "id": "string",
            "mandatory": false,
            "multiple": true,
            "sources": [
              {
                "mandatory": false,
                "value": {}
              },
              {
                "mandatory": false,
                "value": {}
              },
              {
                "mandatory": false,
                "value": {}
              },
              {
                "mandatory": false,
                "value": {}
              }
            ],
            "type": "string",
            "value": "string"
          },
          {
            "id": "string",
            "mandatory": false,
            "multiple": false,
            "sources": [
              {
                "mandatory": false,
                "value": {}
              },
              {
                "mandatory": true,
                "value": {}
              },
              {
                "mandatory": false,
                "value": {}
              },
              {
                "mandatory": false,
                "value": {}
              },
              {
                "mandatory": false,
                "value": {}
              },
              {
                "mandatory": false,
                "value": {}
              }
            ],
            "type": "string",
            "value": "string"
          }
        ]
      },
      "validity": {
        "duration": 3,
        "unit": "string"
      }
    },
    "certificate_delivery_format": "string",
    "duplicate_cert_policy": true,
    "enrollment": {
      "client_type": "string",
      "client_type_id": "string"
    },
    "id": "string",
    "name": "string",
    "private_key_attributes": {
      "algorithm_oid": "string",
      "crypto_providers": {
        "provider": [
          "string",
          "string",
          "string",
          "string",
          "string",
          "string",
          "string",
          "string",
          "string"
        ]
      },
      "key_escrow_policy": {
        "do_key_recovery_for_additional_enroll_request": true,
        "key_escrow_deployment_mode": "string",
        "key_escrow_enabled": false,
        "key_recovery_dual_admin_approval_required": false
      },
      "key_exportable": true,
      "key_protect": false,
      "key_size": 1,
      "key_sizes": [
        10,
        7
      ]
    },
    "publish_to_public_directory": false,
    "renewal_period_days": 3,
    "signature_algorithm": "string",
    "status": "string"
  },
  {
    "authentication": {
      "approval": "string",
      "attributes": [
        {
          "display_name": "string",
          "id": "string",
          "mandatory": true,
          "type": "string",
          "value": "string"
        },
        {
          "display_name": "string",
          "id": "string",
          "mandatory": false,
          "type": "string",
          "value": "string"
        },
        {
          "display_name": "string",
          "id": "string",
          "mandatory": false,
          "type": "string",
          "value": "string"
        },
        {
          "display_name": "string",
          "id": "string",
          "mandatory": false,
          "type": "string",
          "value": "string"
        }
      ],
      "method": "string",
      "method_id": "string"
    },
    "certificate": {
      "extensions": {
        "san": {
          "attributes": [
            {
              "id": "string",
              "mandatory": false,
              "type": "string",
              "value": "string"
            },
            {
              "id": "string",
              "mandatory": false,
              "type": "string",
              "value": "string"
            },
            {
              "id": "string",
              "mandatory": false,
              "type": "string",
              "value": "string"
            },
            {
              "id": "string",
              "mandatory": false,
              "type": "string",
              "value": "string"
            },
            {
              "id": "string",
              "mandatory": false,
              "type": "string",
              "value": "string"
            },
            {
              "id": "string",
              "mandatory": true,
              "type": "string",
              "value": "string"
            },
            {
              "id": "string",
              "mandatory": false,
              "type": "string",
              "value": "string"
            }
          ],
          "critical": false
        }
      },
      "issuer": {
        "certificate": "string",
        "chain": [
          {
            "certificate": "string",
            "root": false,
            "serial_number": "string",
            "subject_dn": "string"
          },
          {
            "certificate": "string",
            "root": true,
            "serial_number": "string",
            "subject_dn": "string"
          },
          {
            "certificate": "string",
            "root": false,
            "serial_number": "string",
            "subject_dn": "string"
          }
        ],
        "root": true,
        "serial_number": "string",
        "subject_dn": "string"
      },
      "subject": {
        "attributes": [
          {
            "id": "string",
            "mandatory": true,
            "multiple": true,
            "sources": [
              {
                "mandatory": false,
                "value": {}
              },
              {
                "mandatory": true,
                "value": {}
              },
              {
                "mandatory": false,
                "value": {}
              },
              {
                "mandatory": true,
                "value": {}
              },
              {
                "mandatory": true,
                "value": {}
              },
              {
                "mandatory": true,
                "value": {}
              },
              {
                "mandatory": true,
                "value": {}
              },
              {
                "mandatory": false,
                "value": {}
              },
              {
                "mandatory": false,
                "value": {}
              }
            ],
            "type": "string",
            "value": "string"
          }
        ]
      },
      "validity": {
        "duration": 6,
        "unit": "string"
      }
    },
    "certificate_delivery_format": "string",
    "duplicate_cert_policy": false,
    "enrollment": {
      "client_type": "string",
      "client_type_id": "string"
    },
    "id": "string",
    "name": "string",
    "private_key_attributes": {
      "algorithm_oid": "string",
      "crypto_providers": {
        "provider": [
          "string"
        ]
      },
      "key_escrow_policy": {
        "do_key_recovery_for_additional_enroll_request": false,
        "key_escrow_deployment_mode": "string",
        "key_escrow_enabled": true,
        "key_recovery_dual_admin_approval_required": false
      },
      "key_exportable": true,
      "key_protect": true,
      "key_size": 8,
      "key_sizes": [
        4,
        6,
        1,
        1,
        7,
        5
      ]
    },
    "publish_to_public_directory": true,
    "renewal_period_days": 4,
    "signature_algorithm": "string",
    "status": "string"
  },
  {
    "authentication": {
      "approval": "string",
      "attributes": [
        {
          "display_name": "string",
          "id": "string",
          "mandatory": true,
          "type": "string",
          "value": "string"
        },
        {
          "display_name": "string",
          "id": "string",
          "mandatory": false,
          "type": "string",
          "value": "string"
        },
        {
          "display_name": "string",
          "id": "string",
          "mandatory": false,
          "type": "string",
          "value": "string"
        },
        {
          "display_name": "string",
          "id": "string",
          "mandatory": false,
          "type": "string",
          "value": "string"
        },
        {
          "display_name": "string",
          "id": "string",
          "mandatory": false,
          "type": "string",
          "value": "string"
        }
      ],
      "method": "string",
      "method_id": "string"
    },
    "certificate": {
      "extensions": {
        "san": {
          "attributes": [
            {
              "id": "string",
              "mandatory": true,
              "type": "string",
              "value": "string"
            }
          ],
          "critical": false
        }
      },
      "issuer": {
        "certificate": "string",
        "chain": [
          {
            "certificate": "string",
            "root": true,
            "serial_number": "string",
            "subject_dn": "string"
          },
          {
            "certificate": "string",
            "root": true,
            "serial_number": "string",
            "subject_dn": "string"
          },
          {
            "certificate": "string",
            "root": false,
            "serial_number": "string",
            "subject_dn": "string"
          }
        ],
        "root": false,
        "serial_number": "string",
        "subject_dn": "string"
      },
      "subject": {
        "attributes": [
          {
            "id": "string",
            "mandatory": true,
            "multiple": true,
            "sources": [
              {
                "mandatory": false,
                "value": {}
              },
              {
                "mandatory": false,
                "value": {}
              },
              {
                "mandatory": true,
                "value": {}
              },
              {
                "mandatory": true,
                "value": {}
              },
              {
                "mandatory": false,
                "value": {}
              }
            ],
            "type": "string",
            "value": "string"
          },
          {
            "id": "string",
            "mandatory": false,
            "multiple": false,
            "sources": [
              {
                "mandatory": true,
                "value": {}
              },
              {
                "mandatory": false,
                "value": {}
              },
              {
                "mandatory": true,
                "value": {}
              },
              {
                "mandatory": true,
                "value": {}
              },
              {
                "mandatory": true,
                "value": {}
              },
              {
                "mandatory": true,
                "value": {}
              },
              {
                "mandatory": true,
                "value": {}
              },
              {
                "mandatory": false,
                "value": {}
              },
              {
                "mandatory": true,
                "value": {}
              },
              {
                "mandatory": true,
                "value": {}
              }
            ],
            "type": "string",
            "value": "string"
          },
          {
            "id": "string",
            "mandatory": false,
            "multiple": false,
            "sources": [
              {
                "mandatory": true,
                "value": {}
              },
              {
                "mandatory": true,
                "value": {}
              },
              {
                "mandatory": true,
                "value": {}
              },
              {
                "mandatory": false,
                "value": {}
              }
            ],
            "type": "string",
            "value": "string"
          },
          {
            "id": "string",
            "mandatory": false,
            "multiple": true,
            "sources": [
              {
                "mandatory": true,
                "value": {}
              },
              {
                "mandatory": false,
                "value": {}
              }
            ],
            "type": "string",
            "value": "string"
          },
          {
            "id": "string",
            "mandatory": true,
            "multiple": false,
            "sources": [
              {
                "mandatory": true,
                "value": {}
              },
              {
                "mandatory": true,
                "value": {}
              }
            ],
            "type": "string",
            "value": "string"
          },
          {
            "id": "string",
            "mandatory": true,
            "multiple": false,
            "sources": [
              {
                "mandatory": false,
                "value": {}
              },
              {
                "mandatory": false,
                "value": {}
              },
              {
                "mandatory": true,
                "value": {}
              },
              {
                "mandatory": true,
                "value": {}
              },
              {
                "mandatory": true,
                "value": {}
              }
            ],
            "type": "string",
            "value": "string"
          },
          {
            "id": "string",
            "mandatory": true,
            "multiple": true,
            "sources": [
              {
                "mandatory": false,
                "value": {}
              },
              {
                "mandatory": false,
                "value": {}
              },
              {
                "mandatory": false,
                "value": {}
              },
              {
                "mandatory": true,
                "value": {}
              },
              {
                "mandatory": true,
                "value": {}
              },
              {
                "mandatory": true,
                "value": {}
              },
              {
                "mandatory": false,
                "value": {}
              },
              {
                "mandatory": false,
                "value": {}
              },
              {
                "mandatory": false,
                "value": {}
              }
            ],
            "type": "string",
            "value": "string"
          }
        ]
      },
      "validity": {
        "duration": 1,
        "unit": "string"
      }
    },
    "certificate_delivery_format": "string",
    "duplicate_cert_policy": false,
    "enrollment": {
      "client_type": "string",
      "client_type_id": "string"
    },
    "id": "string",
    "name": "string",
    "private_key_attributes": {
      "algorithm_oid": "string",
      "crypto_providers": {
        "provider": [
          "string",
          "string",
          "string",
          "string",
          "string",
          "string",
          "string",
          "string",
          "string"
        ]
      },
      "key_escrow_policy": {
        "do_key_recovery_for_additional_enroll_request": true,
        "key_escrow_deployment_mode": "string",
        "key_escrow_enabled": true,
        "key_recovery_dual_admin_approval_required": true
      },
      "key_exportable": false,
      "key_protect": true,
      "key_size": 4,
      "key_sizes": [
        4,
        10
      ]
    },
    "publish_to_public_directory": false,
    "renewal_period_days": 7,
    "signature_algorithm": "string",
    "status": "string"
  },
  {
    "authentication": {
      "approval": "string",
      "attributes": [
        {
          "display_name": "string",
          "id": "string",
          "mandatory": true,
          "type": "string",
          "value": "string"
        },
        {
          "display_name": "string",
          "id": "string",
          "mandatory": false,
          "type": "string",
          "value": "string"
        },
        {
          "display_name": "string",
          "id": "string",
          "mandatory": true,
          "type": "string",
          "value": "string"
        },
        {
          "display_name": "string",
          "id": "string",
          "mandatory": true,
          "type": "string",
          "value": "string"
        },
        {
          "display_name": "string",
          "id": "string",
          "mandatory": true,
          "type": "string",
          "value": "string"
        },
        {
          "display_name": "string",
          "id": "string",
          "mandatory": false,
          "type": "string",
          "value": "string"
        },
        {
          "display_name": "string",
          "id": "string",
          "mandatory": true,
          "type": "string",
          "value": "string"
        },
        {
          "display_name": "string",
          "id": "string",
          "mandatory": true,
          "type": "string",
          "value": "string"
        },
        {
          "display_name": "string",
          "id": "string",
          "mandatory": false,
          "type": "string",
          "value": "string"
        }
      ],
      "method": "string",
      "method_id": "string"
    },
    "certificate": {
      "extensions": {
        "san": {
          "attributes": [
            {
              "id": "string",
              "mandatory": false,
              "type": "string",
              "value": "string"
            },
            {
              "id": "string",
              "mandatory": false,
              "type": "string",
              "value": "string"
            },
            {
              "id": "string",
              "mandatory": false,
              "type": "string",
              "value": "string"
            }
          ],
          "critical": false
        }
      },
      "issuer": {
        "certificate": "string",
        "chain": [
          {
            "certificate": "string",
            "root": false,
            "serial_number": "string",
            "subject_dn": "string"
          },
          {
            "certificate": "string",
            "root": false,
            "serial_number": "string",
            "subject_dn": "string"
          },
          {
            "certificate": "string",
            "root": false,
            "serial_number": "string",
            "subject_dn": "string"
          },
          {
            "certificate": "string",
            "root": true,
            "serial_number": "string",
            "subject_dn": "string"
          },
          {
            "certificate": "string",
            "root": true,
            "serial_number": "string",
            "subject_dn": "string"
          },
          {
            "certificate": "string",
            "root": false,
            "serial_number": "string",
            "subject_dn": "string"
          },
          {
            "certificate": "string",
            "root": true,
            "serial_number": "string",
            "subject_dn": "string"
          },
          {
            "certificate": "string",
            "root": true,
            "serial_number": "string",
            "subject_dn": "string"
          },
          {
            "certificate": "string",
            "root": false,
            "serial_number": "string",
            "subject_dn": "string"
          }
        ],
        "root": false,
        "serial_number": "string",
        "subject_dn": "string"
      },
      "subject": {
        "attributes": [
          {
            "id": "string",
            "mandatory": false,
            "multiple": true,
            "sources": [
              {
                "mandatory": true,
                "value": {}
              },
              {
                "mandatory": false,
                "value": {}
              }
            ],
            "type": "string",
            "value": "string"
          },
          {
            "id": "string",
            "mandatory": true,
            "multiple": false,
            "sources": [
              {
                "mandatory": true,
                "value": {}
              },
              {
                "mandatory": false,
                "value": {}
              },
              {
                "mandatory": true,
                "value": {}
              },
              {
                "mandatory": true,
                "value": {}
              }
            ],
            "type": "string",
            "value": "string"
          },
          {
            "id": "string",
            "mandatory": true,
            "multiple": false,
            "sources": [
              {
                "mandatory": true,
                "value": {}
              },
              {
                "mandatory": false,
                "value": {}
              },
              {
                "mandatory": false,
                "value": {}
              },
              {
                "mandatory": true,
                "value": {}
              },
              {
                "mandatory": false,
                "value": {}
              },
              {
                "mandatory": false,
                "value": {}
              },
              {
                "mandatory": true,
                "value": {}
              },
              {
                "mandatory": true,
                "value": {}
              }
            ],
            "type": "string",
            "value": "string"
          },
          {
            "id": "string",
            "mandatory": false,
            "multiple": true,
            "sources": [
              {
                "mandatory": false,
                "value": {}
              },
              {
                "mandatory": false,
                "value": {}
              },
              {
                "mandatory": true,
                "value": {}
              },
              {
                "mandatory": true,
                "value": {}
              },
              {
                "mandatory": true,
                "value": {}
              },
              {
                "mandatory": true,
                "value": {}
              },
              {
                "mandatory": false,
                "value": {}
              },
              {
                "mandatory": false,
                "value": {}
              },
              {
                "mandatory": false,
                "value": {}
              }
            ],
            "type": "string",
            "value": "string"
          },
          {
            "id": "string",
            "mandatory": true,
            "multiple": false,
            "sources": [
              {
                "mandatory": false,
                "value": {}
              },
              {
                "mandatory": false,
                "value": {}
              },
              {
                "mandatory": false,
                "value": {}
              },
              {
                "mandatory": true,
                "value": {}
              },
              {
                "mandatory": false,
                "value": {}
              },
              {
                "mandatory": false,
                "value": {}
              },
              {
                "mandatory": true,
                "value": {}
              },
              {
                "mandatory": true,
                "value": {}
              },
              {
                "mandatory": false,
                "value": {}
              },
              {
                "mandatory": false,
                "value": {}
              }
            ],
            "type": "string",
            "value": "string"
          },
          {
            "id": "string",
            "mandatory": true,
            "multiple": false,
            "sources": [
              {
                "mandatory": false,
                "value": {}
              },
              {
                "mandatory": false,
                "value": {}
              },
              {
                "mandatory": false,
                "value": {}
              }
            ],
            "type": "string",
            "value": "string"
          },
          {
            "id": "string",
            "mandatory": true,
            "multiple": true,
            "sources": [
              {
                "mandatory": true,
                "value": {}
              },
              {
                "mandatory": false,
                "value": {}
              },
              {
                "mandatory": true,
                "value": {}
              },
              {
                "mandatory": false,
                "value": {}
              },
              {
                "mandatory": true,
                "value": {}
              },
              {
                "mandatory": true,
                "value": {}
              },
              {
                "mandatory": false,
                "value": {}
              },
              {
                "mandatory": true,
                "value": {}
              },
              {
                "mandatory": false,
                "value": {}
              }
            ],
            "type": "string",
            "value": "string"
          },
          {
            "id": "string",
            "mandatory": true,
            "multiple": false,
            "sources": [
              {
                "mandatory": false,
                "value": {}
              },
              {
                "mandatory": true,
                "value": {}
              },
              {
                "mandatory": true,
                "value": {}
              },
              {
                "mandatory": true,
                "value": {}
              }
            ],
            "type": "string",
            "value": "string"
          }
        ]
      },
      "validity": {
        "duration": 4,
        "unit": "string"
      }
    },
    "certificate_delivery_format": "string",
    "duplicate_cert_policy": false,
    "enrollment": {
      "client_type": "string",
      "client_type_id": "string"
    },
    "id": "string",
    "name": "string",
    "private_key_attributes": {
      "algorithm_oid": "string",
      "crypto_providers": {
        "provider": [
          "string",
          "string",
          "string",
          "string",
          "string",
          "string",
          "string"
        ]
      },
      "key_escrow_policy": {
        "do_key_recovery_for_additional_enroll_request": true,
        "key_escrow_deployment_mode": "string",
        "key_escrow_enabled": true,
        "key_recovery_dual_admin_approval_required": true
      },
      "key_exportable": true,
      "key_protect": false,
      "key_size": 3,
      "key_sizes": [
        9,
        8,
        5,
        1,
        5,
        5,
        7,
        7
      ]
    },
    "publish_to_public_directory": false,
    "renewal_period_days": 9,
    "signature_algorithm": "string",
    "status": "string"
  }
]