{
  "$id": "schema.json",
  "type": "object",
  "schema": "http://json-schema.org/draft-07/schema#",
  "translate": false,
  "dynamicfields": true,
  "properties": {
    "ph_request_type": {
      "type": "string",
      "description": "type of request (internal to adapter)",
      "default": "",
      "enum": [
        "createDeviceProfile",
        "listdeviceprofiles",
        "getDeviceProfile",
        "updateDeviceProfile",
        "deleteDeviceProfile",
        "restoreDeviceProfile"
      ],
      "external_name": "ph_request_type"
    },
    "accountId": {
      "type": "string",
      "description": "Limits results to device profiles for an account with the given ID.",
      "parse": false,
      "encode": false,
      "encrypt": {
        "type": "AES",
        "key": ""
      },
      "external_name": "account_id"
    },    
    "divisionId": {
      "type": "string",
      "description": "Limits results to device profiles for a division with the given ID.",
      "parse": false,
      "encode": false,
      "encrypt": {
        "type": "AES",
        "key": ""
      },
      "external_name": "division_id"
    },    
    "deviceProfileId": {
      "type": "string",
      "description": "Device profile ID (UUID)",
      "parse": false,
      "encode": false,
      "encrypt": {
        "type": "AES",
        "key": ""
      },
      "external_name": "device_profile_id"
    }
  },
  "definitions": {}
}