{
  "id": "64c02969-3890-4da8-a5ef-b574fd72887e",
  "account_id": "1d1ec1ec-6502-11e9-a923-1681be663d3e",
  "division": {
    "id": "fd5faa1e-623a-47a9-831b-b9397c33395f",
    "name": "Mock Division 1"
  },
  "device_identifier": "New Device",
  "device_profile": {
    "id": "a81a431a-be7b-4f2e-8afd-b2778491511f",
    "name": "Device Profile"
  },
  "created": "2020-04-22T07:13:20Z",
  "updated": "2020-04-24T09:23:21Z",
  "status": "DISABLED",
  "fields": [
    {
      "id": "417c328e-604c-4e94-9112-ee58f12277fb",
      "name": "Mandatory Field",
      "value": "updated mandatory value",
      "mandatory": true
    },
    {
      "id": "90eb4de2-ae8a-48a0-a904-d30c5ab6e1de",
      "name": "Optional Field",
      "value": "updated optional value",
      "mandatory": false
    }
  ],
  "device_api_allow_read": true,
  "device_api_allow_write": true,
  "device_api_allow_renew_certificate": true
}