{
  "$id": "schema.json",
  "type": "object",
  "schema": "http://json-schema.org/draft-07/schema#",
  "translate": false,
  "dynamicfields": true,
  "properties": {
    "ph_request_type": {
      "type": "string",
      "description": "type of request (internal to adapter)",
      "default": "",
      "enum": [
        "listEnrollmentProfiles",
        "createEnrollmentProfile",
        "getExampleCertificateRequestEnrollmentProfileID",
        "getEnrollmentProfile",
        "updateEnrollmentProfile",
        "listAssignableICAs",
        "getIssuingICA",
        "getEnrollmentProfileSpecification",
        "getEnrollmentProfileStatus"
      ],
      "external_name": "ph_request_type"
    },
    "deviceProfileId": {
      "type": "string",
      "description": "Limits results to enrollment profiles with a device profile ID that is an exact match for the given string. Case-insensitive.",
      "parse": false,
      "encode": false,
      "encrypt": {
        "type": "AES",
        "key": ""
      },
      "external_name": "device_profile_id"
    },    
    "deviceProfileName": {
      "type": "string",
      "description": "Limits results to enrollment profiles with a device profile name that starts with the given string. Case-insensitive.",
      "parse": false,
      "encode": false,
      "encrypt": {
        "type": "AES",
        "key": ""
      },
      "external_name": "device_profile_name"
    },    
    "enrollmentMethods": {
      "type": "",
      "description": "Limits results to enrollment profiles that use any of the enrollment methods from the given comma-separated list. Case-insensitive.",
      "parse": false,
      "encode": false,
      "encrypt": {
        "type": "AES",
        "key": ""
      },
      "external_name": "enrollment_methods"
    },    
    "ipAddresses": {
      "type": "string",
      "description": "Limits results to enrollment profiles that allow requests from all IP addresses in the given comma-separated list.",
      "parse": false,
      "encode": false,
      "encrypt": {
        "type": "AES",
        "key": ""
      },
      "external_name": "ip_addresses"
    },    
    "createdFrom": {
      "type": "string",
      "description": "Limits results to enrollment profiles created after the given date. Format: `YYYY-MM-DD`",
      "parse": false,
      "encode": false,
      "encrypt": {
        "type": "AES",
        "key": ""
      },
      "external_name": "created_from"
    },    
    "createdTo": {
      "type": "string",
      "description": "Limits results to enrollment profiles created before the given date. Format: `YYYY-MM-DD`",
      "parse": false,
      "encode": false,
      "encrypt": {
        "type": "AES",
        "key": ""
      },
      "external_name": "created_to"
    },    
    "certificateType": {
      "type": "",
      "description": "Limits results to enrollment profiles for the given certificate type (end-entity or intermediate). Case-insensitive.",
      "parse": false,
      "encode": false,
      "encrypt": {
        "type": "AES",
        "key": ""
      },
      "external_name": "certificate_type"
    },    
    "sortBy": {
      "type": "",
      "description": "Sorts results by the given property. Case-insensitive.",
      "parse": false,
      "encode": false,
      "encrypt": {
        "type": "AES",
        "key": ""
      },
      "external_name": "sort_by"
    },    
    "sortDirection": {
      "type": "",
      "description": "Sorts results in ascending or descending order by the value of the `sort_by` property. Case-insensitive.",
      "parse": false,
      "encode": false,
      "encrypt": {
        "type": "AES",
        "key": ""
      },
      "external_name": "sort_direction"
    },    
    "enrollmentProfileId": {
      "type": "string",
      "description": "Enrollment profile ID.",
      "parse": false,
      "encode": false,
      "encrypt": {
        "type": "AES",
        "key": ""
      },
      "external_name": "enrollment_profile_id"
    },    
    "includeChain": {
      "type": "boolean",
      "description": "If true, response includes the full certificate chain (ICAs and root certificate) for the enrollment profile&#39;s issuing ICA. If false (default), response only includes the...(description truncated)",
      "parse": false,
      "encode": false,
      "encrypt": {
        "type": "AES",
        "key": ""
      },
      "external_name": "include_chain"
    }
  },
  "definitions": {}
}