{
  "$id": "schema.json",
  "type": "object",
  "schema": "http://json-schema.org/draft-07/schema#",
  "translate": false,
  "dynamicfields": true,
  "properties": {
    "ph_request_type": {
      "type": "string",
      "description": "type of request (internal to adapter)",
      "default": "",
      "enum": [
        "createDevice",
        "getDeviceList",
        "getDeviceDetails",
        "updateDevice",
        "archiveDevice",
        "enableDevice",
        "disableDevice",
        "restoreDevice"
      ],
      "external_name": "ph_request_type"
    },
    "deviceIdentifier": {
      "type": "string",
      "description": "Limits response data to records that use a specific device identifier.",
      "parse": false,
      "encode": false,
      "encrypt": {
        "type": "AES",
        "key": ""
      },
      "external_name": "device_identifier"
    },    
    "createdFrom": {
      "type": "string",
      "description": "Limits response data to device records created after the given date. Format: `YYYY-MM-DD`",
      "parse": false,
      "encode": false,
      "encrypt": {
        "type": "AES",
        "key": ""
      },
      "external_name": "created_from"
    },    
    "createdTo": {
      "type": "string",
      "description": "Limits response data to device records created before the given date. Format: `YYYY-MM-DD`",
      "parse": false,
      "encode": false,
      "encrypt": {
        "type": "AES",
        "key": ""
      },
      "external_name": "created_to"
    },    
    "divisionId": {
      "type": "string",
      "description": "Limits response data to device records associated with a specific division ID.",
      "parse": false,
      "encode": false,
      "encrypt": {
        "type": "AES",
        "key": ""
      },
      "external_name": "division_id"
    },    
    "updatedFrom": {
      "type": "string",
      "description": "Limits response data to device records updated after a specific date. Format: `YYYY-MM-DD`",
      "parse": false,
      "encode": false,
      "encrypt": {
        "type": "AES",
        "key": ""
      },
      "external_name": "updated_from"
    },    
    "updatedTo": {
      "type": "string",
      "description": "Limits response data to device records updated before a specific date. Format: `YYYY-MM-DD`",
      "parse": false,
      "encode": false,
      "encrypt": {
        "type": "AES",
        "key": ""
      },
      "external_name": "updated_to"
    },    
    "deviceProfileId": {
      "type": "string",
      "description": "Limits response data to device records with a specific device profile ID.",
      "parse": false,
      "encode": false,
      "encrypt": {
        "type": "AES",
        "key": ""
      },
      "external_name": "device_profile_id"
    }
  },
  "definitions": {}
}