{
  "template_id": "<template_id>",
  "id": "<authentication_certificate_id>",
  "name": "Example Name",
  "enrollment_profile": {
    "id": "<enrollment_profile_id>",
    "name": "<enrollment_profile_name>"
  },
  "start_date": "2021-05-20T00:00:00Z",
  "end_date": "2022-05-20T00:00:00Z",
  "usage_limit": "0",
  "registered_values": [
    {
      "certificate_field": "subject.common_name",
      "matcher": "equals",
      "value": "common name",
      "multiple": false
    },
    {
      "certificate_field": "subject.organization_unit",
      "matcher": "equals",
      "value": [
        "Unit 1",
        "Unit 2"
      ],
      "multiple": true
    }
  ],
  "number_of_usage": "0",
  "status": "ACTIVE",
  "created_at": "2021-05-13T21:05:43.273689Z",
  "certificate_issuer_common_name": "Issuing CA Name",
  "use_passcode": false,
  "generation_option": "string",
  "passcode": "ExamplePasscode123",
  "passcode_length": 20,
  "certificate": {
    "id": "<certificate_id>",
    "name": "Certificate Name"
  },
  "pem": "<pem>",
  "certificate_expires_on": "2022-04-30T17:38:58Z",
  "certificate_serial_number": "<certificate_serial_number>",
  "certificate_status": "ISSUED",
  "certificate_thumbprint": "<certificate_thumbprint>",
  "certificate_organization": "Example Organization",
  "certificate_organization_units": []
}