{
  "name": "adapter-apic",
  "webName": "Adapter for Integration to Cisco APIC",
  "supportLevel": "community",
  "vendor": "Cisco Systems",
  "product": "APIC",
  "techAlliance": false,
  "osVersion": [],
  "apiVersions": [],
  "iapVersions": [
    "2021.1.x",
    "2021.2.x",
    "2022.1.x",
    "2023.1.x"
  ],
  "method": "REST",
  "type": "Adapter",
  "domains": [
    "Security (SASE)"
  ],
  "tags": [
    "Security Policy Management",
    "Configuration & Compliance",
    "Network Infrastructure Changes",
    "Software Upgrades & Device Maintenance"
  ],
  "useCases": [
    "Security Group updates",
    "Security Rule Removal",
    "Security Rule Creation",
    "Run network compliance checks and remediation",
    "Determine configuration drift",
    "Device Onboarding",
    "Software Upgrade",
    "Firewall Configuration backup or restore"
  ],
  "deprecated": {
    "isDeprecated": false
  },
  "brokerSince": "",
  "authMethods": [
    {
      "type": "Cookie",
      "primary": true
    }
  ],
  "documentation": {
    "storeLink": "",
    "npmLink": "https://www.npmjs.com/package/@itentialopensource/adapter-apic",
    "repoLink": "https://gitlab.com/itentialopensource/adapters/adapter-apic",
    "docLink": "https://gitlab.com/itentialopensource/adapters/adapter-apic/-/blob/master/README.md?ref_type=heads",
    "demoLinks": [],
    "trainingLinks": [
      {
        "title": "Itential Academy",
        "link": "https://www.itential.com/itential-academy/"
      }
    ],
    "faqLink": "https://docs.itential.com/opensource/docs/troubleshooting-an-adapter",
    "contributeLink": "https://gitlab.com/itentialopensource/adapters/contributing-guide",
    "issueLink": "https://itential.atlassian.net/servicedesk/customer/portals",
    "webLink": "https://www.itential.com/adapters/cisco-apic/",
    "vendorLink": "https://www.cisco.com/",
    "productLink": "https://www.cisco.com/c/en/us/products/cloud-systems-management/application-policy-infrastructure-controller-apic/index.html",
    "apiLinks": [
      {
        "title": "Cisco Systems - APIC API",
        "link": "https://www.cisco.com/c/en/us/td/docs/switches/datacenter/aci/apic/sw/3-x/rest-api-config/b_Cisco_APIC_REST_API_Configuration_Guide_3x.html",
        "public": true
      }
    ],
    "workshopLinks": [],
    "workshopHomePage": "https://www.itential.com/get-started/"
  },
  "assets": [],
  "relatedItems": {
    "adapters": [],
    "integrations": [],
    "ecosystemApplications": [],
    "workflowProjects": [],
    "transformationProjects": [],
    "exampleProjects": []
  }
}