{
  "invalidateSessionsResponse": {
    "result": [
      {
        "errors": [
          {
            "extendedErrorDetails": [
              {
                "extendedErrorCode": "SUBFLOW_PROCESSTYPE_NOT_SUPPORTED"
              },
              {
                "extendedErrorCode": "SUBFLOW_INPUT_MISSING_NAME"
              },
              {
                "extendedErrorCode": "SUBFLOW_INPUT_MISMATCHED_OBJECTS"
              },
              {
                "extendedErrorCode": "DECISION_DEFAULT_CONNECTOR_MISSING_LABEL"
              },
              {
                "extendedErrorCode": "VISIBILITY_RULE_NOT_SUPPORTED_FOR_API_VERSION"
              },
              {
                "extendedErrorCode": "CONSTANT_INCLUDES_REFERENCES"
              },
              {
                "extendedErrorCode": "RECORDFILTER_MISSING_DATATYPE"
              },
              {
                "extendedErrorCode": "SCREENFIELD_EXTENSION_NAME_INVALID"
              },
              {
                "extendedErrorCode": "SCREENFIELD_EXTENSION_IMPLEMENTATION_INVALID"
              },
              {
                "extendedErrorCode": "WAITEVENT_RELATIVEALARM_INVALID_OFFSETUNIT"
              }
            ],
            "fields": [
              "string"
            ],
            "message": "string",
            "statusCode": "PAL_INVALID_PARAMETERS"
          },
          {
            "extendedErrorDetails": [
              {
                "extendedErrorCode": "RECORDFILTER_INVALID_DATATYPE"
              },
              {
                "extendedErrorCode": "INPUTPARAM_INCOMPATIBLE_DATATYPE"
              },
              {
                "extendedErrorCode": "RECORDFILTER_INVALID_DATATYPE"
              },
              {
                "extendedErrorCode": "FLEXIPAGE_COMPONENT_ATTRIBUTE_EXPRESSION_EXCEPTION"
              },
              {
                "extendedErrorCode": "UNEXPECTED_ERROR"
              },
              {
                "extendedErrorCode": "EX_AUTOLAUNCHED_SUBFLOW_INCOMPATIBLE_FLOWTYPE"
              },
              {
                "extendedErrorCode": "WAITEVENT_INPUT_REQUIRES_LITERAL_VALUE"
              },
              {
                "extendedErrorCode": "FLOW_SOBJECT_VARIABLE_NOT_PERSISTED"
              },
              {
                "extendedErrorCode": "SCREENFIELD_EXTENSION_OUTPUT_ATTRIBUTE_INVALID"
              }
            ],
            "fields": [
              "string",
              "string",
              "string",
              "string",
              "string"
            ],
            "message": "string",
            "statusCode": "CUSTOM_ENTITY_OR_FIELD_LIMIT"
          },
          {
            "extendedErrorDetails": [
              {
                "extendedErrorCode": "SUBFLOW_OUTPUT_VARIABLE_NO_OUTPUT_ACCESS"
              },
              {
                "extendedErrorCode": "RECORDFILTER_GEOLOCATION_FIELDS_NOT_SUPPORTED"
              },
              {
                "extendedErrorCode": "CUSTOMEVENT_PROCESSMETADATAVALUES_MISSING_NAME"
              },
              {
                "extendedErrorCode": "ELEMENT_NAME_INVALID"
              },
              {
                "extendedErrorCode": "SCREENCOMPONENT_CONTAINS_VISIBILITY_RULE"
              }
            ],
            "fields": [
              "string",
              "string",
              "string",
              "string",
              "string",
              "string",
              "string",
              "string",
              "string",
              "string"
            ],
            "message": "string",
            "statusCode": "MAX_ACTIVE_RULES_EXCEEDED"
          },
          {
            "extendedErrorDetails": [
              {
                "extendedErrorCode": "SCREENFIELD_EXTENSION_IMPLEMENTATION_INVALID"
              },
              {
                "extendedErrorCode": "EXTERNAL_OBJECTS_NOT_SUPPORTED"
              },
              {
                "extendedErrorCode": "WAITEVENT_RELATIVEALARM_INVALID_OFFSETUNIT"
              }
            ],
            "fields": [
              "string",
              "string",
              "string",
              "string",
              "string",
              "string",
              "string",
              "string"
            ],
            "message": "string",
            "statusCode": "UNSUPPORTED_SOCIAL_PROVIDER"
          },
          {
            "extendedErrorDetails": [
              {
                "extendedErrorCode": "INPUTPARAM_INCOMPATIBLE_DATATYPE"
              },
              {
                "extendedErrorCode": "CUSTOMEVENT_OBJECTTYPE_NOT_SUPPORTED"
              },
              {
                "extendedErrorCode": "RULE_MISSING_CONDITION"
              },
              {
                "extendedErrorCode": "SORT_FIELD_NOT_SUPPORTED"
              },
              {
                "extendedErrorCode": "VISIBILITY_RULE_NOT_AVAILABLE_IN_ORG"
              }
            ],
            "fields": [
              "string",
              "string"
            ],
            "message": "string",
            "statusCode": "EMAIL_EXTERNAL_TRANSPORT_TOKEN_ERROR"
          }
        ],
        "success": true
      },
      {
        "errors": [
          {
            "extendedErrorDetails": [
              {
                "extendedErrorCode": "FLOW_INTERVIEW_REGEX_VALIDATION"
              },
              {
                "extendedErrorCode": "SUBFLOW_PROCESSTYPE_NOT_SUPPORTED"
              },
              {
                "extendedErrorCode": "INPUTPARAM_INCOMPATIBLE_WITH_COLLECTION_VARIABLE"
              },
              {
                "extendedErrorCode": "FIELD_NOT_FOUND"
              },
              {
                "extendedErrorCode": "ELEMENT_SCALE_SMALLER_THAN_DEFAULTVALUE"
              },
              {
                "extendedErrorCode": "FLEXIPAGE_COMPONENT_ATTRIBUTE_TOO_LONG"
              },
              {
                "extendedErrorCode": "CONDITION_LOGIC_INVALID"
              },
              {
                "extendedErrorCode": "SCREENCOMPONENT_CONTAINS_VISIBILITY_RULE"
              },
              {
                "extendedErrorCode": "SCREENFIELD_DEFAULTVALUE_NOT_SUPPORTED"
              },
              {
                "extendedErrorCode": "APEXCALLOUT_MISSING_CLASSNAME"
              }
            ],
            "fields": [
              "string",
              "string",
              "string",
              "string",
              "string",
              "string",
              "string",
              "string",
              "string",
              "string"
            ],
            "message": "string",
            "statusCode": "ORDER_MANAGEMENT_RECORD_EXISTS"
          },
          {
            "extendedErrorDetails": [
              {
                "extendedErrorCode": "OBJECT_ENCRYPTED_FIELDS_NOT_SUPPORTED"
              },
              {
                "extendedErrorCode": "ELEMENT_MISSING_REFERENCE"
              },
              {
                "extendedErrorCode": "SUBFLOW_OUTPUT_VARIABLE_NOT_FOUND_IN_REFERENCEDFLOW"
              },
              {
                "extendedErrorCode": "SCREENFIELD_EXTENSION_INPUT_ATTRIBUTE_INVALID"
              }
            ],
            "fields": [
              "string",
              "string",
              "string",
              "string",
              "string",
              "string"
            ],
            "message": "string",
            "statusCode": "INVALID_STATUS"
          },
          {
            "extendedErrorDetails": [
              {
                "extendedErrorCode": "APEXCALLOUT_OUTPUT_NOT_FOUND"
              }
            ],
            "fields": [
              "string",
              "string",
              "string",
              "string",
              "string",
              "string"
            ],
            "message": "string",
            "statusCode": "MATCH_DEFINITION_ERROR"
          }
        ],
        "success": true
      },
      {
        "errors": [
          {
            "extendedErrorDetails": [
              {
                "extendedErrorCode": "FLEXIPAGE_COMPONENT_ATTRIBUTE_MISSING_REQUIRED"
              },
              {
                "extendedErrorCode": "SUBFLOW_INPUT_VARIABLE_NOT_FOUND_IN_REFERENCEDFLOW"
              },
              {
                "extendedErrorCode": "APEXCALLOUT_OUTPUT_NOT_FOUND"
              },
              {
                "extendedErrorCode": "CONDITION_OPERATOR_INCOMPATIBLE"
              },
              {
                "extendedErrorCode": "TRIGGER_TYPE_NOT_ALLOWED_FOR_SUBFLOW"
              },
              {
                "extendedErrorCode": "VISIBILITY_RULE_EXCEEDS_CONDITION_LIMIT"
              },
              {
                "extendedErrorCode": "LOOP_ASSIGNNEXTVALUETO_MISMATCHED_OBJECTTYPE"
              },
              {
                "extendedErrorCode": "INCONSISTENT_DYNAMIC_TYPE_MAPPING"
              }
            ],
            "fields": [
              "string",
              "string",
              "string",
              "string"
            ],
            "message": "string",
            "statusCode": "ENVIRONMENT_HUB_MEMBERSHIP_ERROR_JOINING_HUB"
          },
          {
            "extendedErrorDetails": [
              {
                "extendedErrorCode": "SCREENFIELD_API_VERSION_NOT_SUPPORTED"
              },
              {
                "extendedErrorCode": "FLOW_INTERVIEW_NAVIGATE"
              },
              {
                "extendedErrorCode": "FLEXIPAGE_COMPONENT_CUSTOM_VALIDATION_EXCEPTION"
              },
              {
                "extendedErrorCode": "WORKFLOW_OLDOBJECTVARIABLE_DOESNT_SUPPORT_INPUT"
              },
              {
                "extendedErrorCode": "SCREENFIELD_OUTPUTS_NOT_SUPPORTED"
              },
              {
                "extendedErrorCode": "PROCESSTYPE_NOT_SUPPORTED"
              }
            ],
            "fields": [
              "string",
              "string"
            ],
            "message": "string",
            "statusCode": "CANNOT_EXECUTE_FLOW_TRIGGER"
          },
          {
            "extendedErrorDetails": [
              {
                "extendedErrorCode": "INCONSISTENT_DYNAMIC_TYPE_MAPPING"
              },
              {
                "extendedErrorCode": "FLOW_INTERVIEW_INPUT_VALIDATION"
              },
              {
                "extendedErrorCode": "DATATYPE_MISSING"
              },
              {
                "extendedErrorCode": "SUBFLOW_DIFFERENT_RUNMODE"
              },
              {
                "extendedErrorCode": "FIELDASSIGNMENT_PICKLISTFIELD_INCOMPATIBLE_DATATYPE"
              },
              {
                "extendedErrorCode": "FIELDASSIGNMENT_MULTIPLE_REFERENCES_SAME_FIELD"
              },
              {
                "extendedErrorCode": "TRIGGER_TYPE_CONTEXT_OBJECT_NOT_SUPPORTED"
              },
              {
                "extendedErrorCode": "BOTH_START_NODE_AND_REFERENCE_FOUND"
              }
            ],
            "fields": [
              "string",
              "string",
              "string",
              "string",
              "string",
              "string",
              "string"
            ],
            "message": "string",
            "statusCode": "CANNOT_CREATE_ANOTHER_MANAGED_PACKAGE"
          },
          {
            "extendedErrorDetails": [
              {
                "extendedErrorCode": "ASSIGNMENTITEM_NONEXISTENT_REFERENCE"
              }
            ],
            "fields": [
              "string",
              "string",
              "string",
              "string",
              "string"
            ],
            "message": "string",
            "statusCode": "ENTITY_IS_ARCHIVED"
          },
          {
            "extendedErrorDetails": [
              {
                "extendedErrorCode": "SUBFLOW_INPUT_VALUE_INCOMPATIBLE_DATATYPES"
              },
              {
                "extendedErrorCode": "FLOW_SCHEDULE_INFORMATION_INCOMPLETE"
              },
              {
                "extendedErrorCode": "FLOW_INCLUDES_STEP"
              },
              {
                "extendedErrorCode": "SUBFLOW_OUTPUT_INCOMPATIBLE_DATATYPES"
              },
              {
                "extendedErrorCode": "NON_EXPOSED_COMPONENT_IN_FLOW"
              },
              {
                "extendedErrorCode": "SYSTEM_MODE_NOT_ALLOWED"
              },
              {
                "extendedErrorCode": "WAITEVENT_INPUT_REQUIRES_LITERAL_VALUE"
              }
            ],
            "fields": [
              "string",
              "string",
              "string",
              "string"
            ],
            "message": "string",
            "statusCode": "UNSPECIFIED_EMAIL_ADDRESS"
          },
          {
            "extendedErrorDetails": [
              {
                "extendedErrorCode": "SCREENRULE_ACTION_INVALID_VALUE"
              },
              {
                "extendedErrorCode": "VARIABLE_SCALE_EXCEEDS_LIMIT"
              },
              {
                "extendedErrorCode": "CONDITION_BUILDER_MISSING_REQUIRED_PERMISSIONS"
              },
              {
                "extendedErrorCode": "AUTOLAUNCHED_STEP_NOT_SUPPORTED"
              },
              {
                "extendedErrorCode": "ELEMENT_MISSING_LABEL"
              },
              {
                "extendedErrorCode": "WORKFLOW_RECURSIVECOUNTVARIABLE_DOESNT_SUPPORT_INPUT"
              }
            ],
            "fields": [
              "string",
              "string",
              "string",
              "string"
            ],
            "message": "string",
            "statusCode": "SALESFORCE_INBOX_TRANSPORT_TOKEN_ERROR"
          },
          {
            "extendedErrorDetails": [
              {
                "extendedErrorCode": "LOOP_ASSIGNNEXTVALUETO_MISMATCHED_OBJECTTYPE"
              },
              {
                "extendedErrorCode": "FLOW_INTERVIEW_START_INTERVIEW"
              }
            ],
            "fields": [
              "string",
              "string",
              "string",
              "string",
              "string",
              "string"
            ],
            "message": "string",
            "statusCode": "INVALID_ACCESS_LEVEL"
          },
          {
            "extendedErrorDetails": [
              {
                "extendedErrorCode": "VARIABLE_FIELD_NOT_SUPPORTED_FOR_DATATYPE"
              },
              {
                "extendedErrorCode": "OBJECTTYPE_INVALID"
              },
              {
                "extendedErrorCode": "PROCESSTYPE_ELEMENT_NOT_SUPPORTED"
              },
              {
                "extendedErrorCode": "APEXCALLOUT_NOT_FOUND"
              },
              {
                "extendedErrorCode": "FIELDASSIGNMENT_PICKLISTFIELD_INCOMPATIBLE_DATATYPE"
              }
            ],
            "fields": [
              "string"
            ],
            "message": "string",
            "statusCode": "DATACLOUDADDRESS_SERVER_ERROR"
          },
          {
            "extendedErrorDetails": [
              {
                "extendedErrorCode": "ACTIONCALL_MISSING_REQUIRED_PARAM"
              },
              {
                "extendedErrorCode": "LOOP_ASSIGNNEXTVALUETO_REFERENCE_NOT_FOUND"
              },
              {
                "extendedErrorCode": "SETTING_FIELD_MAKES_OTHER_FIELD_REQUIRED"
              },
              {
                "extendedErrorCode": "SCREENFIELD_EXTENSION_INPUT_ATTRIBUTE_INVALID"
              },
              {
                "extendedErrorCode": "ASSIGNMENTITEM_INCOMPATIBLE_DATATYPES"
              },
              {
                "extendedErrorCode": "SCREENFIELD_EXTENSION_NAME_MISSING"
              },
              {
                "extendedErrorCode": "APEXCALLOUT_OUTPUT_INCOMPATIBLE_DATATYPE"
              },
              {
                "extendedErrorCode": "TRIGGER_TYPE_ELEMENT_NOT_SUPPORTED"
              }
            ],
            "fields": [
              "string",
              "string",
              "string"
            ],
            "message": "string",
            "statusCode": "UNAVAILABLE_RECORDTYPE_EXCEPTION"
          },
          {
            "extendedErrorDetails": [
              {
                "extendedErrorCode": "FIELDASSIGNMENT_REFERENCED_ELEMENT_MISSING_DATATYPE"
              },
              {
                "extendedErrorCode": "WAITEVENT_MISSING_CONNECTOR"
              },
              {
                "extendedErrorCode": "SURVEY_VARIABLE_ACCESS_INVALID"
              },
              {
                "extendedErrorCode": "SURVEY_VARIABLE_ACCESS_INVALID"
              },
              {
                "extendedErrorCode": "SOBJECT_ELEMENT_INCOMPATIBLE_DATATYPE"
              },
              {
                "extendedErrorCode": "OBJECT_ENCRYPTED_FIELDS_NOT_SUPPORTED"
              },
              {
                "extendedErrorCode": "AUTOLAUNCHED_CHOICELOOKUP_NOT_SUPPORTED"
              },
              {
                "extendedErrorCode": "EXTERNAL_OBJECT_FIELDS_NOT_SUPPORTED"
              }
            ],
            "fields": [
              "string",
              "string",
              "string",
              "string",
              "string",
              "string",
              "string",
              "string",
              "string",
              "string"
            ],
            "message": "string",
            "statusCode": "INTERNAL_ERROR"
          }
        ],
        "success": true
      },
      {
        "errors": [
          {
            "extendedErrorDetails": [
              {
                "extendedErrorCode": "ASSIGNMENTITEM_INVALID_DATATYPE_IN_ELEMENT"
              },
              {
                "extendedErrorCode": "SCREENFIELD_VALIDATIONRULE_NOT_SUPPORTED"
              }
            ],
            "fields": [
              "string",
              "string",
              "string",
              "string"
            ],
            "message": "string",
            "statusCode": "PAL_INVALID_ASSISTANT_RECOMMENDATION_TYPE_ID"
          },
          {
            "extendedErrorDetails": [
              {
                "extendedErrorCode": "SCREENRULE_FIELD_NOT_FOUND_ON_SCREEN"
              },
              {
                "extendedErrorCode": "CONDITION_LOGIC_EXCEEDS_LIMIT"
              },
              {
                "extendedErrorCode": "OBJECT_CANNOT_BE_UPDATED"
              },
              {
                "extendedErrorCode": "SCREENFIELD_EXTENSION_REQUIRED_INPUT_MISSING"
              },
              {
                "extendedErrorCode": "SCREENFIELD_OUTPUTS_NOT_SUPPORTED"
              },
              {
                "extendedErrorCode": "VARIABLE_SCALE_NEGATIVE_INTEGER"
              }
            ],
            "fields": [
              "string",
              "string"
            ],
            "message": "string",
            "statusCode": "INVALID_BATCH_OPERATION"
          },
          {
            "extendedErrorDetails": [
              {
                "extendedErrorCode": "RECORDFILTER_INVALID_REFERENCE"
              },
              {
                "extendedErrorCode": "INVALID_FLOW"
              },
              {
                "extendedErrorCode": "LOOP_MISSING_COLLECTION"
              },
              {
                "extendedErrorCode": "INCONSISTENT_VALUE_FOR_DYNAMIC_VALUE_FIELD"
              },
              {
                "extendedErrorCode": "WAITEVENT_RELATIVEALARM_INVALID_OFFSETUNIT"
              },
              {
                "extendedErrorCode": "INPUTPARAM_MISMATCHED_OBJECTTYPE"
              },
              {
                "extendedErrorCode": "SCREENRULE_ACTION_MISSING_VALUE"
              },
              {
                "extendedErrorCode": "LOOP_COLLECTION_NOT_SUPPORTED_FOR_FIELD"
              },
              {
                "extendedErrorCode": "FLEXIPAGE_COMPONENT_ATTRIBUTE_GENERIC_EXCEPTION"
              }
            ],
            "fields": [
              "string",
              "string",
              "string",
              "string",
              "string",
              "string",
              "string",
              "string",
              "string"
            ],
            "message": "string",
            "statusCode": "VF_COMPILE_ERROR"
          }
        ],
        "success": true
      },
      {
        "errors": [
          {
            "extendedErrorDetails": [
              {
                "extendedErrorCode": "LOOP_ASSIGNNEXTVALUETO_MISSING"
              },
              {
                "extendedErrorCode": "SCREENRULE_ACTION_INVALID_VALUE"
              },
              {
                "extendedErrorCode": "OBJECTTYPE_INVALID"
              },
              {
                "extendedErrorCode": "FLEXIPAGE_COMPONENT_RULE_VALIDATION_EXCEPTION"
              },
              {
                "extendedErrorCode": "VISIBILITY_RULE_NOT_SUPPORTED_FOR_PROCESSTYPE"
              },
              {
                "extendedErrorCode": "FLOW_INTERVIEW_BULK_EXECUTION"
              },
              {
                "extendedErrorCode": "CONSTANT_INCLUDES_REFERENCES"
              },
              {
                "extendedErrorCode": "PROCESSTYPE_NOT_SUPPORTED"
              }
            ],
            "fields": [
              "string",
              "string",
              "string",
              "string",
              "string",
              "string"
            ],
            "message": "string",
            "statusCode": "RETRIEVE_USER_CONFIG_ERROR"
          },
          {
            "extendedErrorDetails": [
              {
                "extendedErrorCode": "VALUE_CHAR_LIMIT_EXCEEDED"
              },
              {
                "extendedErrorCode": "FIELD_VALUE_REQUIRES_PERM"
              },
              {
                "extendedErrorCode": "FLOW_INTERVIEW_INPUT_VALIDATION"
              },
              {
                "extendedErrorCode": "SCREENRULE_ACTION_INVALID_ATTRIBUTE_FOR_API_VERSION"
              },
              {
                "extendedErrorCode": "RECORDLOOKUP_IDASSIGNMENT_VARIABLE_INCOMPATIBLE_DATATYPE"
              },
              {
                "extendedErrorCode": "CONDITION_OPERAND_DATATYPES_INCOMPATIBLE"
              },
              {
                "extendedErrorCode": "FLOW_STAGE_ORDER_OUT_OF_RANGE"
              }
            ],
            "fields": [
              "string"
            ],
            "message": "string",
            "statusCode": "SOCIAL_POST_NOT_FOUND"
          },
          {
            "extendedErrorDetails": [
              {
                "extendedErrorCode": "APEXCALLOUT_NOT_FOUND"
              },
              {
                "extendedErrorCode": "ACTIONCALL_DUPLICATE_OUTPUT_PARAM"
              },
              {
                "extendedErrorCode": "OUTPUTPARAM_ASSIGNTOREFERENCE_NOTFOUND"
              },
              {
                "extendedErrorCode": "TRIGGER_TYPE_INCOMPATIBLE_WITH_PROCESS_TYPE"
              },
              {
                "extendedErrorCode": "PROCESSTYPE_NOT_SUPPORTED"
              }
            ],
            "fields": [
              "string",
              "string",
              "string",
              "string",
              "string",
              "string"
            ],
            "message": "string",
            "statusCode": "INVALID_ASSIGNEE_TYPE"
          },
          {
            "extendedErrorDetails": [
              {
                "extendedErrorCode": "PROCESSTYPE_ELEMENT_NOT_SUPPORTED"
              },
              {
                "extendedErrorCode": "SETTING_FIELD_MAKES_OTHER_FIELD_UNSUPPORTED"
              },
              {
                "extendedErrorCode": "TYPE_MAPPING_NOT_SUPPORTED_FOR_PROCESS_TYPE"
              }
            ],
            "fields": [
              "string",
              "string"
            ],
            "message": "string",
            "statusCode": "DATAASSESSMENT_CONFIG_ASSESSMENT_IN_PROGRESS_ERROR"
          },
          {
            "extendedErrorDetails": [
              {
                "extendedErrorCode": "FLOW_INTERVIEW_INVALID_CHOICE_USER_INPUT"
              },
              {
                "extendedErrorCode": "FLOW_INTERVIEW_SET_CHOICE_SELECTED"
              },
              {
                "extendedErrorCode": "CUSTOMEVENTS_NOT_ENABLED"
              },
              {
                "extendedErrorCode": "VARIABLE_FIELD_NOT_SUPPORTED_FOR_DATATYPE_AND_COLLECTION"
              },
              {
                "extendedErrorCode": "FLOW_INTERVIEW_START_INTERVIEW"
              },
              {
                "extendedErrorCode": "SURVEY_CHOICE_REFERENCED_BY_MULTIPLE_QUESTIONS"
              }
            ],
            "fields": [
              "string",
              "string"
            ],
            "message": "string",
            "statusCode": "INVALID_OWNER"
          },
          {
            "extendedErrorDetails": [
              {
                "extendedErrorCode": "ACTIONCALL_MISSING_NAME"
              },
              {
                "extendedErrorCode": "ACTIONCALL_DUPLICATE_OUTPUT_PARAM"
              },
              {
                "extendedErrorCode": "INPUTPARAM_INCOMPATIBLE_WITH_COLLECTION_VARIABLE"
              },
              {
                "extendedErrorCode": "VISIBILITY_RULE_NOT_SUPPORTED_FOR_PROCESSTYPE"
              },
              {
                "extendedErrorCode": "ASSIGNMENTITEM_MODIFIES_NONVARIABLE"
              },
              {
                "extendedErrorCode": "FORMULA_EXPRESSION_INVALID"
              },
              {
                "extendedErrorCode": "CHOICE_DATATYPE_INCOMPATIBLE_WITH_CHOICEFIELD"
              },
              {
                "extendedErrorCode": "LOOP_ASSIGNNEXTVALUETO_MISSING"
              },
              {
                "extendedErrorCode": "FLEXIPAGE_COMPONENT_ATTRIBUTE_MISSING_REQUIRED"
              },
              {
                "extendedErrorCode": "CHOICEFIELD_MISSING_CHOICE"
              }
            ],
            "fields": [
              "string",
              "string",
              "string",
              "string",
              "string",
              "string",
              "string",
              "string",
              "string",
              "string"
            ],
            "message": "string",
            "statusCode": "INVALID_DATASET_REFERENCE_INPUT"
          },
          {
            "extendedErrorDetails": [
              {
                "extendedErrorCode": "AUTOLAUNCHED_CHOICELOOKUP_NOT_SUPPORTED"
              },
              {
                "extendedErrorCode": "INCONSISTENT_DYNAMIC_TYPE_MAPPING"
              },
              {
                "extendedErrorCode": "ASSIGNMENTITEM_MODIFIES_NONVARIABLE"
              },
              {
                "extendedErrorCode": "SCREENFIELD_API_VERSION_NOT_SUPPORTED"
              },
              {
                "extendedErrorCode": "SUBFLOW_INPUT_ELEMENT_INCOMPATIBLE_DATATYPES"
              },
              {
                "extendedErrorCode": "ASSIGNMENTITEM_INVALID_DATATYPE_IN_ELEMENT"
              },
              {
                "extendedErrorCode": "ELEMENT_MISSING_REFERENCE"
              },
              {
                "extendedErrorCode": "NON_EXPOSED_COMPONENT_IN_FLOW"
              }
            ],
            "fields": [
              "string",
              "string",
              "string",
              "string",
              "string"
            ],
            "message": "string",
            "statusCode": "ENTITY_IS_DELETED"
          },
          {
            "extendedErrorDetails": [
              {
                "extendedErrorCode": "ACTIONCALL_NOT_FOUND_WITH_NAME_AND_TYPE"
              },
              {
                "extendedErrorCode": "OUTPUTPARAM_MISMATCHED_WITH_COLLECTION_VARIABLE"
              },
              {
                "extendedErrorCode": "FIELDASSIGNMENT_REFERENCED_ELEMENT_MISSING_DATATYPE"
              },
              {
                "extendedErrorCode": "SPECIFIC_FIELD_VALUE_MAKES_OTHER_FIELD_REQUIRED"
              },
              {
                "extendedErrorCode": "INCONSISTENT_VALUE_FOR_DYNAMIC_VALUE_FIELD"
              },
              {
                "extendedErrorCode": "AUTOLAUNCHED_SUBFLOW_INCOMPATIBLE_FLOWTYPE"
              },
              {
                "extendedErrorCode": "SUBFLOW_INPUT_REFERENCES_FIELD_ON_SOBJECT_VARIABLE"
              },
              {
                "extendedErrorCode": "SUBFLOW_INPUT_MISSING_NAME"
              },
              {
                "extendedErrorCode": "TYPE_MAPPING_NOT_SUPPORTED_FOR_API_VERSION"
              },
              {
                "extendedErrorCode": "SUBFLOW_OUTPUT_MISMATCHED_OBJECTS"
              }
            ],
            "fields": [
              "string",
              "string"
            ],
            "message": "string",
            "statusCode": "MAXIMUM_SIZE_OF_DOCUMENT"
          },
          {
            "extendedErrorDetails": [
              {
                "extendedErrorCode": "SCREENFIELD_INPUTS_NOT_SUPPORTED"
              },
              {
                "extendedErrorCode": "FIELD_VALUE_REQUIRES_PERM"
              },
              {
                "extendedErrorCode": "FLOW_INTERVIEW_INVALID_CHOICE_USER_INPUT"
              },
              {
                "extendedErrorCode": "APEXCALLOUT_NOT_FOUND"
              },
              {
                "extendedErrorCode": "ASSIGNMENTITEM_INVALID_ASSIGNTOREFERENCE"
              },
              {
                "extendedErrorCode": "ACTIONCALL_NOT_FOUND_WITH_NAME_AND_TYPE"
              }
            ],
            "fields": [
              "string"
            ],
            "message": "string",
            "statusCode": "PROCESSING_HALTED"
          }
        ],
        "success": false
      },
      {
        "errors": [
          {
            "extendedErrorDetails": [
              {
                "extendedErrorCode": "FORMULA_EXPRESSION_INVALID"
              },
              {
                "extendedErrorCode": "FIELDASSIGNMENT_INVALID_ELEMENT"
              },
              {
                "extendedErrorCode": "WAITEVENT_DEFAULT_CONNECTOR_MISSING_LABEL"
              },
              {
                "extendedErrorCode": "ELEMENT_MORE_THAN_ONE_FIELD"
              },
              {
                "extendedErrorCode": "ASSIGNMENTITEM_INCOMPATIBLE_DATATYPES"
              }
            ],
            "fields": [
              "string",
              "string",
              "string",
              "string",
              "string",
              "string"
            ],
            "message": "string",
            "statusCode": "PA_URI_SYNTAX_EXCEPTION"
          },
          {
            "extendedErrorDetails": [
              {
                "extendedErrorCode": "FLOW_INVALID_NAME"
              },
              {
                "extendedErrorCode": "LOOP_COLLECTION_NOT_FOUND"
              }
            ],
            "fields": [
              "string",
              "string",
              "string",
              "string"
            ],
            "message": "string",
            "statusCode": "INVALID_EXTENSION_ID"
          },
          {
            "extendedErrorDetails": [
              {
                "extendedErrorCode": "FLEXIPAGE_COMPONENT_CUSTOM_VALIDATION_EXCEPTION"
              },
              {
                "extendedErrorCode": "RECORDFILTER_MULTIPLE_QUERIES_SAME_FIELD"
              },
              {
                "extendedErrorCode": "PROCESSTYPE_NOT_SUPPORTED"
              },
              {
                "extendedErrorCode": "ASSIGNMENTITEM_ELEMENT_MISSING_DATATYPE"
              },
              {
                "extendedErrorCode": "PROCESSTYPE_ELEMENT_NOT_SUPPORTED"
              }
            ],
            "fields": [
              "string",
              "string",
              "string",
              "string",
              "string",
              "string"
            ],
            "message": "string",
            "statusCode": "REQUIRE_RUNAS_USER"
          },
          {
            "extendedErrorDetails": [
              {
                "extendedErrorCode": "SCREEN_MISSING_LABEL"
              },
              {
                "extendedErrorCode": "INVALID_SURVEY_VARIABLE_NAME_OR_TYPE"
              },
              {
                "extendedErrorCode": "FLOW_INTERVIEW_INVALID_START_REQUEST"
              }
            ],
            "fields": [
              "string",
              "string",
              "string",
              "string",
              "string",
              "string",
              "string",
              "string"
            ],
            "message": "string",
            "statusCode": "MAX_ACTIVE_RULES_EXCEEDED"
          },
          {
            "extendedErrorDetails": [
              {
                "extendedErrorCode": "APEXCALLOUT_INVALID"
              },
              {
                "extendedErrorCode": "LOOP_MISSING_COLLECTION"
              },
              {
                "extendedErrorCode": "FLOW_INTERVIEW_INTERACTION_NOT_FOUND"
              },
              {
                "extendedErrorCode": "PARAM_DATATYPE_NOT_SUPPORTED"
              },
              {
                "extendedErrorCode": "FLEXIPAGE_COMPONENT_MAX_LIMIT_EXCEPTION"
              },
              {
                "extendedErrorCode": "SCREENCOMPONENT_CONTAINS_VISIBILITY_RULE"
              },
              {
                "extendedErrorCode": "SPECIFIC_FIELD_VALUE_MAKES_OTHER_FIELD_REQUIRED"
              },
              {
                "extendedErrorCode": "OBJECT_CANNOT_BE_DELETED"
              }
            ],
            "fields": [
              "string",
              "string",
              "string",
              "string",
              "string"
            ],
            "message": "string",
            "statusCode": "MAX_APPROVAL_STEPS_EXCEEDED"
          },
          {
            "extendedErrorDetails": [
              {
                "extendedErrorCode": "AUTOLAUNCHED_CHOICELOOKUP_NOT_SUPPORTED"
              },
              {
                "extendedErrorCode": "SCREENRULE_ACTION_MISSING_FIELDREFERENCE"
              },
              {
                "extendedErrorCode": "LOOP_ASSIGNNEXTVALUETO_MISMATCHED_DATATYPE"
              },
              {
                "extendedErrorCode": "SUBFLOW_DIFFERENT_RUNMODE"
              },
              {
                "extendedErrorCode": "AUTOLAUNCHED_SUBFLOW_INCOMPATIBLE_FLOWTYPE"
              },
              {
                "extendedErrorCode": "VARIABLE_SCALE_NEGATIVE_INTEGER"
              },
              {
                "extendedErrorCode": "PROCESSMETADATAVALUES_NOT_SUPPORTED_FOR_PROCESSTYPE"
              }
            ],
            "fields": [
              "string",
              "string",
              "string",
              "string",
              "string",
              "string",
              "string",
              "string",
              "string"
            ],
            "message": "string",
            "statusCode": "EMAIL_EXTERNAL_TRANSPORT_PERMISSION_ERROR"
          },
          {
            "extendedErrorDetails": [
              {
                "extendedErrorCode": "FLOW_INTERVIEW_MISSING_CHOICE_FOR_REQUIRED_CHOICE_FIELD"
              },
              {
                "extendedErrorCode": "LOOP_COLLECTION_ELEMENT_NOT_FOUND"
              },
              {
                "extendedErrorCode": "SCREENFIELD_INVALID_DATATYPE"
              },
              {
                "extendedErrorCode": "OUTPUTPARAM_MISTMATCHED_WITH_NONCOLLECTION_VARIABLE"
              }
            ],
            "fields": [
              "string",
              "string",
              "string"
            ],
            "message": "string",
            "statusCode": "MAXIMUM_CCEMAILS_EXCEEDED"
          }
        ],
        "success": true
      }
    ]
  }
}