{
  "actions": [
    {
      "name": "postChangeOwnPassword",
      "protocol": "REST",
      "method": "POST",
      "entitypath": "{base_path}/{version}/changeOwnPassword?{query}",
      "requestSchema": "schema.json",
      "responseSchema": "schema.json",
      "timeout": 0,
      "sendEmpty": false,
      "requestDatatype": "JSON",
      "responseDatatype": "JSON",
      "headers": {},
      "responseObjects": [
        {
          "type": "default",
          "key": "",
          "mockFile": "mockdatafiles/postChangeOwnPassword-default.json"
        }
      ]
    },
    {
      "name": "postDescribeSoqlListViews",
      "protocol": "REST",
      "method": "POST",
      "entitypath": "{base_path}/{version}/describeSoqlListViews?{query}",
      "requestSchema": "schema.json",
      "responseSchema": "schema.json",
      "timeout": 0,
      "sendEmpty": false,
      "requestDatatype": "JSON",
      "responseDatatype": "JSON",
      "headers": {},
      "responseObjects": [
        {
          "type": "default",
          "key": "",
          "mockFile": "mockdatafiles/postDescribeSoqlListViews-default.json"
        }
      ]
    },
    {
      "name": "postGetUserInfo",
      "protocol": "REST",
      "method": "POST",
      "entitypath": "{base_path}/{version}/getUserInfo?{query}",
      "requestSchema": "schema.json",
      "responseSchema": "schema.json",
      "timeout": 0,
      "sendEmpty": false,
      "requestDatatype": "JSON",
      "responseDatatype": "JSON",
      "headers": {},
      "responseObjects": [
        {
          "type": "default",
          "key": "",
          "mockFile": "mockdatafiles/postGetUserInfo-default.json"
        }
      ]
    },
    {
      "name": "postSetPassword",
      "protocol": "REST",
      "method": "POST",
      "entitypath": "{base_path}/{version}/setPassword?{query}",
      "requestSchema": "schema.json",
      "responseSchema": "schema.json",
      "timeout": 0,
      "sendEmpty": false,
      "requestDatatype": "JSON",
      "responseDatatype": "JSON",
      "headers": {},
      "responseObjects": [
        {
          "type": "default",
          "key": "",
          "mockFile": "mockdatafiles/postSetPassword-default.json"
        }
      ]
    }
  ]
}