{
  "getUserInfoResponse": {
    "result": {
      "accessibilityMode": true,
      "chatterExternal": false,
      "currencySymbol": "string",
      "orgAttachmentFileSizeLimit": 4,
      "orgDefaultCurrencyIsoCode": "string",
      "orgDefaultCurrencyLocale": "string",
      "orgDisallowHtmlAttachments": false,
      "orgHasPersonAccounts": true,
      "organizationId": "string",
      "organizationMultiCurrency": true,
      "organizationName": "string",
      "profileId": "string",
      "roleId": "string",
      "sessionSecondsValid": 1,
      "userDefaultCurrencyIsoCode": "string",
      "userEmail": "string",
      "userFullName": "string",
      "userId": "string",
      "userLanguage": "string",
      "userLocale": "string",
      "userName": "string",
      "userTimeZone": "string",
      "userType": "string",
      "userUiSkin": "string"
    }
  }
}