{
  "queryMoreResponse": {
    "result": {
      "done": true,
      "entityTypeName": "string",
      "nextRecordsUrl": "string",
      "queryLocator": "string",
      "records": [
        {
          "fieldsToNull": [
            "string",
            "string",
            "string",
            "string"
          ],
          "Id": "string"
        },
        {
          "fieldsToNull": [
            "string",
            "string",
            "string",
            "string",
            "string",
            "string",
            "string",
            "string"
          ],
          "Id": "string"
        }
      ],
      "size": 9,
      "totalSize": 4
    }
  }
}