{
  "deleteResponse": {
    "result": [
      {
        "errors": [
          {
            "extendedErrorDetails": [
              {
                "extendedErrorCode": "WAITEVENT_RELATIVEALARM_INVALID_FIELD"
              }
            ],
            "fields": [
              "string",
              "string",
              "string",
              "string",
              "string",
              "string",
              "string"
            ],
            "message": "string",
            "statusCode": "CANNOT_FREEZE_SELF"
          },
          {
            "extendedErrorDetails": [
              {
                "extendedErrorCode": "LOOP_ASSIGNNEXTVALUETO_MISMATCHED_OBJECTTYPE"
              },
              {
                "extendedErrorCode": "FLEXIPAGE_COMPONENT_ATTRIBUTE_TOO_LONG"
              },
              {
                "extendedErrorCode": "FLOW_INTERVIEW_RESUME_INTERVIEW"
              },
              {
                "extendedErrorCode": "SCREEN_PAUSEDTEXT_NOT_SHOWN_WHEN_ALLOWPAUSE_IS_FALSE"
              },
              {
                "extendedErrorCode": "SUBFLOW_INPUT_MULTIPLE_ASSIGNMENTS_TO_ONE_VARIABLE"
              }
            ],
            "fields": [
              "string",
              "string",
              "string",
              "string",
              "string",
              "string",
              "string"
            ],
            "message": "string",
            "statusCode": "CANNOT_DELETE_LAST_DATED_CONVERSION_RATE"
          },
          {
            "extendedErrorDetails": [
              {
                "extendedErrorCode": "FLEXIPAGE_COMPONENT_ATTRIBUTE_GENERIC_EXCEPTION"
              },
              {
                "extendedErrorCode": "SCREENRULE_SCREENFIELD_NOT_VISIBLE"
              },
              {
                "extendedErrorCode": "ELEMENT_MISSING_NAME"
              },
              {
                "extendedErrorCode": "FLOW_STAGE_ORDER_DUPLICATE"
              },
              {
                "extendedErrorCode": "SCREENFIELD_BOOLEAN_ISREQUIRED_IS_FALSE"
              },
              {
                "extendedErrorCode": "SUBFLOW_OUTPUT_VARIABLE_NOT_FOUND_IN_REFERENCEDFLOW"
              }
            ],
            "fields": [
              "string",
              "string",
              "string",
              "string",
              "string",
              "string",
              "string",
              "string",
              "string"
            ],
            "message": "string",
            "statusCode": "INVALID_PACKAGE_LICENSE"
          },
          {
            "extendedErrorDetails": [
              {
                "extendedErrorCode": "CONDITION_OPERAND_DATATYPES_INCOMPATIBLE"
              },
              {
                "extendedErrorCode": "CONDITION_LOGIC_INVALID"
              },
              {
                "extendedErrorCode": "RULE_MISSING_CONDITION"
              },
              {
                "extendedErrorCode": "SCREENFIELD_EXTENSION_IMPLEMENTATION_INVALID"
              },
              {
                "extendedErrorCode": "SORT_GEOLOCATION_FIELDS_NOT_SUPPORTED"
              },
              {
                "extendedErrorCode": "SCREENFIELD_MULTISELECTCHOICE_SEMICOLON_NOT_SUPPORTED"
              }
            ],
            "fields": [
              "string",
              "string",
              "string",
              "string",
              "string",
              "string",
              "string",
              "string"
            ],
            "message": "string",
            "statusCode": "CUSTOM_METADATA_REL_FIELD_MANAGEABILITY"
          }
        ],
        "id": "string",
        "success": false
      },
      {
        "errors": [
          {
            "extendedErrorDetails": [
              {
                "extendedErrorCode": "AUTOLAUNCHED_SUBFLOW_INCOMPATIBLE_FLOWTYPE"
              },
              {
                "extendedErrorCode": "CONDITION_OPERAND_DATATYPES_INCOMPATIBLE"
              },
              {
                "extendedErrorCode": "FLOW_REFERENCES_APEX_CLASS_NOT_IN_SAME_PACKAGE"
              },
              {
                "extendedErrorCode": "VARIABLE_FIELD_REQUIRED_FOR_DATATYPE"
              },
              {
                "extendedErrorCode": "SURVEY_START_ELEMENT_INVALID"
              },
              {
                "extendedErrorCode": "FLEXIPAGE_COMPONENT_ATTRIBUTE_MISSING_REQUIRED"
              },
              {
                "extendedErrorCode": "FLEXIPAGE_COMPONENT_ATTRIBUTE_TOO_LONG"
              },
              {
                "extendedErrorCode": "ASSIGNMENTITEM_INVALID_MERGE_FIELD"
              },
              {
                "extendedErrorCode": "WORKFLOW_TRIGGERTYPE_INVALID_VALUE"
              }
            ],
            "fields": [
              "string"
            ],
            "message": "string",
            "statusCode": "PA_AXIS_FAULT"
          },
          {
            "extendedErrorDetails": [
              {
                "extendedErrorCode": "ASSIGNMENTITEM_INVALID_VALUE"
              },
              {
                "extendedErrorCode": "OUTPUTPARAM_MISMATCHED_WITH_COLLECTION_VARIABLE"
              },
              {
                "extendedErrorCode": "INPUTPARAM_INCOMPATIBLE_WITH_COLLECTION_VARIABLE"
              },
              {
                "extendedErrorCode": "SCREENRULE_ATTRIBUTE_NOT_SUPPORTED_FOR_SCREENFIELD"
              },
              {
                "extendedErrorCode": "FIELD_NOT_FOUND"
              },
              {
                "extendedErrorCode": "SUBFLOW_INPUT_INVALID_VALUE"
              },
              {
                "extendedErrorCode": "FLEXIPAGE_COMPONENT_ATTRIBUTE_EXPRESSION_EXCEPTION"
              },
              {
                "extendedErrorCode": "CONDITION_LOGIC_INVALID"
              },
              {
                "extendedErrorCode": "SURVEY_CHOICE_REFERENCED_BY_MULTIPLE_QUESTIONS"
              }
            ],
            "fields": [
              "string",
              "string",
              "string",
              "string",
              "string",
              "string",
              "string",
              "string",
              "string",
              "string"
            ],
            "message": "string",
            "statusCode": "INVALID_INPUT"
          },
          {
            "extendedErrorDetails": [
              {
                "extendedErrorCode": "ASSIGNMENTITEM_INCOMPATIBLE_DATATYPES"
              },
              {
                "extendedErrorCode": "WORKFLOW_MISSING_PROCESSMETADATAVALUES"
              }
            ],
            "fields": [
              "string",
              "string",
              "string",
              "string",
              "string",
              "string",
              "string",
              "string",
              "string",
              "string"
            ],
            "message": "string",
            "statusCode": "MIXED_DML_OPERATION"
          },
          {
            "extendedErrorDetails": [
              {
                "extendedErrorCode": "CUSTOMEVENT_OBJECTTYPE_NOT_FOUND"
              },
              {
                "extendedErrorCode": "SCREENFIELD_EXTENSION_INPUT_ATTRIBUTE_INVALID"
              },
              {
                "extendedErrorCode": "DATA_TYPE_NOT_SUPPORTED_FOR_PROCESSTYPE"
              },
              {
                "extendedErrorCode": "SCREENFIELD_TYPE_NOT_SUPPORTED"
              },
              {
                "extendedErrorCode": "VISIBILITY_RULE_NO_CONDITIONS"
              },
              {
                "extendedErrorCode": "FORMULA_CMT_LIMIT_EXCEEDED"
              },
              {
                "extendedErrorCode": "SOBJECT_ELEMENT_MISMATCHED_OBJECTTYPE"
              },
              {
                "extendedErrorCode": "WORKFLOW_PROCESS_METADATAVALUES_MISSING_NAME"
              }
            ],
            "fields": [
              "string"
            ],
            "message": "string",
            "statusCode": "WEBLINK_URL_INVALID"
          },
          {
            "extendedErrorDetails": [
              {
                "extendedErrorCode": "SURVEY_SCREENFIELD_TYPE_NOT_SUPPORTED_FOR_QUESTION"
              }
            ],
            "fields": [
              "string",
              "string",
              "string",
              "string",
              "string",
              "string",
              "string",
              "string"
            ],
            "message": "string",
            "statusCode": "ORDER_MANAGEMENT_RECORD_EXISTS"
          }
        ],
        "id": "string",
        "success": true
      },
      {
        "errors": [
          {
            "extendedErrorDetails": [
              {
                "extendedErrorCode": "TRIGGER_TYPE_INCOMPATIBLE_WITH_PROCESS_TYPE"
              },
              {
                "extendedErrorCode": "CONDITION_REFERENCED_ELEMENT_NOT_FOUND"
              },
              {
                "extendedErrorCode": "EX_AUTOLAUNCHED_SUBFLOW_INCOMPATIBLE_FLOWTYPE"
              },
              {
                "extendedErrorCode": "SUBFLOW_DIFFERENT_RUNMODE"
              },
              {
                "extendedErrorCode": "ELEMENT_NEVER_USED"
              },
              {
                "extendedErrorCode": "FIELDASSIGNMENT_INVALID_DATATYPE"
              },
              {
                "extendedErrorCode": "CONNECTOR_MISSING_TARGET"
              },
              {
                "extendedErrorCode": "SUBFLOW_OUTPUT_REFERENCES_FIELD_ON_SOBJECT_VARIABLE"
              }
            ],
            "fields": [
              "string",
              "string",
              "string",
              "string",
              "string",
              "string",
              "string",
              "string"
            ],
            "message": "string",
            "statusCode": "INVALID_CURRENCY_CORP_RATE"
          },
          {
            "extendedErrorDetails": [
              {
                "extendedErrorCode": "SUBFLOW_INPUT_INVALID_VALUE"
              },
              {
                "extendedErrorCode": "WORKFLOW_OBJECTTYPE_NOT_FOUND"
              },
              {
                "extendedErrorCode": "SCREENFIELD_TYPE_NOT_SUPPORTED"
              },
              {
                "extendedErrorCode": "DECISION_DEFAULT_CONNECTOR_MISSING_LABEL"
              },
              {
                "extendedErrorCode": "RECORDFILTER_NON_PRIMITIVE"
              },
              {
                "extendedErrorCode": "ACTIONCALL_MISSING_REQUIRED_TYPE"
              },
              {
                "extendedErrorCode": "APEXCALLOUT_NOT_FOUND"
              },
              {
                "extendedErrorCode": "SUBFLOW_OUTPUT_VARIABLE_NOT_FOUND_IN_REFERENCEDFLOW"
              },
              {
                "extendedErrorCode": "SUBFLOW_NO_ACTIVE_VERSION"
              }
            ],
            "fields": [
              "string",
              "string",
              "string",
              "string",
              "string",
              "string",
              "string"
            ],
            "message": "string",
            "statusCode": "FILE_SIZE_LIMIT_EXCEEDED"
          },
          {
            "extendedErrorDetails": [
              {
                "extendedErrorCode": "SURVEY_VARIABLE_ACCESS_INVALID"
              }
            ],
            "fields": [
              "string",
              "string",
              "string",
              "string",
              "string",
              "string",
              "string"
            ],
            "message": "string",
            "statusCode": "TOO_MANY_ENUM_VALUE"
          }
        ],
        "id": "string",
        "success": false
      },
      {
        "errors": [
          {
            "extendedErrorDetails": [
              {
                "extendedErrorCode": "SUBFLOW_OUTPUT_REFERENCES_FIELD_ON_SOBJECT_VARIABLE"
              },
              {
                "extendedErrorCode": "SCREENFIELD_API_VERSION_NOT_SUPPORTED"
              },
              {
                "extendedErrorCode": "CONDITION_BUILDER_MISSING_FLOW_VARIABLE"
              },
              {
                "extendedErrorCode": "FLOW_STAGE_ORDER_OUT_OF_RANGE"
              }
            ],
            "fields": [
              "string",
              "string",
              "string",
              "string",
              "string",
              "string"
            ],
            "message": "string",
            "statusCode": "STORAGE_LIMIT_EXCEEDED"
          },
          {
            "extendedErrorDetails": [
              {
                "extendedErrorCode": "ASSIGNMENTITEM_INVALID_OPERATOR"
              },
              {
                "extendedErrorCode": "OBJECT_NOT_FOUND"
              }
            ],
            "fields": [
              "string",
              "string",
              "string"
            ],
            "message": "string",
            "statusCode": "RECORD_IN_USE_BY_WORKFLOW"
          },
          {
            "extendedErrorDetails": [
              {
                "extendedErrorCode": "FLOW_INTERVIEW_MISSING_CHOICE_FOR_REQUIRED_CHOICE_FIELD"
              },
              {
                "extendedErrorCode": "SCREENRULE_FIELD_NOT_FOUND_ON_SCREEN"
              },
              {
                "extendedErrorCode": "SCREEN_MISSING_LABEL"
              },
              {
                "extendedErrorCode": "SUBFLOW_OUTPUT_MISSING_ASSIGNTOREFERENCE"
              },
              {
                "extendedErrorCode": "SUBFLOW_INPUT_MULTIPLE_ASSIGNMENTS_TO_ONE_VARIABLE"
              },
              {
                "extendedErrorCode": "SCREENFIELD_INPUTS_NOT_SUPPORTED"
              },
              {
                "extendedErrorCode": "WAITEVENT_RELATIVEALARM_INVALID_OFFSETNUMBER"
              },
              {
                "extendedErrorCode": "CONDITION_BUILDER_UNSUPPORTED_FLOW_VARIABLE"
              },
              {
                "extendedErrorCode": "FLOW_SCHEDULE_INFORMATION_INCOMPLETE"
              },
              {
                "extendedErrorCode": "CUSTOMEVENT_OBJECTTYPE_NOT_FOUND"
              }
            ],
            "fields": [
              "string",
              "string"
            ],
            "message": "string",
            "statusCode": "INVALID_OR_NULL_FOR_RESTRICTED_PICKLIST"
          }
        ],
        "id": "string",
        "success": true
      }
    ]
  }
}