{
  "name": "adapter-salesforce_tooling",
  "webName": "Adapter for Integration to Salesforce Tooling",
  "supportLevel": "community",
  "vendor": "Salesforce",
  "product": "Tooling",
  "techAlliance": false,
  "osVersions": [],
  "apiVersions": [
    "1.0"
  ],
  "iapVersions": [
    "2021.1.x",
    "2021.2.x",
    "2022.1.x",
    "2023.1.x"
  ],
  "method": "REST",
  "type": "Adapter",
  "domains": [
    "ITSM (Service Management)"
  ],
  "tags": [
    "Notifications & Ticket Management"
  ],
  "useCases": [
    "Create & Update Change Request",
    "Create & Update Incident Ticket",
    "Update Change Request state",
    "Create Issue"
  ],
  "deprecated": {
    "isDeprecated": false
  },
  "brokerSince": "",
  "authMethods": [
    {
      "type": "OAuth",
      "primary": true
    }
  ],
  "documentation": {
    "storeLink": "",
    "npmLink": "https://www.npmjs.com/package/@itentialopensource/adapter-salesforce_tooling",
    "repoLink": "https://gitlab.com/itentialopensource/adapters/adapter-salesforce_tooling",
    "docLink": "https://gitlab.com/itentialopensource/adapters/adapter-salesforce_tooling/-/blob/master/README.md?ref_type=heads",
    "demoLinks": [],
    "trainingLinks": [
      {
        "title": "Itential Academy",
        "link": "https://www.itential.com/itential-academy/"
      }
    ],
    "faqLink": "https://docs.itential.com/opensource/docs/troubleshooting-an-adapter",
    "contributeLink": "https://gitlab.com/itentialopensource/adapters/contributing-guide",
    "issueLink": "https://itential.atlassian.net/servicedesk/customer/portals",
    "webLink": "https://www.itential.com/adapters/salesforce-tooling/",
    "vendorLink": "https://www.salesforce.com/",
    "productLink": "https://developer.salesforce.com/docs/atlas.en-us.api_tooling.meta/api_tooling/intro_api_tooling.htm",
    "apiLinks": [
      {
        "title": "Salesforce - Tooling API",
        "link": "https://developer.salesforce.com/docs/atlas.en-us.api_tooling.meta/api_tooling/intro_rest_resources.htm",
        "public": true
      }
    ],
    "workshopLinks": [],
    "workshopHomePage": "https://www.itential.com/get-started/"
  },
  "assets": [],
  "relatedItems": {
    "adapters": [],
    "integrations": [],
    "ecosystemApplications": [],
    "workflowProjects": [],
    "transformationProjects": [],
    "exampleProjects": []
  }
}