{
  "actions": [
    {
      "name": "postQuery",
      "protocol": "REST",
      "method": "POST",
      "entitypath": "{base_path}/{version}/query?{query}",
      "requestSchema": "schema.json",
      "responseSchema": "schema.json",
      "timeout": 0,
      "sendEmpty": false,
      "requestDatatype": "JSON",
      "responseDatatype": "JSON",
      "headers": {},
      "responseObjects": [
        {
          "type": "default",
          "key": "",
          "mockFile": "mockdatafiles/postQuery-default.json"
        }
      ]
    },
    {
      "name": "postQueryAll",
      "protocol": "REST",
      "method": "POST",
      "entitypath": "{base_path}/{version}/queryAll?{query}",
      "requestSchema": "schema.json",
      "responseSchema": "schema.json",
      "timeout": 0,
      "sendEmpty": false,
      "requestDatatype": "JSON",
      "responseDatatype": "JSON",
      "headers": {},
      "responseObjects": [
        {
          "type": "default",
          "key": "",
          "mockFile": "mockdatafiles/postQueryAll-default.json"
        }
      ]
    },
    {
      "name": "postQueryMore",
      "protocol": "REST",
      "method": "POST",
      "entitypath": "{base_path}/{version}/queryMore?{query}",
      "requestSchema": "schema.json",
      "responseSchema": "schema.json",
      "timeout": 0,
      "sendEmpty": false,
      "requestDatatype": "JSON",
      "responseDatatype": "JSON",
      "headers": {},
      "responseObjects": [
        {
          "type": "default",
          "key": "",
          "mockFile": "mockdatafiles/postQueryMore-default.json"
        }
      ]
    }
  ]
}