{
  "name": "adapter-microsoft_office365",
  "webName": "Adapter for Integration to Microsoft Office 365",
  "supportLevel": "community",
  "vendor": "Microsoft",
  "product": "Office 365",
  "techAlliance": false,
  "osVersion": [],
  "apiVersions": [
    "v1.0"
  ],
  "iapVersions": [
    "2021.1.x",
    "2021.2.x",
    "2022.1.x",
    "2023.1.x"
  ],
  "method": "REST",
  "type": "Adapter",
  "domains": [
    "ITSM (Service Management)"
  ],
  "tags": [
    "Notifications & Ticket Management"
  ],
  "useCases": [
    "Create & Update Change Request",
    "Create & Update Incident Ticket",
    "Update Change Request state",
    "Create Issue"
  ],
  "deprecated": {
    "isDeprecated": false
  },
  "brokerSince": "",
  "authMethods": [
    {
      "type": "OAuth",
      "primary": true
    }
  ],
  "documentation": {
    "storeLink": "",
    "npmLink": "https://www.npmjs.com/package/@itentialopensource/adapter-microsoft_office365",
    "repoLink": "https://gitlab.com/itentialopensource/adapters/adapter-microsoft_office365",
    "docLink": "https://gitlab.com/itentialopensource/adapters/adapter-microsoft_office365/-/blob/master/README.md?ref_type=heads",
    "demoLinks": [],
    "trainingLinks": [
      {
        "title": "Itential Academy",
        "link": "https://www.itential.com/itential-academy/"
      }
    ],
    "faqLink": "https://docs.itential.com/opensource/docs/troubleshooting-an-adapter",
    "contributeLink": "https://gitlab.com/itentialopensource/adapters/contributing-guide",
    "issueLink": "https://itential.atlassian.net/servicedesk/customer/portals",
    "webLink": "https://www.itential.com/adapters/microsoft-office-365/",
    "vendorLink": "https://www.microsoft.com/en-us/",
    "productLink": "https://www.microsoft.com/en-us/microsoft-365",
    "apiLinks": [
      {
        "title": "Microsoft - Office 365 API",
        "link": "https://learn.microsoft.com/en-us/previous-versions/office/office-365-api/",
        "public": true
      }
    ],
    "workshopLinks": [],
    "workshopHomePage": "https://www.itential.com/get-started/"
  },
  "assets": [],
  "relatedItems": {
    "adapters": [],
    "integrations": [],
    "ecosystemApplications": [],
    "workflowProjects": [],
    "transformationProjects": [],
    "exampleProjects": []
  }
}