[
  {
    "id": 5,
    "name": "string",
    "face": {
      "label": "Front",
      "value": "front"
    },
    "device": {
      "id": 6,
      "url": "string",
      "name": "string",
      "display_name": "string"
    },
    "occupied": true
  },
  {
    "id": 3,
    "name": "string",
    "face": {
      "label": "Front",
      "value": "front"
    },
    "device": {
      "id": 9,
      "url": "string",
      "name": "string",
      "display_name": "string"
    },
    "occupied": false
  },
  {
    "id": 10,
    "name": "string",
    "face": {
      "label": "Rear",
      "value": "front"
    },
    "device": {
      "id": 9,
      "url": "string",
      "name": "string",
      "display_name": "string"
    },
    "occupied": false
  },
  {
    "id": 10,
    "name": "string",
    "face": {
      "label": "Front",
      "value": "rear"
    },
    "device": {
      "id": 7,
      "url": "string",
      "name": "string",
      "display_name": "string"
    },
    "occupied": true
  }
]