{
  "count": 7,
  "next": "string",
  "previous": "string",
  "results": [
    {
      "id": 7,
      "url": "string",
      "virtual_machine": {
        "id": 6,
        "url": "string",
        "name": "string"
      },
      "name": "string",
      "enabled": false,
      "mtu": 2,
      "mac_address": "string",
      "description": "string",
      "mode": {
        "label": "Tagged",
        "value": "tagged"
      },
      "untagged_vlan": {
        "id": 1,
        "url": "string",
        "vid": 2,
        "name": "string",
        "display_name": "string"
      },
      "tagged_vlans": [
        {
          "id": 4,
          "url": "string",
          "vid": 3,
          "name": "string",
          "display_name": "string"
        },
        {
          "id": 5,
          "url": "string",
          "vid": 10,
          "name": "string",
          "display_name": "string"
        },
        {
          "id": 3,
          "url": "string",
          "vid": 5,
          "name": "string",
          "display_name": "string"
        },
        {
          "id": 4,
          "url": "string",
          "vid": 5,
          "name": "string",
          "display_name": "string"
        },
        {
          "id": 10,
          "url": "string",
          "vid": 8,
          "name": "string",
          "display_name": "string"
        },
        {
          "id": 4,
          "url": "string",
          "vid": 3,
          "name": "string",
          "display_name": "string"
        },
        {
          "id": 3,
          "url": "string",
          "vid": 8,
          "name": "string",
          "display_name": "string"
        }
      ],
      "tags": [
        {
          "id": 10,
          "url": "string",
          "name": "string",
          "slug": "string",
          "color": "string"
        },
        {
          "id": 10,
          "url": "string",
          "name": "string",
          "slug": "string",
          "color": "string"
        },
        {
          "id": 7,
          "url": "string",
          "name": "string",
          "slug": "string",
          "color": "string"
        },
        {
          "id": 7,
          "url": "string",
          "name": "string",
          "slug": "string",
          "color": "string"
        },
        {
          "id": 2,
          "url": "string",
          "name": "string",
          "slug": "string",
          "color": "string"
        },
        {
          "id": 2,
          "url": "string",
          "name": "string",
          "slug": "string",
          "color": "string"
        }
      ]
    },
    {
      "id": 4,
      "url": "string",
      "virtual_machine": {
        "id": 6,
        "url": "string",
        "name": "string"
      },
      "name": "string",
      "enabled": false,
      "mtu": 2,
      "mac_address": "string",
      "description": "string",
      "mode": {
        "label": "Access",
        "value": "tagged"
      },
      "untagged_vlan": {
        "id": 3,
        "url": "string",
        "vid": 10,
        "name": "string",
        "display_name": "string"
      },
      "tagged_vlans": [
        {
          "id": 2,
          "url": "string",
          "vid": 2,
          "name": "string",
          "display_name": "string"
        },
        {
          "id": 10,
          "url": "string",
          "vid": 4,
          "name": "string",
          "display_name": "string"
        },
        {
          "id": 8,
          "url": "string",
          "vid": 9,
          "name": "string",
          "display_name": "string"
        },
        {
          "id": 7,
          "url": "string",
          "vid": 6,
          "name": "string",
          "display_name": "string"
        },
        {
          "id": 3,
          "url": "string",
          "vid": 7,
          "name": "string",
          "display_name": "string"
        }
      ],
      "tags": [
        {
          "id": 2,
          "url": "string",
          "name": "string",
          "slug": "string",
          "color": "string"
        },
        {
          "id": 3,
          "url": "string",
          "name": "string",
          "slug": "string",
          "color": "string"
        },
        {
          "id": 6,
          "url": "string",
          "name": "string",
          "slug": "string",
          "color": "string"
        },
        {
          "id": 8,
          "url": "string",
          "name": "string",
          "slug": "string",
          "color": "string"
        },
        {
          "id": 5,
          "url": "string",
          "name": "string",
          "slug": "string",
          "color": "string"
        }
      ]
    },
    {
      "id": 1,
      "url": "string",
      "virtual_machine": {
        "id": 9,
        "url": "string",
        "name": "string"
      },
      "name": "string",
      "enabled": false,
      "mtu": 5,
      "mac_address": "string",
      "description": "string",
      "mode": {
        "label": "Tagged (All)",
        "value": "access"
      },
      "untagged_vlan": {
        "id": 6,
        "url": "string",
        "vid": 1,
        "name": "string",
        "display_name": "string"
      },
      "tagged_vlans": [
        {
          "id": 7,
          "url": "string",
          "vid": 8,
          "name": "string",
          "display_name": "string"
        }
      ],
      "tags": [
        {
          "id": 7,
          "url": "string",
          "name": "string",
          "slug": "string",
          "color": "string"
        }
      ]
    },
    {
      "id": 2,
      "url": "string",
      "virtual_machine": {
        "id": 7,
        "url": "string",
        "name": "string"
      },
      "name": "string",
      "enabled": true,
      "mtu": 2,
      "mac_address": "string",
      "description": "string",
      "mode": {
        "label": "Tagged",
        "value": "access"
      },
      "untagged_vlan": {
        "id": 10,
        "url": "string",
        "vid": 3,
        "name": "string",
        "display_name": "string"
      },
      "tagged_vlans": [
        {
          "id": 7,
          "url": "string",
          "vid": 2,
          "name": "string",
          "display_name": "string"
        },
        {
          "id": 10,
          "url": "string",
          "vid": 5,
          "name": "string",
          "display_name": "string"
        },
        {
          "id": 6,
          "url": "string",
          "vid": 9,
          "name": "string",
          "display_name": "string"
        },
        {
          "id": 5,
          "url": "string",
          "vid": 6,
          "name": "string",
          "display_name": "string"
        }
      ],
      "tags": [
        {
          "id": 5,
          "url": "string",
          "name": "string",
          "slug": "string",
          "color": "string"
        },
        {
          "id": 9,
          "url": "string",
          "name": "string",
          "slug": "string",
          "color": "string"
        },
        {
          "id": 10,
          "url": "string",
          "name": "string",
          "slug": "string",
          "color": "string"
        },
        {
          "id": 2,
          "url": "string",
          "name": "string",
          "slug": "string",
          "color": "string"
        },
        {
          "id": 7,
          "url": "string",
          "name": "string",
          "slug": "string",
          "color": "string"
        },
        {
          "id": 8,
          "url": "string",
          "name": "string",
          "slug": "string",
          "color": "string"
        },
        {
          "id": 9,
          "url": "string",
          "name": "string",
          "slug": "string",
          "color": "string"
        },
        {
          "id": 9,
          "url": "string",
          "name": "string",
          "slug": "string",
          "color": "string"
        }
      ]
    },
    {
      "id": 7,
      "url": "string",
      "virtual_machine": {
        "id": 9,
        "url": "string",
        "name": "string"
      },
      "name": "string",
      "enabled": true,
      "mtu": 1,
      "mac_address": "string",
      "description": "string",
      "mode": {
        "label": "Tagged",
        "value": "access"
      },
      "untagged_vlan": {
        "id": 9,
        "url": "string",
        "vid": 2,
        "name": "string",
        "display_name": "string"
      },
      "tagged_vlans": [
        {
          "id": 7,
          "url": "string",
          "vid": 9,
          "name": "string",
          "display_name": "string"
        },
        {
          "id": 7,
          "url": "string",
          "vid": 8,
          "name": "string",
          "display_name": "string"
        },
        {
          "id": 7,
          "url": "string",
          "vid": 8,
          "name": "string",
          "display_name": "string"
        },
        {
          "id": 9,
          "url": "string",
          "vid": 3,
          "name": "string",
          "display_name": "string"
        },
        {
          "id": 2,
          "url": "string",
          "vid": 1,
          "name": "string",
          "display_name": "string"
        }
      ],
      "tags": [
        {
          "id": 8,
          "url": "string",
          "name": "string",
          "slug": "string",
          "color": "string"
        },
        {
          "id": 8,
          "url": "string",
          "name": "string",
          "slug": "string",
          "color": "string"
        },
        {
          "id": 2,
          "url": "string",
          "name": "string",
          "slug": "string",
          "color": "string"
        },
        {
          "id": 10,
          "url": "string",
          "name": "string",
          "slug": "string",
          "color": "string"
        },
        {
          "id": 10,
          "url": "string",
          "name": "string",
          "slug": "string",
          "color": "string"
        },
        {
          "id": 9,
          "url": "string",
          "name": "string",
          "slug": "string",
          "color": "string"
        },
        {
          "id": 6,
          "url": "string",
          "name": "string",
          "slug": "string",
          "color": "string"
        },
        {
          "id": 4,
          "url": "string",
          "name": "string",
          "slug": "string",
          "color": "string"
        }
      ]
    },
    {
      "id": 8,
      "url": "string",
      "virtual_machine": {
        "id": 6,
        "url": "string",
        "name": "string"
      },
      "name": "string",
      "enabled": false,
      "mtu": 9,
      "mac_address": "string",
      "description": "string",
      "mode": {
        "label": "Tagged",
        "value": "tagged-all"
      },
      "untagged_vlan": {
        "id": 6,
        "url": "string",
        "vid": 9,
        "name": "string",
        "display_name": "string"
      },
      "tagged_vlans": [
        {
          "id": 10,
          "url": "string",
          "vid": 6,
          "name": "string",
          "display_name": "string"
        },
        {
          "id": 4,
          "url": "string",
          "vid": 1,
          "name": "string",
          "display_name": "string"
        },
        {
          "id": 10,
          "url": "string",
          "vid": 8,
          "name": "string",
          "display_name": "string"
        }
      ],
      "tags": [
        {
          "id": 5,
          "url": "string",
          "name": "string",
          "slug": "string",
          "color": "string"
        },
        {
          "id": 7,
          "url": "string",
          "name": "string",
          "slug": "string",
          "color": "string"
        },
        {
          "id": 10,
          "url": "string",
          "name": "string",
          "slug": "string",
          "color": "string"
        },
        {
          "id": 5,
          "url": "string",
          "name": "string",
          "slug": "string",
          "color": "string"
        }
      ]
    },
    {
      "id": 6,
      "url": "string",
      "virtual_machine": {
        "id": 9,
        "url": "string",
        "name": "string"
      },
      "name": "string",
      "enabled": false,
      "mtu": 9,
      "mac_address": "string",
      "description": "string",
      "mode": {
        "label": "Tagged",
        "value": "access"
      },
      "untagged_vlan": {
        "id": 6,
        "url": "string",
        "vid": 6,
        "name": "string",
        "display_name": "string"
      },
      "tagged_vlans": [
        {
          "id": 10,
          "url": "string",
          "vid": 3,
          "name": "string",
          "display_name": "string"
        }
      ],
      "tags": [
        {
          "id": 2,
          "url": "string",
          "name": "string",
          "slug": "string",
          "color": "string"
        },
        {
          "id": 3,
          "url": "string",
          "name": "string",
          "slug": "string",
          "color": "string"
        },
        {
          "id": 7,
          "url": "string",
          "name": "string",
          "slug": "string",
          "color": "string"
        }
      ]
    },
    {
      "id": 4,
      "url": "string",
      "virtual_machine": {
        "id": 4,
        "url": "string",
        "name": "string"
      },
      "name": "string",
      "enabled": false,
      "mtu": 6,
      "mac_address": "string",
      "description": "string",
      "mode": {
        "label": "Tagged (All)",
        "value": "tagged-all"
      },
      "untagged_vlan": {
        "id": 6,
        "url": "string",
        "vid": 7,
        "name": "string",
        "display_name": "string"
      },
      "tagged_vlans": [
        {
          "id": 9,
          "url": "string",
          "vid": 6,
          "name": "string",
          "display_name": "string"
        }
      ],
      "tags": [
        {
          "id": 7,
          "url": "string",
          "name": "string",
          "slug": "string",
          "color": "string"
        },
        {
          "id": 5,
          "url": "string",
          "name": "string",
          "slug": "string",
          "color": "string"
        },
        {
          "id": 5,
          "url": "string",
          "name": "string",
          "slug": "string",
          "color": "string"
        },
        {
          "id": 6,
          "url": "string",
          "name": "string",
          "slug": "string",
          "color": "string"
        },
        {
          "id": 3,
          "url": "string",
          "name": "string",
          "slug": "string",
          "color": "string"
        }
      ]
    },
    {
      "id": 9,
      "url": "string",
      "virtual_machine": {
        "id": 2,
        "url": "string",
        "name": "string"
      },
      "name": "string",
      "enabled": false,
      "mtu": 6,
      "mac_address": "string",
      "description": "string",
      "mode": {
        "label": "Tagged (All)",
        "value": "tagged"
      },
      "untagged_vlan": {
        "id": 1,
        "url": "string",
        "vid": 6,
        "name": "string",
        "display_name": "string"
      },
      "tagged_vlans": [
        {
          "id": 1,
          "url": "string",
          "vid": 6,
          "name": "string",
          "display_name": "string"
        }
      ],
      "tags": [
        {
          "id": 8,
          "url": "string",
          "name": "string",
          "slug": "string",
          "color": "string"
        },
        {
          "id": 9,
          "url": "string",
          "name": "string",
          "slug": "string",
          "color": "string"
        },
        {
          "id": 5,
          "url": "string",
          "name": "string",
          "slug": "string",
          "color": "string"
        },
        {
          "id": 5,
          "url": "string",
          "name": "string",
          "slug": "string",
          "color": "string"
        },
        {
          "id": 3,
          "url": "string",
          "name": "string",
          "slug": "string",
          "color": "string"
        },
        {
          "id": 9,
          "url": "string",
          "name": "string",
          "slug": "string",
          "color": "string"
        },
        {
          "id": 3,
          "url": "string",
          "name": "string",
          "slug": "string",
          "color": "string"
        },
        {
          "id": 1,
          "url": "string",
          "name": "string",
          "slug": "string",
          "color": "string"
        },
        {
          "id": 8,
          "url": "string",
          "name": "string",
          "slug": "string",
          "color": "string"
        },
        {
          "id": 5,
          "url": "string",
          "name": "string",
          "slug": "string",
          "color": "string"
        }
      ]
    },
    {
      "id": 1,
      "url": "string",
      "virtual_machine": {
        "id": 1,
        "url": "string",
        "name": "string"
      },
      "name": "string",
      "enabled": true,
      "mtu": 2,
      "mac_address": "string",
      "description": "string",
      "mode": {
        "label": "Tagged",
        "value": "access"
      },
      "untagged_vlan": {
        "id": 4,
        "url": "string",
        "vid": 7,
        "name": "string",
        "display_name": "string"
      },
      "tagged_vlans": [
        {
          "id": 8,
          "url": "string",
          "vid": 8,
          "name": "string",
          "display_name": "string"
        },
        {
          "id": 9,
          "url": "string",
          "vid": 5,
          "name": "string",
          "display_name": "string"
        },
        {
          "id": 2,
          "url": "string",
          "vid": 1,
          "name": "string",
          "display_name": "string"
        },
        {
          "id": 5,
          "url": "string",
          "vid": 7,
          "name": "string",
          "display_name": "string"
        }
      ],
      "tags": [
        {
          "id": 8,
          "url": "string",
          "name": "string",
          "slug": "string",
          "color": "string"
        },
        {
          "id": 10,
          "url": "string",
          "name": "string",
          "slug": "string",
          "color": "string"
        },
        {
          "id": 8,
          "url": "string",
          "name": "string",
          "slug": "string",
          "color": "string"
        },
        {
          "id": 7,
          "url": "string",
          "name": "string",
          "slug": "string",
          "color": "string"
        }
      ]
    }
  ]
}