{
  "id": 1,
  "url": "string",
  "name": "string",
  "type": {
    "id": 2,
    "url": "string",
    "name": "string",
    "slug": "string",
    "cluster_count": 2
  },
  "group": {
    "id": 3,
    "url": "string",
    "name": "string",
    "slug": "string",
    "cluster_count": 10
  },
  "tenant": {
    "id": 5,
    "url": "string",
    "name": "string",
    "slug": "string"
  },
  "site": {
    "id": 9,
    "url": "string",
    "name": "string",
    "slug": "string"
  },
  "comments": "string",
  "tags": [
    {
      "id": 5,
      "url": "string",
      "name": "string",
      "slug": "string",
      "color": "string"
    },
    {
      "id": 6,
      "url": "string",
      "name": "string",
      "slug": "string",
      "color": "string"
    },
    {
      "id": 4,
      "url": "string",
      "name": "string",
      "slug": "string",
      "color": "string"
    },
    {
      "id": 6,
      "url": "string",
      "name": "string",
      "slug": "string",
      "color": "string"
    }
  ],
  "custom_fields": {},
  "created": "string",
  "last_updated": "string",
  "device_count": 1,
  "virtualmachine_count": 4
}