{
  "id": 6,
  "url": "string",
  "device": {
    "id": 9,
    "url": "string",
    "name": "string",
    "display_name": "string"
  },
  "name": "string",
  "label": "string",
  "type": {
    "label": "SC/APC",
    "value": "tera-1p"
  },
  "positions": 7,
  "description": "string",
  "cable": {
    "id": 1,
    "url": "string",
    "label": "string"
  },
  "cable_peer": {},
  "cable_peer_type": "string",
  "tags": [
    {
      "id": 9,
      "url": "string",
      "name": "string",
      "slug": "string",
      "color": "string"
    },
    {
      "id": 7,
      "url": "string",
      "name": "string",
      "slug": "string",
      "color": "string"
    },
    {
      "id": 10,
      "url": "string",
      "name": "string",
      "slug": "string",
      "color": "string"
    },
    {
      "id": 3,
      "url": "string",
      "name": "string",
      "slug": "string",
      "color": "string"
    }
  ]
}