{
  "id": 7,
  "url": "string",
  "created": "string",
  "completed": "string",
  "name": "string",
  "obj_type": "string",
  "status": {
    "label": "Failed",
    "value": "completed"
  },
  "user": {
    "id": 8,
    "url": "string",
    "username": "string"
  },
  "data": "string",
  "job_id": "string"
}