{
  "count": 8,
  "next": "string",
  "previous": "string",
  "results": [
    {
      "id": 10,
      "url": "string",
      "name": "string",
      "slug": "string",
      "parent": {
        "id": 8,
        "url": "string",
        "name": "string",
        "slug": "string",
        "tenant_count": 7,
        "_depth": 6
      },
      "description": "string",
      "tenant_count": 1,
      "_depth": 9
    },
    {
      "id": 7,
      "url": "string",
      "name": "string",
      "slug": "string",
      "parent": {
        "id": 3,
        "url": "string",
        "name": "string",
        "slug": "string",
        "tenant_count": 10,
        "_depth": 3
      },
      "description": "string",
      "tenant_count": 4,
      "_depth": 3
    },
    {
      "id": 10,
      "url": "string",
      "name": "string",
      "slug": "string",
      "parent": {
        "id": 6,
        "url": "string",
        "name": "string",
        "slug": "string",
        "tenant_count": 6,
        "_depth": 4
      },
      "description": "string",
      "tenant_count": 9,
      "_depth": 4
    },
    {
      "id": 3,
      "url": "string",
      "name": "string",
      "slug": "string",
      "parent": {
        "id": 2,
        "url": "string",
        "name": "string",
        "slug": "string",
        "tenant_count": 6,
        "_depth": 3
      },
      "description": "string",
      "tenant_count": 4,
      "_depth": 9
    }
  ]
}