{
  "id": 8,
  "url": "string",
  "device_type": {
    "id": 4,
    "url": "string",
    "manufacturer": {
      "id": 10,
      "url": "string",
      "name": "string",
      "slug": "string",
      "devicetype_count": 4
    },
    "model": "string",
    "slug": "string",
    "display_name": "string",
    "device_count": 10
  },
  "name": "string",
  "label": "string",
  "type": {
    "label": "8P2C",
    "value": "8p2c"
  },
  "rear_port": {
    "id": 6,
    "url": "string",
    "name": "string"
  },
  "rear_port_position": 1,
  "description": "string"
}