{
  "id": 9,
  "url": "string",
  "site": {
    "id": 2,
    "url": "string",
    "name": "string",
    "slug": "string"
  },
  "group": {
    "id": 7,
    "url": "string",
    "name": "string",
    "slug": "string",
    "vlan_count": 10
  },
  "vid": 8,
  "name": "string",
  "tenant": {
    "id": 10,
    "url": "string",
    "name": "string",
    "slug": "string"
  },
  "status": {
    "label": "Reserved",
    "value": "active"
  },
  "role": {
    "id": 6,
    "url": "string",
    "name": "string",
    "slug": "string",
    "prefix_count": 8,
    "vlan_count": 1
  },
  "description": "string",
  "tags": [
    {
      "id": 2,
      "url": "string",
      "name": "string",
      "slug": "string",
      "color": "string"
    },
    {
      "id": 6,
      "url": "string",
      "name": "string",
      "slug": "string",
      "color": "string"
    },
    {
      "id": 10,
      "url": "string",
      "name": "string",
      "slug": "string",
      "color": "string"
    }
  ],
  "display_name": "string",
  "custom_fields": {},
  "created": "string",
  "last_updated": "string",
  "prefix_count": 5
}