{
  "count": 3,
  "next": "string",
  "previous": "string",
  "results": [
    {
      "id": 10,
      "url": "string",
      "device": {
        "id": 6,
        "url": "string",
        "name": "string",
        "display_name": "string"
      },
      "name": "string",
      "label": "string",
      "type": {
        "label": "P+N+E 4H",
        "value": "iec-60309-2p-e-9h"
      },
      "maximum_draw": 2,
      "allocated_draw": 9,
      "description": "string",
      "cable": {
        "id": 2,
        "url": "string",
        "label": "string"
      },
      "cable_peer": {},
      "cable_peer_type": "string",
      "connected_endpoint": {},
      "connected_endpoint_type": "string",
      "connected_endpoint_reachable": true,
      "tags": [
        {
          "id": 10,
          "url": "string",
          "name": "string",
          "slug": "string",
          "color": "string"
        },
        {
          "id": 1,
          "url": "string",
          "name": "string",
          "slug": "string",
          "color": "string"
        }
      ]
    },
    {
      "id": 7,
      "url": "string",
      "device": {
        "id": 4,
        "url": "string",
        "name": "string",
        "display_name": "string"
      },
      "name": "string",
      "label": "string",
      "type": {
        "label": "C8",
        "value": "iec-60309-3p-n-e-4h"
      },
      "maximum_draw": 8,
      "allocated_draw": 8,
      "description": "string",
      "cable": {
        "id": 3,
        "url": "string",
        "label": "string"
      },
      "cable_peer": {},
      "cable_peer_type": "string",
      "connected_endpoint": {},
      "connected_endpoint_type": "string",
      "connected_endpoint_reachable": false,
      "tags": [
        {
          "id": 8,
          "url": "string",
          "name": "string",
          "slug": "string",
          "color": "string"
        },
        {
          "id": 8,
          "url": "string",
          "name": "string",
          "slug": "string",
          "color": "string"
        },
        {
          "id": 9,
          "url": "string",
          "name": "string",
          "slug": "string",
          "color": "string"
        },
        {
          "id": 2,
          "url": "string",
          "name": "string",
          "slug": "string",
          "color": "string"
        },
        {
          "id": 3,
          "url": "string",
          "name": "string",
          "slug": "string",
          "color": "string"
        },
        {
          "id": 4,
          "url": "string",
          "name": "string",
          "slug": "string",
          "color": "string"
        },
        {
          "id": 5,
          "url": "string",
          "name": "string",
          "slug": "string",
          "color": "string"
        }
      ]
    },
    {
      "id": 9,
      "url": "string",
      "device": {
        "id": 2,
        "url": "string",
        "name": "string",
        "display_name": "string"
      },
      "name": "string",
      "label": "string",
      "type": {
        "label": "ITA Type M (BS 546)",
        "value": "nema-l5-30p"
      },
      "maximum_draw": 2,
      "allocated_draw": 1,
      "description": "string",
      "cable": {
        "id": 9,
        "url": "string",
        "label": "string"
      },
      "cable_peer": {},
      "cable_peer_type": "string",
      "connected_endpoint": {},
      "connected_endpoint_type": "string",
      "connected_endpoint_reachable": true,
      "tags": [
        {
          "id": 3,
          "url": "string",
          "name": "string",
          "slug": "string",
          "color": "string"
        },
        {
          "id": 4,
          "url": "string",
          "name": "string",
          "slug": "string",
          "color": "string"
        },
        {
          "id": 6,
          "url": "string",
          "name": "string",
          "slug": "string",
          "color": "string"
        },
        {
          "id": 3,
          "url": "string",
          "name": "string",
          "slug": "string",
          "color": "string"
        },
        {
          "id": 3,
          "url": "string",
          "name": "string",
          "slug": "string",
          "color": "string"
        },
        {
          "id": 10,
          "url": "string",
          "name": "string",
          "slug": "string",
          "color": "string"
        }
      ]
    },
    {
      "id": 5,
      "url": "string",
      "device": {
        "id": 1,
        "url": "string",
        "name": "string",
        "display_name": "string"
      },
      "name": "string",
      "label": "string",
      "type": {
        "label": "NEMA 1-15P",
        "value": "usb-a"
      },
      "maximum_draw": 10,
      "allocated_draw": 2,
      "description": "string",
      "cable": {
        "id": 7,
        "url": "string",
        "label": "string"
      },
      "cable_peer": {},
      "cable_peer_type": "string",
      "connected_endpoint": {},
      "connected_endpoint_type": "string",
      "connected_endpoint_reachable": true,
      "tags": [
        {
          "id": 4,
          "url": "string",
          "name": "string",
          "slug": "string",
          "color": "string"
        },
        {
          "id": 3,
          "url": "string",
          "name": "string",
          "slug": "string",
          "color": "string"
        },
        {
          "id": 9,
          "url": "string",
          "name": "string",
          "slug": "string",
          "color": "string"
        },
        {
          "id": 4,
          "url": "string",
          "name": "string",
          "slug": "string",
          "color": "string"
        },
        {
          "id": 9,
          "url": "string",
          "name": "string",
          "slug": "string",
          "color": "string"
        },
        {
          "id": 8,
          "url": "string",
          "name": "string",
          "slug": "string",
          "color": "string"
        },
        {
          "id": 5,
          "url": "string",
          "name": "string",
          "slug": "string",
          "color": "string"
        }
      ]
    },
    {
      "id": 4,
      "url": "string",
      "device": {
        "id": 6,
        "url": "string",
        "name": "string",
        "display_name": "string"
      },
      "name": "string",
      "label": "string",
      "type": {
        "label": "NEMA 15-60P",
        "value": "nema-15-15p"
      },
      "maximum_draw": 2,
      "allocated_draw": 7,
      "description": "string",
      "cable": {
        "id": 4,
        "url": "string",
        "label": "string"
      },
      "cable_peer": {},
      "cable_peer_type": "string",
      "connected_endpoint": {},
      "connected_endpoint_type": "string",
      "connected_endpoint_reachable": true,
      "tags": [
        {
          "id": 8,
          "url": "string",
          "name": "string",
          "slug": "string",
          "color": "string"
        },
        {
          "id": 4,
          "url": "string",
          "name": "string",
          "slug": "string",
          "color": "string"
        }
      ]
    },
    {
      "id": 6,
      "url": "string",
      "device": {
        "id": 2,
        "url": "string",
        "name": "string",
        "display_name": "string"
      },
      "name": "string",
      "label": "string",
      "type": {
        "label": "NEMA L5-50P",
        "value": "nema-14-30p"
      },
      "maximum_draw": 7,
      "allocated_draw": 2,
      "description": "string",
      "cable": {
        "id": 5,
        "url": "string",
        "label": "string"
      },
      "cable_peer": {},
      "cable_peer_type": "string",
      "connected_endpoint": {},
      "connected_endpoint_type": "string",
      "connected_endpoint_reachable": true,
      "tags": [
        {
          "id": 7,
          "url": "string",
          "name": "string",
          "slug": "string",
          "color": "string"
        }
      ]
    },
    {
      "id": 10,
      "url": "string",
      "device": {
        "id": 4,
        "url": "string",
        "name": "string",
        "display_name": "string"
      },
      "name": "string",
      "label": "string",
      "type": {
        "label": "NEMA L5-15P",
        "value": "ita-j"
      },
      "maximum_draw": 6,
      "allocated_draw": 9,
      "description": "string",
      "cable": {
        "id": 3,
        "url": "string",
        "label": "string"
      },
      "cable_peer": {},
      "cable_peer_type": "string",
      "connected_endpoint": {},
      "connected_endpoint_type": "string",
      "connected_endpoint_reachable": false,
      "tags": [
        {
          "id": 5,
          "url": "string",
          "name": "string",
          "slug": "string",
          "color": "string"
        },
        {
          "id": 5,
          "url": "string",
          "name": "string",
          "slug": "string",
          "color": "string"
        },
        {
          "id": 5,
          "url": "string",
          "name": "string",
          "slug": "string",
          "color": "string"
        },
        {
          "id": 4,
          "url": "string",
          "name": "string",
          "slug": "string",
          "color": "string"
        },
        {
          "id": 1,
          "url": "string",
          "name": "string",
          "slug": "string",
          "color": "string"
        },
        {
          "id": 2,
          "url": "string",
          "name": "string",
          "slug": "string",
          "color": "string"
        },
        {
          "id": 1,
          "url": "string",
          "name": "string",
          "slug": "string",
          "color": "string"
        }
      ]
    },
    {
      "id": 1,
      "url": "string",
      "device": {
        "id": 1,
        "url": "string",
        "name": "string",
        "display_name": "string"
      },
      "name": "string",
      "label": "string",
      "type": {
        "label": "NEMA L15-30P",
        "value": "ita-h"
      },
      "maximum_draw": 4,
      "allocated_draw": 6,
      "description": "string",
      "cable": {
        "id": 7,
        "url": "string",
        "label": "string"
      },
      "cable_peer": {},
      "cable_peer_type": "string",
      "connected_endpoint": {},
      "connected_endpoint_type": "string",
      "connected_endpoint_reachable": false,
      "tags": [
        {
          "id": 6,
          "url": "string",
          "name": "string",
          "slug": "string",
          "color": "string"
        },
        {
          "id": 5,
          "url": "string",
          "name": "string",
          "slug": "string",
          "color": "string"
        },
        {
          "id": 8,
          "url": "string",
          "name": "string",
          "slug": "string",
          "color": "string"
        }
      ]
    }
  ]
}