{
  "count": 5,
  "next": "string",
  "previous": "string",
  "results": [
    {
      "id": 9,
      "url": "string",
      "content_type": "string",
      "object_id": 1,
      "parent": {},
      "name": "string",
      "image": "string",
      "image_height": 4,
      "image_width": 9,
      "created": "string"
    },
    {
      "id": 8,
      "url": "string",
      "content_type": "string",
      "object_id": 9,
      "parent": {},
      "name": "string",
      "image": "string",
      "image_height": 4,
      "image_width": 8,
      "created": "string"
    }
  ]
}