{
  "count": 6,
  "next": "string",
  "previous": "string",
  "results": [
    {
      "id": 5,
      "url": "string",
      "name": "string",
      "facility_id": "string",
      "display_name": "string",
      "site": {
        "id": 3,
        "url": "string",
        "name": "string",
        "slug": "string"
      },
      "group": {
        "id": 8,
        "url": "string",
        "name": "string",
        "slug": "string",
        "rack_count": 4,
        "_depth": 8
      },
      "tenant": {
        "id": 3,
        "url": "string",
        "name": "string",
        "slug": "string"
      },
      "status": {
        "label": "Planned",
        "value": "deprecated"
      },
      "role": {
        "id": 10,
        "url": "string",
        "name": "string",
        "slug": "string",
        "rack_count": 5
      },
      "serial": "string",
      "asset_tag": "string",
      "type": {
        "label": "4-post cabinet",
        "value": "wall-cabinet"
      },
      "width": {
        "label": "23 inches",
        "value": 19
      },
      "u_height": 6,
      "desc_units": true,
      "outer_width": 10,
      "outer_depth": 3,
      "outer_unit": {
        "label": "Millimeters",
        "value": "mm"
      },
      "comments": "string",
      "tags": [
        {
          "id": 8,
          "url": "string",
          "name": "string",
          "slug": "string",
          "color": "string"
        },
        {
          "id": 10,
          "url": "string",
          "name": "string",
          "slug": "string",
          "color": "string"
        }
      ],
      "custom_fields": {},
      "created": "string",
      "last_updated": "string",
      "device_count": 5,
      "powerfeed_count": 4
    },
    {
      "id": 8,
      "url": "string",
      "name": "string",
      "facility_id": "string",
      "display_name": "string",
      "site": {
        "id": 7,
        "url": "string",
        "name": "string",
        "slug": "string"
      },
      "group": {
        "id": 7,
        "url": "string",
        "name": "string",
        "slug": "string",
        "rack_count": 3,
        "_depth": 10
      },
      "tenant": {
        "id": 5,
        "url": "string",
        "name": "string",
        "slug": "string"
      },
      "status": {
        "label": "Available",
        "value": "planned"
      },
      "role": {
        "id": 9,
        "url": "string",
        "name": "string",
        "slug": "string",
        "rack_count": 3
      },
      "serial": "string",
      "asset_tag": "string",
      "type": {
        "label": "4-post frame",
        "value": "4-post-cabinet"
      },
      "width": {
        "label": "23 inches",
        "value": 19
      },
      "u_height": 10,
      "desc_units": false,
      "outer_width": 7,
      "outer_depth": 8,
      "outer_unit": {
        "label": "Inches",
        "value": "in"
      },
      "comments": "string",
      "tags": [
        {
          "id": 4,
          "url": "string",
          "name": "string",
          "slug": "string",
          "color": "string"
        },
        {
          "id": 1,
          "url": "string",
          "name": "string",
          "slug": "string",
          "color": "string"
        },
        {
          "id": 7,
          "url": "string",
          "name": "string",
          "slug": "string",
          "color": "string"
        },
        {
          "id": 3,
          "url": "string",
          "name": "string",
          "slug": "string",
          "color": "string"
        },
        {
          "id": 4,
          "url": "string",
          "name": "string",
          "slug": "string",
          "color": "string"
        }
      ],
      "custom_fields": {},
      "created": "string",
      "last_updated": "string",
      "device_count": 4,
      "powerfeed_count": 1
    },
    {
      "id": 5,
      "url": "string",
      "name": "string",
      "facility_id": "string",
      "display_name": "string",
      "site": {
        "id": 8,
        "url": "string",
        "name": "string",
        "slug": "string"
      },
      "group": {
        "id": 6,
        "url": "string",
        "name": "string",
        "slug": "string",
        "rack_count": 10,
        "_depth": 9
      },
      "tenant": {
        "id": 10,
        "url": "string",
        "name": "string",
        "slug": "string"
      },
      "status": {
        "label": "Deprecated",
        "value": "deprecated"
      },
      "role": {
        "id": 5,
        "url": "string",
        "name": "string",
        "slug": "string",
        "rack_count": 7
      },
      "serial": "string",
      "asset_tag": "string",
      "type": {
        "label": "Wall-mounted cabinet",
        "value": "4-post-frame"
      },
      "width": {
        "label": "19 inches",
        "value": 21
      },
      "u_height": 9,
      "desc_units": false,
      "outer_width": 2,
      "outer_depth": 4,
      "outer_unit": {
        "label": "Inches",
        "value": "in"
      },
      "comments": "string",
      "tags": [
        {
          "id": 6,
          "url": "string",
          "name": "string",
          "slug": "string",
          "color": "string"
        },
        {
          "id": 7,
          "url": "string",
          "name": "string",
          "slug": "string",
          "color": "string"
        },
        {
          "id": 5,
          "url": "string",
          "name": "string",
          "slug": "string",
          "color": "string"
        }
      ],
      "custom_fields": {},
      "created": "string",
      "last_updated": "string",
      "device_count": 6,
      "powerfeed_count": 7
    },
    {
      "id": 6,
      "url": "string",
      "name": "string",
      "facility_id": "string",
      "display_name": "string",
      "site": {
        "id": 5,
        "url": "string",
        "name": "string",
        "slug": "string"
      },
      "group": {
        "id": 4,
        "url": "string",
        "name": "string",
        "slug": "string",
        "rack_count": 5,
        "_depth": 9
      },
      "tenant": {
        "id": 9,
        "url": "string",
        "name": "string",
        "slug": "string"
      },
      "status": {
        "label": "Available",
        "value": "deprecated"
      },
      "role": {
        "id": 5,
        "url": "string",
        "name": "string",
        "slug": "string",
        "rack_count": 7
      },
      "serial": "string",
      "asset_tag": "string",
      "type": {
        "label": "Wall-mounted cabinet",
        "value": "4-post-cabinet"
      },
      "width": {
        "label": "23 inches",
        "value": 21
      },
      "u_height": 5,
      "desc_units": false,
      "outer_width": 7,
      "outer_depth": 2,
      "outer_unit": {
        "label": "Millimeters",
        "value": "mm"
      },
      "comments": "string",
      "tags": [
        {
          "id": 4,
          "url": "string",
          "name": "string",
          "slug": "string",
          "color": "string"
        },
        {
          "id": 2,
          "url": "string",
          "name": "string",
          "slug": "string",
          "color": "string"
        },
        {
          "id": 3,
          "url": "string",
          "name": "string",
          "slug": "string",
          "color": "string"
        },
        {
          "id": 3,
          "url": "string",
          "name": "string",
          "slug": "string",
          "color": "string"
        },
        {
          "id": 5,
          "url": "string",
          "name": "string",
          "slug": "string",
          "color": "string"
        },
        {
          "id": 1,
          "url": "string",
          "name": "string",
          "slug": "string",
          "color": "string"
        },
        {
          "id": 2,
          "url": "string",
          "name": "string",
          "slug": "string",
          "color": "string"
        },
        {
          "id": 8,
          "url": "string",
          "name": "string",
          "slug": "string",
          "color": "string"
        },
        {
          "id": 3,
          "url": "string",
          "name": "string",
          "slug": "string",
          "color": "string"
        }
      ],
      "custom_fields": {},
      "created": "string",
      "last_updated": "string",
      "device_count": 7,
      "powerfeed_count": 7
    },
    {
      "id": 8,
      "url": "string",
      "name": "string",
      "facility_id": "string",
      "display_name": "string",
      "site": {
        "id": 10,
        "url": "string",
        "name": "string",
        "slug": "string"
      },
      "group": {
        "id": 7,
        "url": "string",
        "name": "string",
        "slug": "string",
        "rack_count": 5,
        "_depth": 3
      },
      "tenant": {
        "id": 4,
        "url": "string",
        "name": "string",
        "slug": "string"
      },
      "status": {
        "label": "Available",
        "value": "available"
      },
      "role": {
        "id": 2,
        "url": "string",
        "name": "string",
        "slug": "string",
        "rack_count": 9
      },
      "serial": "string",
      "asset_tag": "string",
      "type": {
        "label": "Wall-mounted cabinet",
        "value": "wall-frame"
      },
      "width": {
        "label": "21 inches",
        "value": 23
      },
      "u_height": 6,
      "desc_units": false,
      "outer_width": 8,
      "outer_depth": 8,
      "outer_unit": {
        "label": "Millimeters",
        "value": "in"
      },
      "comments": "string",
      "tags": [
        {
          "id": 9,
          "url": "string",
          "name": "string",
          "slug": "string",
          "color": "string"
        },
        {
          "id": 1,
          "url": "string",
          "name": "string",
          "slug": "string",
          "color": "string"
        },
        {
          "id": 1,
          "url": "string",
          "name": "string",
          "slug": "string",
          "color": "string"
        },
        {
          "id": 2,
          "url": "string",
          "name": "string",
          "slug": "string",
          "color": "string"
        },
        {
          "id": 2,
          "url": "string",
          "name": "string",
          "slug": "string",
          "color": "string"
        },
        {
          "id": 10,
          "url": "string",
          "name": "string",
          "slug": "string",
          "color": "string"
        },
        {
          "id": 8,
          "url": "string",
          "name": "string",
          "slug": "string",
          "color": "string"
        }
      ],
      "custom_fields": {},
      "created": "string",
      "last_updated": "string",
      "device_count": 1,
      "powerfeed_count": 8
    },
    {
      "id": 10,
      "url": "string",
      "name": "string",
      "facility_id": "string",
      "display_name": "string",
      "site": {
        "id": 3,
        "url": "string",
        "name": "string",
        "slug": "string"
      },
      "group": {
        "id": 3,
        "url": "string",
        "name": "string",
        "slug": "string",
        "rack_count": 9,
        "_depth": 9
      },
      "tenant": {
        "id": 2,
        "url": "string",
        "name": "string",
        "slug": "string"
      },
      "status": {
        "label": "Planned",
        "value": "deprecated"
      },
      "role": {
        "id": 6,
        "url": "string",
        "name": "string",
        "slug": "string",
        "rack_count": 6
      },
      "serial": "string",
      "asset_tag": "string",
      "type": {
        "label": "2-post frame",
        "value": "4-post-cabinet"
      },
      "width": {
        "label": "23 inches",
        "value": 19
      },
      "u_height": 5,
      "desc_units": false,
      "outer_width": 10,
      "outer_depth": 8,
      "outer_unit": {
        "label": "Inches",
        "value": "in"
      },
      "comments": "string",
      "tags": [
        {
          "id": 2,
          "url": "string",
          "name": "string",
          "slug": "string",
          "color": "string"
        },
        {
          "id": 1,
          "url": "string",
          "name": "string",
          "slug": "string",
          "color": "string"
        },
        {
          "id": 3,
          "url": "string",
          "name": "string",
          "slug": "string",
          "color": "string"
        },
        {
          "id": 1,
          "url": "string",
          "name": "string",
          "slug": "string",
          "color": "string"
        },
        {
          "id": 5,
          "url": "string",
          "name": "string",
          "slug": "string",
          "color": "string"
        },
        {
          "id": 8,
          "url": "string",
          "name": "string",
          "slug": "string",
          "color": "string"
        },
        {
          "id": 4,
          "url": "string",
          "name": "string",
          "slug": "string",
          "color": "string"
        }
      ],
      "custom_fields": {},
      "created": "string",
      "last_updated": "string",
      "device_count": 10,
      "powerfeed_count": 2
    },
    {
      "id": 3,
      "url": "string",
      "name": "string",
      "facility_id": "string",
      "display_name": "string",
      "site": {
        "id": 5,
        "url": "string",
        "name": "string",
        "slug": "string"
      },
      "group": {
        "id": 1,
        "url": "string",
        "name": "string",
        "slug": "string",
        "rack_count": 1,
        "_depth": 9
      },
      "tenant": {
        "id": 2,
        "url": "string",
        "name": "string",
        "slug": "string"
      },
      "status": {
        "label": "Deprecated",
        "value": "available"
      },
      "role": {
        "id": 8,
        "url": "string",
        "name": "string",
        "slug": "string",
        "rack_count": 9
      },
      "serial": "string",
      "asset_tag": "string",
      "type": {
        "label": "2-post frame",
        "value": "4-post-frame"
      },
      "width": {
        "label": "23 inches",
        "value": 10
      },
      "u_height": 5,
      "desc_units": true,
      "outer_width": 8,
      "outer_depth": 2,
      "outer_unit": {
        "label": "Millimeters",
        "value": "in"
      },
      "comments": "string",
      "tags": [
        {
          "id": 2,
          "url": "string",
          "name": "string",
          "slug": "string",
          "color": "string"
        },
        {
          "id": 8,
          "url": "string",
          "name": "string",
          "slug": "string",
          "color": "string"
        },
        {
          "id": 3,
          "url": "string",
          "name": "string",
          "slug": "string",
          "color": "string"
        },
        {
          "id": 10,
          "url": "string",
          "name": "string",
          "slug": "string",
          "color": "string"
        },
        {
          "id": 9,
          "url": "string",
          "name": "string",
          "slug": "string",
          "color": "string"
        },
        {
          "id": 7,
          "url": "string",
          "name": "string",
          "slug": "string",
          "color": "string"
        },
        {
          "id": 2,
          "url": "string",
          "name": "string",
          "slug": "string",
          "color": "string"
        },
        {
          "id": 2,
          "url": "string",
          "name": "string",
          "slug": "string",
          "color": "string"
        },
        {
          "id": 3,
          "url": "string",
          "name": "string",
          "slug": "string",
          "color": "string"
        }
      ],
      "custom_fields": {},
      "created": "string",
      "last_updated": "string",
      "device_count": 10,
      "powerfeed_count": 4
    }
  ]
}