{
  "id": 3,
  "url": "string",
  "device_type": {
    "id": 3,
    "url": "string",
    "manufacturer": {
      "id": 6,
      "url": "string",
      "name": "string",
      "slug": "string",
      "devicetype_count": 10
    },
    "model": "string",
    "slug": "string",
    "display_name": "string",
    "device_count": 7
  },
  "name": "string",
  "label": "string",
  "type": {
    "label": "USB Micro A",
    "value": "usb-mini-a"
  },
  "description": "string"
}