{
  "id": 10,
  "url": "string",
  "time": "string",
  "user": {
    "id": 2,
    "url": "string",
    "username": "string"
  },
  "user_name": "string",
  "request_id": "string",
  "action": {
    "label": "Deleted",
    "value": "delete"
  },
  "changed_object_type": "string",
  "changed_object_id": 1,
  "changed_object": {},
  "object_data": "string"
}