{
  "count": 7,
  "next": "string",
  "previous": "string",
  "results": [
    {
      "id": 3,
      "url": "string",
      "name": "string",
      "rd": "string",
      "tenant": {
        "id": 5,
        "url": "string",
        "name": "string",
        "slug": "string"
      },
      "enforce_unique": true,
      "description": "string",
      "import_targets": [
        {
          "id": 8,
          "url": "string",
          "name": "string"
        },
        {
          "id": 1,
          "url": "string",
          "name": "string"
        },
        {
          "id": 1,
          "url": "string",
          "name": "string"
        },
        {
          "id": 1,
          "url": "string",
          "name": "string"
        },
        {
          "id": 3,
          "url": "string",
          "name": "string"
        },
        {
          "id": 8,
          "url": "string",
          "name": "string"
        },
        {
          "id": 3,
          "url": "string",
          "name": "string"
        }
      ],
      "export_targets": [
        {
          "id": 7,
          "url": "string",
          "name": "string"
        },
        {
          "id": 6,
          "url": "string",
          "name": "string"
        }
      ],
      "tags": [
        {
          "id": 9,
          "url": "string",
          "name": "string",
          "slug": "string",
          "color": "string"
        },
        {
          "id": 7,
          "url": "string",
          "name": "string",
          "slug": "string",
          "color": "string"
        }
      ],
      "display_name": "string",
      "custom_fields": {},
      "created": "string",
      "last_updated": "string",
      "ipaddress_count": 1,
      "prefix_count": 5
    },
    {
      "id": 7,
      "url": "string",
      "name": "string",
      "rd": "string",
      "tenant": {
        "id": 5,
        "url": "string",
        "name": "string",
        "slug": "string"
      },
      "enforce_unique": true,
      "description": "string",
      "import_targets": [
        {
          "id": 3,
          "url": "string",
          "name": "string"
        },
        {
          "id": 6,
          "url": "string",
          "name": "string"
        },
        {
          "id": 3,
          "url": "string",
          "name": "string"
        },
        {
          "id": 5,
          "url": "string",
          "name": "string"
        },
        {
          "id": 4,
          "url": "string",
          "name": "string"
        },
        {
          "id": 8,
          "url": "string",
          "name": "string"
        },
        {
          "id": 6,
          "url": "string",
          "name": "string"
        },
        {
          "id": 3,
          "url": "string",
          "name": "string"
        },
        {
          "id": 2,
          "url": "string",
          "name": "string"
        },
        {
          "id": 7,
          "url": "string",
          "name": "string"
        }
      ],
      "export_targets": [
        {
          "id": 6,
          "url": "string",
          "name": "string"
        },
        {
          "id": 4,
          "url": "string",
          "name": "string"
        },
        {
          "id": 3,
          "url": "string",
          "name": "string"
        },
        {
          "id": 4,
          "url": "string",
          "name": "string"
        },
        {
          "id": 3,
          "url": "string",
          "name": "string"
        },
        {
          "id": 4,
          "url": "string",
          "name": "string"
        },
        {
          "id": 8,
          "url": "string",
          "name": "string"
        },
        {
          "id": 5,
          "url": "string",
          "name": "string"
        },
        {
          "id": 10,
          "url": "string",
          "name": "string"
        },
        {
          "id": 2,
          "url": "string",
          "name": "string"
        }
      ],
      "tags": [
        {
          "id": 2,
          "url": "string",
          "name": "string",
          "slug": "string",
          "color": "string"
        },
        {
          "id": 2,
          "url": "string",
          "name": "string",
          "slug": "string",
          "color": "string"
        },
        {
          "id": 8,
          "url": "string",
          "name": "string",
          "slug": "string",
          "color": "string"
        },
        {
          "id": 2,
          "url": "string",
          "name": "string",
          "slug": "string",
          "color": "string"
        }
      ],
      "display_name": "string",
      "custom_fields": {},
      "created": "string",
      "last_updated": "string",
      "ipaddress_count": 2,
      "prefix_count": 7
    },
    {
      "id": 2,
      "url": "string",
      "name": "string",
      "rd": "string",
      "tenant": {
        "id": 3,
        "url": "string",
        "name": "string",
        "slug": "string"
      },
      "enforce_unique": false,
      "description": "string",
      "import_targets": [
        {
          "id": 10,
          "url": "string",
          "name": "string"
        },
        {
          "id": 4,
          "url": "string",
          "name": "string"
        },
        {
          "id": 3,
          "url": "string",
          "name": "string"
        },
        {
          "id": 3,
          "url": "string",
          "name": "string"
        }
      ],
      "export_targets": [
        {
          "id": 2,
          "url": "string",
          "name": "string"
        }
      ],
      "tags": [
        {
          "id": 8,
          "url": "string",
          "name": "string",
          "slug": "string",
          "color": "string"
        },
        {
          "id": 6,
          "url": "string",
          "name": "string",
          "slug": "string",
          "color": "string"
        },
        {
          "id": 8,
          "url": "string",
          "name": "string",
          "slug": "string",
          "color": "string"
        },
        {
          "id": 2,
          "url": "string",
          "name": "string",
          "slug": "string",
          "color": "string"
        },
        {
          "id": 4,
          "url": "string",
          "name": "string",
          "slug": "string",
          "color": "string"
        }
      ],
      "display_name": "string",
      "custom_fields": {},
      "created": "string",
      "last_updated": "string",
      "ipaddress_count": 9,
      "prefix_count": 8
    },
    {
      "id": 1,
      "url": "string",
      "name": "string",
      "rd": "string",
      "tenant": {
        "id": 9,
        "url": "string",
        "name": "string",
        "slug": "string"
      },
      "enforce_unique": true,
      "description": "string",
      "import_targets": [
        {
          "id": 6,
          "url": "string",
          "name": "string"
        },
        {
          "id": 7,
          "url": "string",
          "name": "string"
        },
        {
          "id": 6,
          "url": "string",
          "name": "string"
        },
        {
          "id": 7,
          "url": "string",
          "name": "string"
        },
        {
          "id": 8,
          "url": "string",
          "name": "string"
        },
        {
          "id": 7,
          "url": "string",
          "name": "string"
        },
        {
          "id": 1,
          "url": "string",
          "name": "string"
        },
        {
          "id": 4,
          "url": "string",
          "name": "string"
        }
      ],
      "export_targets": [
        {
          "id": 7,
          "url": "string",
          "name": "string"
        },
        {
          "id": 6,
          "url": "string",
          "name": "string"
        },
        {
          "id": 8,
          "url": "string",
          "name": "string"
        },
        {
          "id": 4,
          "url": "string",
          "name": "string"
        },
        {
          "id": 1,
          "url": "string",
          "name": "string"
        },
        {
          "id": 7,
          "url": "string",
          "name": "string"
        },
        {
          "id": 4,
          "url": "string",
          "name": "string"
        },
        {
          "id": 4,
          "url": "string",
          "name": "string"
        },
        {
          "id": 2,
          "url": "string",
          "name": "string"
        },
        {
          "id": 9,
          "url": "string",
          "name": "string"
        }
      ],
      "tags": [
        {
          "id": 7,
          "url": "string",
          "name": "string",
          "slug": "string",
          "color": "string"
        },
        {
          "id": 4,
          "url": "string",
          "name": "string",
          "slug": "string",
          "color": "string"
        },
        {
          "id": 9,
          "url": "string",
          "name": "string",
          "slug": "string",
          "color": "string"
        }
      ],
      "display_name": "string",
      "custom_fields": {},
      "created": "string",
      "last_updated": "string",
      "ipaddress_count": 9,
      "prefix_count": 7
    },
    {
      "id": 7,
      "url": "string",
      "name": "string",
      "rd": "string",
      "tenant": {
        "id": 1,
        "url": "string",
        "name": "string",
        "slug": "string"
      },
      "enforce_unique": true,
      "description": "string",
      "import_targets": [
        {
          "id": 9,
          "url": "string",
          "name": "string"
        },
        {
          "id": 5,
          "url": "string",
          "name": "string"
        },
        {
          "id": 6,
          "url": "string",
          "name": "string"
        }
      ],
      "export_targets": [
        {
          "id": 1,
          "url": "string",
          "name": "string"
        },
        {
          "id": 3,
          "url": "string",
          "name": "string"
        },
        {
          "id": 4,
          "url": "string",
          "name": "string"
        },
        {
          "id": 3,
          "url": "string",
          "name": "string"
        },
        {
          "id": 4,
          "url": "string",
          "name": "string"
        },
        {
          "id": 8,
          "url": "string",
          "name": "string"
        },
        {
          "id": 10,
          "url": "string",
          "name": "string"
        },
        {
          "id": 2,
          "url": "string",
          "name": "string"
        },
        {
          "id": 10,
          "url": "string",
          "name": "string"
        },
        {
          "id": 8,
          "url": "string",
          "name": "string"
        }
      ],
      "tags": [
        {
          "id": 5,
          "url": "string",
          "name": "string",
          "slug": "string",
          "color": "string"
        },
        {
          "id": 8,
          "url": "string",
          "name": "string",
          "slug": "string",
          "color": "string"
        },
        {
          "id": 8,
          "url": "string",
          "name": "string",
          "slug": "string",
          "color": "string"
        },
        {
          "id": 3,
          "url": "string",
          "name": "string",
          "slug": "string",
          "color": "string"
        }
      ],
      "display_name": "string",
      "custom_fields": {},
      "created": "string",
      "last_updated": "string",
      "ipaddress_count": 7,
      "prefix_count": 3
    },
    {
      "id": 10,
      "url": "string",
      "name": "string",
      "rd": "string",
      "tenant": {
        "id": 8,
        "url": "string",
        "name": "string",
        "slug": "string"
      },
      "enforce_unique": false,
      "description": "string",
      "import_targets": [
        {
          "id": 3,
          "url": "string",
          "name": "string"
        },
        {
          "id": 1,
          "url": "string",
          "name": "string"
        },
        {
          "id": 2,
          "url": "string",
          "name": "string"
        },
        {
          "id": 4,
          "url": "string",
          "name": "string"
        },
        {
          "id": 5,
          "url": "string",
          "name": "string"
        },
        {
          "id": 4,
          "url": "string",
          "name": "string"
        },
        {
          "id": 10,
          "url": "string",
          "name": "string"
        },
        {
          "id": 5,
          "url": "string",
          "name": "string"
        }
      ],
      "export_targets": [
        {
          "id": 3,
          "url": "string",
          "name": "string"
        },
        {
          "id": 8,
          "url": "string",
          "name": "string"
        },
        {
          "id": 3,
          "url": "string",
          "name": "string"
        },
        {
          "id": 2,
          "url": "string",
          "name": "string"
        },
        {
          "id": 3,
          "url": "string",
          "name": "string"
        },
        {
          "id": 1,
          "url": "string",
          "name": "string"
        },
        {
          "id": 10,
          "url": "string",
          "name": "string"
        },
        {
          "id": 8,
          "url": "string",
          "name": "string"
        }
      ],
      "tags": [
        {
          "id": 6,
          "url": "string",
          "name": "string",
          "slug": "string",
          "color": "string"
        }
      ],
      "display_name": "string",
      "custom_fields": {},
      "created": "string",
      "last_updated": "string",
      "ipaddress_count": 4,
      "prefix_count": 6
    },
    {
      "id": 1,
      "url": "string",
      "name": "string",
      "rd": "string",
      "tenant": {
        "id": 10,
        "url": "string",
        "name": "string",
        "slug": "string"
      },
      "enforce_unique": false,
      "description": "string",
      "import_targets": [
        {
          "id": 9,
          "url": "string",
          "name": "string"
        },
        {
          "id": 4,
          "url": "string",
          "name": "string"
        }
      ],
      "export_targets": [
        {
          "id": 1,
          "url": "string",
          "name": "string"
        },
        {
          "id": 1,
          "url": "string",
          "name": "string"
        },
        {
          "id": 3,
          "url": "string",
          "name": "string"
        },
        {
          "id": 3,
          "url": "string",
          "name": "string"
        },
        {
          "id": 10,
          "url": "string",
          "name": "string"
        }
      ],
      "tags": [
        {
          "id": 5,
          "url": "string",
          "name": "string",
          "slug": "string",
          "color": "string"
        },
        {
          "id": 1,
          "url": "string",
          "name": "string",
          "slug": "string",
          "color": "string"
        },
        {
          "id": 9,
          "url": "string",
          "name": "string",
          "slug": "string",
          "color": "string"
        },
        {
          "id": 4,
          "url": "string",
          "name": "string",
          "slug": "string",
          "color": "string"
        },
        {
          "id": 9,
          "url": "string",
          "name": "string",
          "slug": "string",
          "color": "string"
        },
        {
          "id": 4,
          "url": "string",
          "name": "string",
          "slug": "string",
          "color": "string"
        },
        {
          "id": 3,
          "url": "string",
          "name": "string",
          "slug": "string",
          "color": "string"
        },
        {
          "id": 10,
          "url": "string",
          "name": "string",
          "slug": "string",
          "color": "string"
        },
        {
          "id": 7,
          "url": "string",
          "name": "string",
          "slug": "string",
          "color": "string"
        },
        {
          "id": 5,
          "url": "string",
          "name": "string",
          "slug": "string",
          "color": "string"
        }
      ],
      "display_name": "string",
      "custom_fields": {},
      "created": "string",
      "last_updated": "string",
      "ipaddress_count": 7,
      "prefix_count": 7
    },
    {
      "id": 8,
      "url": "string",
      "name": "string",
      "rd": "string",
      "tenant": {
        "id": 10,
        "url": "string",
        "name": "string",
        "slug": "string"
      },
      "enforce_unique": true,
      "description": "string",
      "import_targets": [
        {
          "id": 7,
          "url": "string",
          "name": "string"
        },
        {
          "id": 9,
          "url": "string",
          "name": "string"
        },
        {
          "id": 1,
          "url": "string",
          "name": "string"
        },
        {
          "id": 6,
          "url": "string",
          "name": "string"
        },
        {
          "id": 6,
          "url": "string",
          "name": "string"
        },
        {
          "id": 5,
          "url": "string",
          "name": "string"
        },
        {
          "id": 7,
          "url": "string",
          "name": "string"
        },
        {
          "id": 2,
          "url": "string",
          "name": "string"
        },
        {
          "id": 10,
          "url": "string",
          "name": "string"
        },
        {
          "id": 5,
          "url": "string",
          "name": "string"
        }
      ],
      "export_targets": [
        {
          "id": 9,
          "url": "string",
          "name": "string"
        },
        {
          "id": 5,
          "url": "string",
          "name": "string"
        },
        {
          "id": 8,
          "url": "string",
          "name": "string"
        },
        {
          "id": 8,
          "url": "string",
          "name": "string"
        }
      ],
      "tags": [
        {
          "id": 2,
          "url": "string",
          "name": "string",
          "slug": "string",
          "color": "string"
        },
        {
          "id": 2,
          "url": "string",
          "name": "string",
          "slug": "string",
          "color": "string"
        },
        {
          "id": 8,
          "url": "string",
          "name": "string",
          "slug": "string",
          "color": "string"
        },
        {
          "id": 8,
          "url": "string",
          "name": "string",
          "slug": "string",
          "color": "string"
        },
        {
          "id": 1,
          "url": "string",
          "name": "string",
          "slug": "string",
          "color": "string"
        },
        {
          "id": 2,
          "url": "string",
          "name": "string",
          "slug": "string",
          "color": "string"
        },
        {
          "id": 7,
          "url": "string",
          "name": "string",
          "slug": "string",
          "color": "string"
        },
        {
          "id": 10,
          "url": "string",
          "name": "string",
          "slug": "string",
          "color": "string"
        },
        {
          "id": 6,
          "url": "string",
          "name": "string",
          "slug": "string",
          "color": "string"
        }
      ],
      "display_name": "string",
      "custom_fields": {},
      "created": "string",
      "last_updated": "string",
      "ipaddress_count": 10,
      "prefix_count": 1
    },
    {
      "id": 5,
      "url": "string",
      "name": "string",
      "rd": "string",
      "tenant": {
        "id": 3,
        "url": "string",
        "name": "string",
        "slug": "string"
      },
      "enforce_unique": false,
      "description": "string",
      "import_targets": [
        {
          "id": 6,
          "url": "string",
          "name": "string"
        },
        {
          "id": 9,
          "url": "string",
          "name": "string"
        },
        {
          "id": 8,
          "url": "string",
          "name": "string"
        }
      ],
      "export_targets": [
        {
          "id": 5,
          "url": "string",
          "name": "string"
        },
        {
          "id": 6,
          "url": "string",
          "name": "string"
        }
      ],
      "tags": [
        {
          "id": 7,
          "url": "string",
          "name": "string",
          "slug": "string",
          "color": "string"
        },
        {
          "id": 9,
          "url": "string",
          "name": "string",
          "slug": "string",
          "color": "string"
        },
        {
          "id": 6,
          "url": "string",
          "name": "string",
          "slug": "string",
          "color": "string"
        },
        {
          "id": 10,
          "url": "string",
          "name": "string",
          "slug": "string",
          "color": "string"
        },
        {
          "id": 6,
          "url": "string",
          "name": "string",
          "slug": "string",
          "color": "string"
        },
        {
          "id": 7,
          "url": "string",
          "name": "string",
          "slug": "string",
          "color": "string"
        },
        {
          "id": 6,
          "url": "string",
          "name": "string",
          "slug": "string",
          "color": "string"
        },
        {
          "id": 6,
          "url": "string",
          "name": "string",
          "slug": "string",
          "color": "string"
        },
        {
          "id": 9,
          "url": "string",
          "name": "string",
          "slug": "string",
          "color": "string"
        },
        {
          "id": 9,
          "url": "string",
          "name": "string",
          "slug": "string",
          "color": "string"
        }
      ],
      "display_name": "string",
      "custom_fields": {},
      "created": "string",
      "last_updated": "string",
      "ipaddress_count": 1,
      "prefix_count": 3
    }
  ]
}