{
  "count": 3,
  "next": "string",
  "previous": "string",
  "results": [
    {
      "id": 6,
      "url": "string",
      "name": "string",
      "slug": "string",
      "description": "string",
      "secret_count": 7
    },
    {
      "id": 2,
      "url": "string",
      "name": "string",
      "slug": "string",
      "description": "string",
      "secret_count": 6
    },
    {
      "id": 4,
      "url": "string",
      "name": "string",
      "slug": "string",
      "description": "string",
      "secret_count": 7
    },
    {
      "id": 4,
      "url": "string",
      "name": "string",
      "slug": "string",
      "description": "string",
      "secret_count": 10
    },
    {
      "id": 10,
      "url": "string",
      "name": "string",
      "slug": "string",
      "description": "string",
      "secret_count": 4
    },
    {
      "id": 4,
      "url": "string",
      "name": "string",
      "slug": "string",
      "description": "string",
      "secret_count": 9
    },
    {
      "id": 1,
      "url": "string",
      "name": "string",
      "slug": "string",
      "description": "string",
      "secret_count": 6
    },
    {
      "id": 4,
      "url": "string",
      "name": "string",
      "slug": "string",
      "description": "string",
      "secret_count": 7
    },
    {
      "id": 7,
      "url": "string",
      "name": "string",
      "slug": "string",
      "description": "string",
      "secret_count": 2
    },
    {
      "id": 8,
      "url": "string",
      "name": "string",
      "slug": "string",
      "description": "string",
      "secret_count": 2
    }
  ]
}