{
  "id": 9,
  "url": "string",
  "device": {
    "id": 7,
    "url": "string",
    "name": "string",
    "display_name": "string"
  },
  "name": "string",
  "label": "string",
  "type": {
    "label": "GG45",
    "value": "8p4c"
  },
  "positions": 9,
  "description": "string",
  "cable": {
    "id": 8,
    "url": "string",
    "label": "string"
  },
  "cable_peer": {},
  "cable_peer_type": "string",
  "tags": [
    {
      "id": 9,
      "url": "string",
      "name": "string",
      "slug": "string",
      "color": "string"
    },
    {
      "id": 4,
      "url": "string",
      "name": "string",
      "slug": "string",
      "color": "string"
    },
    {
      "id": 5,
      "url": "string",
      "name": "string",
      "slug": "string",
      "color": "string"
    }
  ]
}