{
  "id": 1,
  "url": "string",
  "virtual_machine": {
    "id": 6,
    "url": "string",
    "name": "string"
  },
  "name": "string",
  "enabled": false,
  "mtu": 8,
  "mac_address": "string",
  "description": "string",
  "mode": {
    "label": "Tagged (All)",
    "value": "tagged-all"
  },
  "untagged_vlan": {
    "id": 9,
    "url": "string",
    "vid": 6,
    "name": "string",
    "display_name": "string"
  },
  "tagged_vlans": [
    {
      "id": 10,
      "url": "string",
      "vid": 10,
      "name": "string",
      "display_name": "string"
    },
    {
      "id": 7,
      "url": "string",
      "vid": 9,
      "name": "string",
      "display_name": "string"
    },
    {
      "id": 1,
      "url": "string",
      "vid": 10,
      "name": "string",
      "display_name": "string"
    },
    {
      "id": 9,
      "url": "string",
      "vid": 3,
      "name": "string",
      "display_name": "string"
    },
    {
      "id": 4,
      "url": "string",
      "vid": 1,
      "name": "string",
      "display_name": "string"
    },
    {
      "id": 1,
      "url": "string",
      "vid": 10,
      "name": "string",
      "display_name": "string"
    },
    {
      "id": 7,
      "url": "string",
      "vid": 10,
      "name": "string",
      "display_name": "string"
    },
    {
      "id": 5,
      "url": "string",
      "vid": 4,
      "name": "string",
      "display_name": "string"
    },
    {
      "id": 4,
      "url": "string",
      "vid": 1,
      "name": "string",
      "display_name": "string"
    }
  ],
  "tags": [
    {
      "id": 5,
      "url": "string",
      "name": "string",
      "slug": "string",
      "color": "string"
    },
    {
      "id": 9,
      "url": "string",
      "name": "string",
      "slug": "string",
      "color": "string"
    },
    {
      "id": 5,
      "url": "string",
      "name": "string",
      "slug": "string",
      "color": "string"
    },
    {
      "id": 10,
      "url": "string",
      "name": "string",
      "slug": "string",
      "color": "string"
    }
  ]
}