{
  "count": 10,
  "next": "string",
  "previous": "string",
  "results": [
    {
      "id": 5,
      "url": "string",
      "device": {
        "id": 5,
        "url": "string",
        "name": "string",
        "display_name": "string"
      },
      "name": "string",
      "label": "string",
      "type": {
        "label": "TERA 2P",
        "value": "gg45"
      },
      "positions": 4,
      "description": "string",
      "cable": {
        "id": 5,
        "url": "string",
        "label": "string"
      },
      "cable_peer": {},
      "cable_peer_type": "string",
      "tags": [
        {
          "id": 3,
          "url": "string",
          "name": "string",
          "slug": "string",
          "color": "string"
        },
        {
          "id": 10,
          "url": "string",
          "name": "string",
          "slug": "string",
          "color": "string"
        }
      ]
    },
    {
      "id": 1,
      "url": "string",
      "device": {
        "id": 3,
        "url": "string",
        "name": "string",
        "display_name": "string"
      },
      "name": "string",
      "label": "string",
      "type": {
        "label": "MRJ21",
        "value": "110-punch"
      },
      "positions": 7,
      "description": "string",
      "cable": {
        "id": 2,
        "url": "string",
        "label": "string"
      },
      "cable_peer": {},
      "cable_peer_type": "string",
      "tags": [
        {
          "id": 6,
          "url": "string",
          "name": "string",
          "slug": "string",
          "color": "string"
        },
        {
          "id": 9,
          "url": "string",
          "name": "string",
          "slug": "string",
          "color": "string"
        },
        {
          "id": 1,
          "url": "string",
          "name": "string",
          "slug": "string",
          "color": "string"
        },
        {
          "id": 8,
          "url": "string",
          "name": "string",
          "slug": "string",
          "color": "string"
        },
        {
          "id": 10,
          "url": "string",
          "name": "string",
          "slug": "string",
          "color": "string"
        },
        {
          "id": 2,
          "url": "string",
          "name": "string",
          "slug": "string",
          "color": "string"
        },
        {
          "id": 2,
          "url": "string",
          "name": "string",
          "slug": "string",
          "color": "string"
        },
        {
          "id": 9,
          "url": "string",
          "name": "string",
          "slug": "string",
          "color": "string"
        },
        {
          "id": 10,
          "url": "string",
          "name": "string",
          "slug": "string",
          "color": "string"
        }
      ]
    },
    {
      "id": 7,
      "url": "string",
      "device": {
        "id": 1,
        "url": "string",
        "name": "string",
        "display_name": "string"
      },
      "name": "string",
      "label": "string",
      "type": {
        "label": "LC/APC",
        "value": "st"
      },
      "positions": 8,
      "description": "string",
      "cable": {
        "id": 8,
        "url": "string",
        "label": "string"
      },
      "cable_peer": {},
      "cable_peer_type": "string",
      "tags": [
        {
          "id": 9,
          "url": "string",
          "name": "string",
          "slug": "string",
          "color": "string"
        },
        {
          "id": 2,
          "url": "string",
          "name": "string",
          "slug": "string",
          "color": "string"
        },
        {
          "id": 8,
          "url": "string",
          "name": "string",
          "slug": "string",
          "color": "string"
        },
        {
          "id": 8,
          "url": "string",
          "name": "string",
          "slug": "string",
          "color": "string"
        },
        {
          "id": 9,
          "url": "string",
          "name": "string",
          "slug": "string",
          "color": "string"
        },
        {
          "id": 6,
          "url": "string",
          "name": "string",
          "slug": "string",
          "color": "string"
        },
        {
          "id": 8,
          "url": "string",
          "name": "string",
          "slug": "string",
          "color": "string"
        }
      ]
    }
  ]
}