{
  "count": 1,
  "next": "string",
  "previous": "string",
  "results": [
    {
      "id": 4,
      "url": "string",
      "app_label": "string",
      "model": "string",
      "display_name": "string"
    },
    {
      "id": 4,
      "url": "string",
      "app_label": "string",
      "model": "string",
      "display_name": "string"
    },
    {
      "id": 6,
      "url": "string",
      "app_label": "string",
      "model": "string",
      "display_name": "string"
    },
    {
      "id": 1,
      "url": "string",
      "app_label": "string",
      "model": "string",
      "display_name": "string"
    },
    {
      "id": 6,
      "url": "string",
      "app_label": "string",
      "model": "string",
      "display_name": "string"
    },
    {
      "id": 6,
      "url": "string",
      "app_label": "string",
      "model": "string",
      "display_name": "string"
    },
    {
      "id": 2,
      "url": "string",
      "app_label": "string",
      "model": "string",
      "display_name": "string"
    },
    {
      "id": 6,
      "url": "string",
      "app_label": "string",
      "model": "string",
      "display_name": "string"
    },
    {
      "id": 9,
      "url": "string",
      "app_label": "string",
      "model": "string",
      "display_name": "string"
    }
  ]
}