{
  "count": 2,
  "next": "string",
  "previous": "string",
  "results": [
    {
      "id": 10,
      "url": "string",
      "time": "string",
      "user": {
        "id": 7,
        "url": "string",
        "username": "string"
      },
      "user_name": "string",
      "request_id": "string",
      "action": {
        "label": "Created",
        "value": "update"
      },
      "changed_object_type": "string",
      "changed_object_id": 4,
      "changed_object": {},
      "object_data": "string"
    },
    {
      "id": 10,
      "url": "string",
      "time": "string",
      "user": {
        "id": 4,
        "url": "string",
        "username": "string"
      },
      "user_name": "string",
      "request_id": "string",
      "action": {
        "label": "Deleted",
        "value": "update"
      },
      "changed_object_type": "string",
      "changed_object_id": 3,
      "changed_object": {},
      "object_data": "string"
    },
    {
      "id": 1,
      "url": "string",
      "time": "string",
      "user": {
        "id": 2,
        "url": "string",
        "username": "string"
      },
      "user_name": "string",
      "request_id": "string",
      "action": {
        "label": "Created",
        "value": "update"
      },
      "changed_object_type": "string",
      "changed_object_id": 9,
      "changed_object": {},
      "object_data": "string"
    },
    {
      "id": 4,
      "url": "string",
      "time": "string",
      "user": {
        "id": 9,
        "url": "string",
        "username": "string"
      },
      "user_name": "string",
      "request_id": "string",
      "action": {
        "label": "Updated",
        "value": "create"
      },
      "changed_object_type": "string",
      "changed_object_id": 2,
      "changed_object": {},
      "object_data": "string"
    },
    {
      "id": 7,
      "url": "string",
      "time": "string",
      "user": {
        "id": 3,
        "url": "string",
        "username": "string"
      },
      "user_name": "string",
      "request_id": "string",
      "action": {
        "label": "Updated",
        "value": "create"
      },
      "changed_object_type": "string",
      "changed_object_id": 1,
      "changed_object": {},
      "object_data": "string"
    },
    {
      "id": 8,
      "url": "string",
      "time": "string",
      "user": {
        "id": 5,
        "url": "string",
        "username": "string"
      },
      "user_name": "string",
      "request_id": "string",
      "action": {
        "label": "Deleted",
        "value": "delete"
      },
      "changed_object_type": "string",
      "changed_object_id": 6,
      "changed_object": {},
      "object_data": "string"
    },
    {
      "id": 9,
      "url": "string",
      "time": "string",
      "user": {
        "id": 4,
        "url": "string",
        "username": "string"
      },
      "user_name": "string",
      "request_id": "string",
      "action": {
        "label": "Created",
        "value": "create"
      },
      "changed_object_type": "string",
      "changed_object_id": 9,
      "changed_object": {},
      "object_data": "string"
    },
    {
      "id": 7,
      "url": "string",
      "time": "string",
      "user": {
        "id": 1,
        "url": "string",
        "username": "string"
      },
      "user_name": "string",
      "request_id": "string",
      "action": {
        "label": "Deleted",
        "value": "create"
      },
      "changed_object_type": "string",
      "changed_object_id": 8,
      "changed_object": {},
      "object_data": "string"
    },
    {
      "id": 1,
      "url": "string",
      "time": "string",
      "user": {
        "id": 7,
        "url": "string",
        "username": "string"
      },
      "user_name": "string",
      "request_id": "string",
      "action": {
        "label": "Created",
        "value": "delete"
      },
      "changed_object_type": "string",
      "changed_object_id": 8,
      "changed_object": {},
      "object_data": "string"
    },
    {
      "id": 10,
      "url": "string",
      "time": "string",
      "user": {
        "id": 8,
        "url": "string",
        "username": "string"
      },
      "user_name": "string",
      "request_id": "string",
      "action": {
        "label": "Updated",
        "value": "create"
      },
      "changed_object_type": "string",
      "changed_object_id": 10,
      "changed_object": {},
      "object_data": "string"
    }
  ]
}