{
  "id": 8,
  "url": "string",
  "site": {
    "id": 4,
    "url": "string",
    "name": "string",
    "slug": "string"
  },
  "rack_group": {
    "id": 10,
    "url": "string",
    "name": "string",
    "slug": "string",
    "rack_count": 4,
    "_depth": 3
  },
  "name": "string",
  "tags": [
    {
      "id": 9,
      "url": "string",
      "name": "string",
      "slug": "string",
      "color": "string"
    },
    {
      "id": 3,
      "url": "string",
      "name": "string",
      "slug": "string",
      "color": "string"
    },
    {
      "id": 5,
      "url": "string",
      "name": "string",
      "slug": "string",
      "color": "string"
    },
    {
      "id": 10,
      "url": "string",
      "name": "string",
      "slug": "string",
      "color": "string"
    },
    {
      "id": 7,
      "url": "string",
      "name": "string",
      "slug": "string",
      "color": "string"
    },
    {
      "id": 3,
      "url": "string",
      "name": "string",
      "slug": "string",
      "color": "string"
    },
    {
      "id": 1,
      "url": "string",
      "name": "string",
      "slug": "string",
      "color": "string"
    }
  ],
  "custom_fields": {},
  "powerfeed_count": 3
}