{
  "id": 9,
  "url": "string",
  "device": {
    "id": 7,
    "url": "string",
    "name": "string",
    "display_name": "string"
  },
  "name": "string",
  "label": "string",
  "type": {
    "label": "NEMA 15-15R",
    "value": "ita-h"
  },
  "power_port": {
    "id": 7,
    "url": "string",
    "device": {
      "id": 1,
      "url": "string",
      "name": "string",
      "display_name": "string"
    },
    "name": "string",
    "cable": 5
  },
  "feed_leg": {
    "label": "A",
    "value": "B"
  },
  "description": "string",
  "cable": {
    "id": 10,
    "url": "string",
    "label": "string"
  },
  "cable_peer": {},
  "cable_peer_type": "string",
  "connected_endpoint": {},
  "connected_endpoint_type": "string",
  "connected_endpoint_reachable": true,
  "tags": [
    {
      "id": 6,
      "url": "string",
      "name": "string",
      "slug": "string",
      "color": "string"
    },
    {
      "id": 10,
      "url": "string",
      "name": "string",
      "slug": "string",
      "color": "string"
    },
    {
      "id": 2,
      "url": "string",
      "name": "string",
      "slug": "string",
      "color": "string"
    },
    {
      "id": 2,
      "url": "string",
      "name": "string",
      "slug": "string",
      "color": "string"
    },
    {
      "id": 3,
      "url": "string",
      "name": "string",
      "slug": "string",
      "color": "string"
    },
    {
      "id": 9,
      "url": "string",
      "name": "string",
      "slug": "string",
      "color": "string"
    },
    {
      "id": 4,
      "url": "string",
      "name": "string",
      "slug": "string",
      "color": "string"
    },
    {
      "id": 8,
      "url": "string",
      "name": "string",
      "slug": "string",
      "color": "string"
    }
  ]
}