{
  "id": 2,
  "url": "string",
  "device_type": {
    "id": 9,
    "url": "string",
    "manufacturer": {
      "id": 2,
      "url": "string",
      "name": "string",
      "slug": "string",
      "devicetype_count": 9
    },
    "model": "string",
    "slug": "string",
    "display_name": "string",
    "device_count": 9
  },
  "name": "string",
  "label": "string",
  "type": {
    "label": "FC",
    "value": "110-punch"
  },
  "positions": 8,
  "description": "string"
}