{
  "id": 7,
  "url": "string",
  "username": "string",
  "password": "string",
  "first_name": "string",
  "last_name": "string",
  "email": "string",
  "is_staff": false,
  "is_active": true,
  "date_joined": "string",
  "groups": [
    {
      "id": 1,
      "url": "string",
      "name": "string"
    },
    {
      "id": 6,
      "url": "string",
      "name": "string"
    },
    {
      "id": 2,
      "url": "string",
      "name": "string"
    },
    {
      "id": 8,
      "url": "string",
      "name": "string"
    }
  ]
}