{
  "id": 10,
  "url": "string",
  "name": "string",
  "slug": "string",
  "manufacturer": {
    "id": 6,
    "url": "string",
    "name": "string",
    "slug": "string",
    "devicetype_count": 8
  },
  "napalm_driver": "string",
  "napalm_args": "string",
  "description": "string",
  "device_count": 6,
  "virtualmachine_count": 3
}