{
  "id": 10,
  "url": "string",
  "content_types": [
    "string",
    "string",
    "string",
    "string",
    "string",
    "string",
    "string",
    "string",
    "string"
  ],
  "type": {
    "label": "Boolean (true/false)",
    "value": "date"
  },
  "name": "string",
  "label": "string",
  "description": "string",
  "required": true,
  "filter_logic": {
    "label": "Loose",
    "value": "loose"
  },
  "default": "string",
  "weight": 2,
  "validation_minimum": 1,
  "validation_maximum": 9,
  "validation_regex": "string",
  "choices": [
    "string",
    "string",
    "string",
    "string",
    "string",
    "string",
    "string",
    "string",
    "string",
    "string"
  ]
}