{
  "id": 9,
  "url": "string",
  "device": {
    "id": 9,
    "url": "string",
    "name": "string",
    "display_name": "string"
  },
  "name": "string",
  "label": "string",
  "type": {
    "label": "QSFP56 (200GE)",
    "value": "100gbase-x-qsfp28"
  },
  "enabled": false,
  "lag": {
    "id": 3,
    "url": "string",
    "device": {
      "id": 4,
      "url": "string",
      "name": "string",
      "display_name": "string"
    },
    "name": "string",
    "cable": 1
  },
  "mtu": 2,
  "mac_address": "string",
  "mgmt_only": true,
  "description": "string",
  "mode": {
    "label": "Tagged (All)",
    "value": "tagged-all"
  },
  "untagged_vlan": {
    "id": 7,
    "url": "string",
    "vid": 9,
    "name": "string",
    "display_name": "string"
  },
  "tagged_vlans": [
    {
      "id": 3,
      "url": "string",
      "vid": 6,
      "name": "string",
      "display_name": "string"
    },
    {
      "id": 7,
      "url": "string",
      "vid": 10,
      "name": "string",
      "display_name": "string"
    },
    {
      "id": 2,
      "url": "string",
      "vid": 7,
      "name": "string",
      "display_name": "string"
    },
    {
      "id": 4,
      "url": "string",
      "vid": 5,
      "name": "string",
      "display_name": "string"
    },
    {
      "id": 2,
      "url": "string",
      "vid": 3,
      "name": "string",
      "display_name": "string"
    },
    {
      "id": 8,
      "url": "string",
      "vid": 1,
      "name": "string",
      "display_name": "string"
    },
    {
      "id": 8,
      "url": "string",
      "vid": 4,
      "name": "string",
      "display_name": "string"
    },
    {
      "id": 5,
      "url": "string",
      "vid": 2,
      "name": "string",
      "display_name": "string"
    },
    {
      "id": 10,
      "url": "string",
      "vid": 6,
      "name": "string",
      "display_name": "string"
    },
    {
      "id": 2,
      "url": "string",
      "vid": 3,
      "name": "string",
      "display_name": "string"
    }
  ],
  "cable": {
    "id": 4,
    "url": "string",
    "label": "string"
  },
  "cable_peer": {},
  "cable_peer_type": "string",
  "connected_endpoint": {},
  "connected_endpoint_type": "string",
  "connected_endpoint_reachable": true,
  "tags": [
    {
      "id": 3,
      "url": "string",
      "name": "string",
      "slug": "string",
      "color": "string"
    },
    {
      "id": 5,
      "url": "string",
      "name": "string",
      "slug": "string",
      "color": "string"
    },
    {
      "id": 5,
      "url": "string",
      "name": "string",
      "slug": "string",
      "color": "string"
    },
    {
      "id": 7,
      "url": "string",
      "name": "string",
      "slug": "string",
      "color": "string"
    },
    {
      "id": 10,
      "url": "string",
      "name": "string",
      "slug": "string",
      "color": "string"
    },
    {
      "id": 9,
      "url": "string",
      "name": "string",
      "slug": "string",
      "color": "string"
    },
    {
      "id": 10,
      "url": "string",
      "name": "string",
      "slug": "string",
      "color": "string"
    },
    {
      "id": 5,
      "url": "string",
      "name": "string",
      "slug": "string",
      "color": "string"
    }
  ],
  "count_ipaddresses": 6
}