{
  "id": 1,
  "url": "string",
  "device_type": {
    "id": 1,
    "url": "string",
    "manufacturer": {
      "id": 8,
      "url": "string",
      "name": "string",
      "slug": "string",
      "devicetype_count": 1
    },
    "model": "string",
    "slug": "string",
    "display_name": "string",
    "device_count": 10
  },
  "name": "string",
  "label": "string",
  "type": {
    "label": "110 Punch",
    "value": "tera-2p"
  },
  "positions": 8,
  "description": "string"
}