{
  "id": 8,
  "url": "string",
  "name": "string",
  "slug": "string",
  "group": {
    "id": 3,
    "url": "string",
    "name": "string",
    "slug": "string",
    "tenant_count": 4,
    "_depth": 10
  },
  "description": "string",
  "comments": "string",
  "tags": [
    {
      "id": 2,
      "url": "string",
      "name": "string",
      "slug": "string",
      "color": "string"
    },
    {
      "id": 10,
      "url": "string",
      "name": "string",
      "slug": "string",
      "color": "string"
    },
    {
      "id": 8,
      "url": "string",
      "name": "string",
      "slug": "string",
      "color": "string"
    },
    {
      "id": 9,
      "url": "string",
      "name": "string",
      "slug": "string",
      "color": "string"
    },
    {
      "id": 1,
      "url": "string",
      "name": "string",
      "slug": "string",
      "color": "string"
    }
  ],
  "custom_fields": {},
  "created": "string",
  "last_updated": "string",
  "circuit_count": 9,
  "device_count": 10,
  "ipaddress_count": 1,
  "prefix_count": 5,
  "rack_count": 5,
  "site_count": 9,
  "virtualmachine_count": 4,
  "vlan_count": 10,
  "vrf_count": 2,
  "cluster_count": 7
}