{
  "id": 3,
  "url": "string",
  "name": "string",
  "type": {
    "id": 6,
    "url": "string",
    "name": "string",
    "slug": "string",
    "cluster_count": 7
  },
  "group": {
    "id": 10,
    "url": "string",
    "name": "string",
    "slug": "string",
    "cluster_count": 10
  },
  "tenant": {
    "id": 6,
    "url": "string",
    "name": "string",
    "slug": "string"
  },
  "site": {
    "id": 4,
    "url": "string",
    "name": "string",
    "slug": "string"
  },
  "comments": "string",
  "tags": [
    {
      "id": 1,
      "url": "string",
      "name": "string",
      "slug": "string",
      "color": "string"
    },
    {
      "id": 1,
      "url": "string",
      "name": "string",
      "slug": "string",
      "color": "string"
    },
    {
      "id": 5,
      "url": "string",
      "name": "string",
      "slug": "string",
      "color": "string"
    },
    {
      "id": 9,
      "url": "string",
      "name": "string",
      "slug": "string",
      "color": "string"
    },
    {
      "id": 4,
      "url": "string",
      "name": "string",
      "slug": "string",
      "color": "string"
    },
    {
      "id": 7,
      "url": "string",
      "name": "string",
      "slug": "string",
      "color": "string"
    },
    {
      "id": 6,
      "url": "string",
      "name": "string",
      "slug": "string",
      "color": "string"
    },
    {
      "id": 10,
      "url": "string",
      "name": "string",
      "slug": "string",
      "color": "string"
    },
    {
      "id": 8,
      "url": "string",
      "name": "string",
      "slug": "string",
      "color": "string"
    }
  ],
  "custom_fields": {},
  "created": "string",
  "last_updated": "string",
  "device_count": 10,
  "virtualmachine_count": 1
}