{
  "count": 1,
  "next": "string",
  "previous": "string",
  "results": [
    {
      "id": 2,
      "url": "string",
      "device": {
        "id": 8,
        "url": "string",
        "name": "string",
        "display_name": "string"
      },
      "name": "string",
      "label": "string",
      "type": {
        "label": "USB Mini B",
        "value": "rj-12"
      },
      "description": "string",
      "cable": {
        "id": 3,
        "url": "string",
        "label": "string"
      },
      "cable_peer": {},
      "cable_peer_type": "string",
      "connected_endpoint": {},
      "connected_endpoint_type": "string",
      "connected_endpoint_reachable": false,
      "tags": [
        {
          "id": 1,
          "url": "string",
          "name": "string",
          "slug": "string",
          "color": "string"
        },
        {
          "id": 1,
          "url": "string",
          "name": "string",
          "slug": "string",
          "color": "string"
        },
        {
          "id": 8,
          "url": "string",
          "name": "string",
          "slug": "string",
          "color": "string"
        },
        {
          "id": 2,
          "url": "string",
          "name": "string",
          "slug": "string",
          "color": "string"
        },
        {
          "id": 9,
          "url": "string",
          "name": "string",
          "slug": "string",
          "color": "string"
        },
        {
          "id": 9,
          "url": "string",
          "name": "string",
          "slug": "string",
          "color": "string"
        },
        {
          "id": 8,
          "url": "string",
          "name": "string",
          "slug": "string",
          "color": "string"
        },
        {
          "id": 7,
          "url": "string",
          "name": "string",
          "slug": "string",
          "color": "string"
        }
      ]
    },
    {
      "id": 9,
      "url": "string",
      "device": {
        "id": 2,
        "url": "string",
        "name": "string",
        "display_name": "string"
      },
      "name": "string",
      "label": "string",
      "type": {
        "label": "RJ-45",
        "value": "de-9"
      },
      "description": "string",
      "cable": {
        "id": 2,
        "url": "string",
        "label": "string"
      },
      "cable_peer": {},
      "cable_peer_type": "string",
      "connected_endpoint": {},
      "connected_endpoint_type": "string",
      "connected_endpoint_reachable": true,
      "tags": [
        {
          "id": 5,
          "url": "string",
          "name": "string",
          "slug": "string",
          "color": "string"
        },
        {
          "id": 4,
          "url": "string",
          "name": "string",
          "slug": "string",
          "color": "string"
        },
        {
          "id": 2,
          "url": "string",
          "name": "string",
          "slug": "string",
          "color": "string"
        },
        {
          "id": 2,
          "url": "string",
          "name": "string",
          "slug": "string",
          "color": "string"
        }
      ]
    },
    {
      "id": 10,
      "url": "string",
      "device": {
        "id": 7,
        "url": "string",
        "name": "string",
        "display_name": "string"
      },
      "name": "string",
      "label": "string",
      "type": {
        "label": "DB-25",
        "value": "de-9"
      },
      "description": "string",
      "cable": {
        "id": 4,
        "url": "string",
        "label": "string"
      },
      "cable_peer": {},
      "cable_peer_type": "string",
      "connected_endpoint": {},
      "connected_endpoint_type": "string",
      "connected_endpoint_reachable": true,
      "tags": [
        {
          "id": 3,
          "url": "string",
          "name": "string",
          "slug": "string",
          "color": "string"
        },
        {
          "id": 9,
          "url": "string",
          "name": "string",
          "slug": "string",
          "color": "string"
        },
        {
          "id": 1,
          "url": "string",
          "name": "string",
          "slug": "string",
          "color": "string"
        },
        {
          "id": 9,
          "url": "string",
          "name": "string",
          "slug": "string",
          "color": "string"
        },
        {
          "id": 10,
          "url": "string",
          "name": "string",
          "slug": "string",
          "color": "string"
        },
        {
          "id": 8,
          "url": "string",
          "name": "string",
          "slug": "string",
          "color": "string"
        }
      ]
    },
    {
      "id": 10,
      "url": "string",
      "device": {
        "id": 1,
        "url": "string",
        "name": "string",
        "display_name": "string"
      },
      "name": "string",
      "label": "string",
      "type": {
        "label": "USB Mini A",
        "value": "usb-micro-b"
      },
      "description": "string",
      "cable": {
        "id": 10,
        "url": "string",
        "label": "string"
      },
      "cable_peer": {},
      "cable_peer_type": "string",
      "connected_endpoint": {},
      "connected_endpoint_type": "string",
      "connected_endpoint_reachable": true,
      "tags": [
        {
          "id": 7,
          "url": "string",
          "name": "string",
          "slug": "string",
          "color": "string"
        },
        {
          "id": 10,
          "url": "string",
          "name": "string",
          "slug": "string",
          "color": "string"
        },
        {
          "id": 7,
          "url": "string",
          "name": "string",
          "slug": "string",
          "color": "string"
        },
        {
          "id": 5,
          "url": "string",
          "name": "string",
          "slug": "string",
          "color": "string"
        },
        {
          "id": 7,
          "url": "string",
          "name": "string",
          "slug": "string",
          "color": "string"
        },
        {
          "id": 9,
          "url": "string",
          "name": "string",
          "slug": "string",
          "color": "string"
        },
        {
          "id": 5,
          "url": "string",
          "name": "string",
          "slug": "string",
          "color": "string"
        },
        {
          "id": 8,
          "url": "string",
          "name": "string",
          "slug": "string",
          "color": "string"
        },
        {
          "id": 1,
          "url": "string",
          "name": "string",
          "slug": "string",
          "color": "string"
        }
      ]
    },
    {
      "id": 2,
      "url": "string",
      "device": {
        "id": 5,
        "url": "string",
        "name": "string",
        "display_name": "string"
      },
      "name": "string",
      "label": "string",
      "type": {
        "label": "USB Micro A",
        "value": "usb-micro-a"
      },
      "description": "string",
      "cable": {
        "id": 4,
        "url": "string",
        "label": "string"
      },
      "cable_peer": {},
      "cable_peer_type": "string",
      "connected_endpoint": {},
      "connected_endpoint_type": "string",
      "connected_endpoint_reachable": true,
      "tags": [
        {
          "id": 2,
          "url": "string",
          "name": "string",
          "slug": "string",
          "color": "string"
        },
        {
          "id": 3,
          "url": "string",
          "name": "string",
          "slug": "string",
          "color": "string"
        },
        {
          "id": 1,
          "url": "string",
          "name": "string",
          "slug": "string",
          "color": "string"
        },
        {
          "id": 6,
          "url": "string",
          "name": "string",
          "slug": "string",
          "color": "string"
        },
        {
          "id": 8,
          "url": "string",
          "name": "string",
          "slug": "string",
          "color": "string"
        },
        {
          "id": 7,
          "url": "string",
          "name": "string",
          "slug": "string",
          "color": "string"
        },
        {
          "id": 3,
          "url": "string",
          "name": "string",
          "slug": "string",
          "color": "string"
        },
        {
          "id": 7,
          "url": "string",
          "name": "string",
          "slug": "string",
          "color": "string"
        },
        {
          "id": 3,
          "url": "string",
          "name": "string",
          "slug": "string",
          "color": "string"
        },
        {
          "id": 3,
          "url": "string",
          "name": "string",
          "slug": "string",
          "color": "string"
        }
      ]
    },
    {
      "id": 3,
      "url": "string",
      "device": {
        "id": 1,
        "url": "string",
        "name": "string",
        "display_name": "string"
      },
      "name": "string",
      "label": "string",
      "type": {
        "label": "USB Type B",
        "value": "rj-11"
      },
      "description": "string",
      "cable": {
        "id": 10,
        "url": "string",
        "label": "string"
      },
      "cable_peer": {},
      "cable_peer_type": "string",
      "connected_endpoint": {},
      "connected_endpoint_type": "string",
      "connected_endpoint_reachable": false,
      "tags": [
        {
          "id": 4,
          "url": "string",
          "name": "string",
          "slug": "string",
          "color": "string"
        },
        {
          "id": 4,
          "url": "string",
          "name": "string",
          "slug": "string",
          "color": "string"
        }
      ]
    },
    {
      "id": 5,
      "url": "string",
      "device": {
        "id": 8,
        "url": "string",
        "name": "string",
        "display_name": "string"
      },
      "name": "string",
      "label": "string",
      "type": {
        "label": "DE-9",
        "value": "usb-micro-a"
      },
      "description": "string",
      "cable": {
        "id": 1,
        "url": "string",
        "label": "string"
      },
      "cable_peer": {},
      "cable_peer_type": "string",
      "connected_endpoint": {},
      "connected_endpoint_type": "string",
      "connected_endpoint_reachable": true,
      "tags": [
        {
          "id": 7,
          "url": "string",
          "name": "string",
          "slug": "string",
          "color": "string"
        },
        {
          "id": 3,
          "url": "string",
          "name": "string",
          "slug": "string",
          "color": "string"
        },
        {
          "id": 5,
          "url": "string",
          "name": "string",
          "slug": "string",
          "color": "string"
        },
        {
          "id": 10,
          "url": "string",
          "name": "string",
          "slug": "string",
          "color": "string"
        },
        {
          "id": 3,
          "url": "string",
          "name": "string",
          "slug": "string",
          "color": "string"
        }
      ]
    },
    {
      "id": 9,
      "url": "string",
      "device": {
        "id": 7,
        "url": "string",
        "name": "string",
        "display_name": "string"
      },
      "name": "string",
      "label": "string",
      "type": {
        "label": "USB Type C",
        "value": "usb-micro-b"
      },
      "description": "string",
      "cable": {
        "id": 4,
        "url": "string",
        "label": "string"
      },
      "cable_peer": {},
      "cable_peer_type": "string",
      "connected_endpoint": {},
      "connected_endpoint_type": "string",
      "connected_endpoint_reachable": false,
      "tags": [
        {
          "id": 10,
          "url": "string",
          "name": "string",
          "slug": "string",
          "color": "string"
        },
        {
          "id": 9,
          "url": "string",
          "name": "string",
          "slug": "string",
          "color": "string"
        },
        {
          "id": 9,
          "url": "string",
          "name": "string",
          "slug": "string",
          "color": "string"
        }
      ]
    },
    {
      "id": 4,
      "url": "string",
      "device": {
        "id": 6,
        "url": "string",
        "name": "string",
        "display_name": "string"
      },
      "name": "string",
      "label": "string",
      "type": {
        "label": "RJ-45",
        "value": "de-9"
      },
      "description": "string",
      "cable": {
        "id": 7,
        "url": "string",
        "label": "string"
      },
      "cable_peer": {},
      "cable_peer_type": "string",
      "connected_endpoint": {},
      "connected_endpoint_type": "string",
      "connected_endpoint_reachable": true,
      "tags": [
        {
          "id": 7,
          "url": "string",
          "name": "string",
          "slug": "string",
          "color": "string"
        },
        {
          "id": 1,
          "url": "string",
          "name": "string",
          "slug": "string",
          "color": "string"
        },
        {
          "id": 8,
          "url": "string",
          "name": "string",
          "slug": "string",
          "color": "string"
        },
        {
          "id": 9,
          "url": "string",
          "name": "string",
          "slug": "string",
          "color": "string"
        },
        {
          "id": 3,
          "url": "string",
          "name": "string",
          "slug": "string",
          "color": "string"
        },
        {
          "id": 3,
          "url": "string",
          "name": "string",
          "slug": "string",
          "color": "string"
        }
      ]
    }
  ]
}