{
  "id": 9,
  "url": "string",
  "device_type": {
    "id": 3,
    "url": "string",
    "manufacturer": {
      "id": 1,
      "url": "string",
      "name": "string",
      "slug": "string",
      "devicetype_count": 4
    },
    "model": "string",
    "slug": "string",
    "display_name": "string",
    "device_count": 8
  },
  "name": "string",
  "label": "string",
  "type": {
    "label": "MPO",
    "value": "lsh-apc"
  },
  "rear_port": {
    "id": 8,
    "url": "string",
    "name": "string"
  },
  "rear_port_position": 1,
  "description": "string"
}