{
  "id": 6,
  "url": "string",
  "termination_a_type": "string",
  "termination_a_id": 6,
  "termination_a": {},
  "termination_b_type": "string",
  "termination_b_id": 10,
  "termination_b": {},
  "type": "aoc",
  "status": {
    "label": "Decommissioning",
    "value": "connected"
  },
  "label": "string",
  "color": "string",
  "length": 6,
  "length_unit": {
    "label": "Meters",
    "value": "ft"
  },
  "tags": [
    {
      "id": 3,
      "url": "string",
      "name": "string",
      "slug": "string",
      "color": "string"
    }
  ],
  "custom_fields": {}
}