{
  "id": 4,
  "url": "string",
  "name": "string",
  "description": "string",
  "enabled": true,
  "object_types": [
    "string"
  ],
  "groups": [
    {
      "id": 1,
      "url": "string",
      "name": "string"
    },
    {
      "id": 6,
      "url": "string",
      "name": "string"
    },
    {
      "id": 2,
      "url": "string",
      "name": "string"
    },
    {
      "id": 3,
      "url": "string",
      "name": "string"
    }
  ],
  "users": [
    {
      "id": 10,
      "url": "string",
      "username": "string"
    }
  ],
  "actions": [
    "string",
    "string"
  ],
  "constraints": "string"
}