{
  "actions": [
    {
      "name": "searchAssets",
      "protocol": "REST",
      "method": "GET",
      "entitypath": "{base_path}/{version}/v1/search/assets?{query}",
      "requestSchema": "schema.json",
      "responseSchema": "schema.json",
      "timeout": 0,
      "sendEmpty": false,
      "sendGetBody": false,
      "requestDatatype": "JSON",
      "responseDatatype": "JSON",
      "headers": {},
      "responseObjects": [
        {
          "type": "default",
          "key": "",
          "mockFile": "mockdatafiles/searchAssets-default.json"
        }
      ]
    },
    {
      "name": "searchAndDownloadAssets",
      "protocol": "REST",
      "method": "GET",
      "entitypath": "{base_path}/{version}/v1/search/assets/download?{query}",
      "requestSchema": "schema.json",
      "responseSchema": "schema.json",
      "timeout": 0,
      "sendEmpty": false,
      "sendGetBody": false,
      "requestDatatype": "JSON",
      "responseDatatype": "JSON",
      "headers": {},
      "responseObjects": [
        {
          "type": "default",
          "key": "",
          "mockFile": ""
        }
      ]
    },
    {
      "name": "search",
      "protocol": "REST",
      "method": "GET",
      "entitypath": "{base_path}/{version}/v1/search?{query}",
      "requestSchema": "schema.json",
      "responseSchema": "schema.json",
      "timeout": 0,
      "sendEmpty": false,
      "sendGetBody": false,
      "requestDatatype": "JSON",
      "responseDatatype": "JSON",
      "headers": {},
      "responseObjects": [
        {
          "type": "default",
          "key": "",
          "mockFile": "mockdatafiles/search-default.json"
        }
      ]
    }
  ]
}