{
  "userId": "string",
  "firstName": "string",
  "lastName": "string",
  "emailAddress": "string",
  "source": "string",
  "status": "changepassword",
  "readOnly": true,
  "roles": [
    "string",
    "string",
    "string",
    "string",
    "string",
    "string",
    "string",
    "string",
    "string"
  ],
  "externalRoles": [
    "string",
    "string",
    "string",
    "string",
    "string",
    "string",
    "string"
  ]
}