{
  "created": "2018-02-01T08:00:00.000000Z",
  "description": "",
  "dtend": "2015-11-17T05:00:00Z",
  "dtstart": "2015-11-17T05:00:00Z",
  "enabled": true,
  "extra_data": {
    "var1": "$encrypted$"
  },
  "id": 1,
  "modified": "2018-02-01T08:00:00.000000Z",
  "name": "test sch",
  "related": {
    "credentials": "/api/v2/schedules/1/credentials/",
    "inventory": "/api/v2/inventories/1/",
    "project": "/api/v2/projects/1/",
    "unified_job_template": "/api/v2/job_templates/2/",
    "unified_jobs": "/api/v2/schedules/1/jobs/"
  },
  "rrule": "DTSTART:20151117T050000Z RRULE:FREQ=DAILY;INTERVAL=1;COUNT=1",
  "summary_fields": {
    "inventory": {
      "description": "",
      "groups_with_active_failures": 0,
      "has_active_failures": false,
      "has_inventory_sources": false,
      "hosts_with_active_failures": 0,
      "id": 1,
      "inventory_sources_with_failures": 0,
      "kind": "",
      "name": "test-inv",
      "organization_id": 1,
      "total_groups": 0,
      "total_hosts": 0,
      "total_inventory_sources": 0
    },
    "unified_job_template": {
      "description": "",
      "id": 2,
      "name": "test-jt",
      "unified_job_type": "job"
    },
    "user_capabilities": {
      "delete": true,
      "edit": true
    }
  },
  "timezone": "UTC",
  "type": "schedule",
  "unified_job_template": 2,
  "until": "",
  "url": "/api/v2/schedules/1/"
}