{
  "always_nodes": [],
  "created": "2018-02-01T08:00:00.000000Z",
  "extra_data": {},
  "failure_nodes": [],
  "id": 1,
  "limit": "webservers",
  "modified": "2018-02-01T08:00:00.000000Z",
  "related": {
    "always_nodes": "/api/v2/workflow_job_template_nodes/1/always_nodes/",
    "credentials": "/api/v2/workflow_job_template_nodes/1/credentials/",
    "failure_nodes": "/api/v2/workflow_job_template_nodes/1/failure_nodes/",
    "success_nodes": "/api/v2/workflow_job_template_nodes/1/success_nodes/",
    "unified_job_template": "/api/v2/job_templates/3/",
    "workflow_job_template": "/api/v2/workflow_job_templates/2/"
  },
  "success_nodes": [],
  "summary_fields": {
    "unified_job_template": {
      "description": "",
      "id": 3,
      "name": "",
      "unified_job_type": "job"
    },
    "workflow_job_template": {
      "description": "",
      "id": 2,
      "name": "test-workflow_job_template"
    }
  },
  "type": "workflow_job_template_node",
  "unified_job_template": 3,
  "url": "/api/v2/workflow_job_template_nodes/1/",
  "workflow_job_template": 2
}