{
  "created": "2018-02-01T08:00:00.000000Z",
  "description": "",
  "id": 1,
  "injectors": {},
  "inputs": {},
  "kind": "cloud",
  "managed_by_tower": false,
  "modified": "2018-02-01T08:00:00.000000Z",
  "name": "Some Other Name",
  "related": {
    "activity_stream": "/api/v2/credential_types/1/activity_stream/",
    "credentials": "/api/v2/credential_types/1/credentials/"
  },
  "summary_fields": {
    "user_capabilities": {
      "delete": true,
      "edit": true
    }
  },
  "type": "credential_type",
  "url": "/api/v2/credential_types/1/"
}