{
  "$id": "schema.json",
  "type": "object",
  "schema": "http://json-schema.org/draft-07/schema#",
  "translate": true,
  "dynamicfields": true,
  "properties": {
    "ph_request_type": {
      "type": "string",
      "description": "type of request (internal to adapter)",
      "default": "credentialTypesCredentialTypesList",
      "enum": [
        "credentialTypesCredentialTypesList",
        "credentialTypesCredentialTypesCreate",
        "credentialTypesCredentialTypesRead",
        "credentialTypesCredentialTypesUpdate",
        "credentialTypesCredentialTypesDelete",
        "credentialTypesCredentialTypesPartialUpdate",
        "credentialTypesCredentialTypesActivityStreamList",
        "credentialTypesCredentialTypesCredentialsList",
        "credentialTypesCredentialTypesCredentialsCreate",
        "credentialTypesCredentialTypesTestRead",
        "credentialTypesCredentialTypesTestCreate"
      ],
      "external_name": "ph_request_type"
    },
    "pageSize": {
      "type": "number",
      "description": "Number of results to return per page.",
      "parse": false,
      "encode": false,
      "encrypt": {
        "type": "AES",
        "key": ""
      },
      "external_name": "page_size"
    }
  },
  "definitions": {}
}