{
  "allow_simultaneous": false,
  "ask_credential_on_launch": false,
  "ask_diff_mode_on_launch": false,
  "ask_inventory_on_launch": false,
  "ask_job_type_on_launch": false,
  "ask_limit_on_launch": false,
  "ask_scm_branch_on_launch": false,
  "ask_skip_tags_on_launch": false,
  "ask_tags_on_launch": false,
  "ask_variables_on_launch": false,
  "ask_verbosity_on_launch": false,
  "become_enabled": false,
  "created": "2018-02-01T08:00:00.000000Z",
  "description": "",
  "diff_mode": false,
  "extra_vars": "",
  "force_handlers": false,
  "forks": 0,
  "host_config_key": "",
  "id": 2,
  "inventory": 1,
  "job_slice_count": 1,
  "job_tags": "",
  "job_type": "run",
  "last_job_failed": false,
  "limit": "",
  "modified": "2018-02-01T08:00:00.000000Z",
  "name": "jt",
  "playbook": "helloworld.yml",
  "project": 1,
  "related": {
    "access_list": "/api/v2/job_templates/2/access_list/",
    "activity_stream": "/api/v2/job_templates/2/activity_stream/",
    "copy": "/api/v2/job_templates/2/copy/",
    "credentials": "/api/v2/job_templates/2/credentials/",
    "extra_credentials": "/api/v2/job_templates/2/extra_credentials/",
    "instance_groups": "/api/v2/job_templates/2/instance_groups/",
    "inventory": "/api/v2/inventories/1/",
    "jobs": "/api/v2/job_templates/2/jobs/",
    "labels": "/api/v2/job_templates/2/labels/",
    "launch": "/api/v2/job_templates/2/launch/",
    "notification_templates_error": "/api/v2/job_templates/2/notification_templates_error/",
    "notification_templates_started": "/api/v2/job_templates/2/notification_templates_started/",
    "notification_templates_success": "/api/v2/job_templates/2/notification_templates_success/",
    "object_roles": "/api/v2/job_templates/2/object_roles/",
    "project": "/api/v2/projects/1/",
    "schedules": "/api/v2/job_templates/2/schedules/",
    "slice_workflow_jobs": "/api/v2/job_templates/2/slice_workflow_jobs/",
    "survey_spec": "/api/v2/job_templates/2/survey_spec/"
  },
  "scm_branch": "",
  "skip_tags": "",
  "start_at_task": "",
  "status": "never updated",
  "summary_fields": {
    "credentials": [],
    "extra_credentials": [],
    "inventory": {
      "description": "",
      "groups_with_active_failures": 0,
      "has_active_failures": false,
      "has_inventory_sources": false,
      "hosts_with_active_failures": 0,
      "id": 1,
      "inventory_sources_with_failures": 0,
      "kind": "",
      "name": "test_inv",
      "organization_id": 1,
      "total_groups": 0,
      "total_hosts": 0,
      "total_inventory_sources": 0
    },
    "labels": {
      "count": 0,
      "results": []
    },
    "object_roles": {
      "admin_role": {
        "description": "Can manage all aspects of the job template",
        "id": 23,
        "name": "Admin"
      },
      "execute_role": {
        "description": "May run the job template",
        "id": 24,
        "name": "Execute"
      },
      "read_role": {
        "description": "May view settings for the job template",
        "id": 25,
        "name": "Read"
      }
    },
    "project": {
      "description": "test_proj-description",
      "id": 1,
      "name": "test_proj",
      "scm_type": "",
      "status": "missing"
    },
    "recent_jobs": [],
    "user_capabilities": {
      "copy": true,
      "delete": true,
      "edit": true,
      "schedule": true,
      "start": true
    }
  },
  "survey_enabled": false,
  "timeout": 0,
  "type": "job_template",
  "url": "/api/v2/job_templates/2/",
  "use_fact_cache": false,
  "verbosity": 0
}