{
  "count": 1,
  "results": [
    {
      "created": "2018-02-01T08:00:00.000000Z",
      "description": "",
      "groups_with_active_failures": 0,
      "has_active_failures": false,
      "has_inventory_sources": false,
      "hosts_with_active_failures": 0,
      "id": 1,
      "inventory_sources_with_failures": 0,
      "kind": "",
      "modified": "2018-02-01T08:00:00.000000Z",
      "name": "inventory-one",
      "organization": 1,
      "pending_deletion": false,
      "related": {
        "access_list": "/api/v2/inventories/1/access_list/",
        "activity_stream": "/api/v2/inventories/1/activity_stream/",
        "ad_hoc_commands": "/api/v2/inventories/1/ad_hoc_commands/",
        "copy": "/api/v2/inventories/1/copy/",
        "groups": "/api/v2/inventories/1/groups/",
        "hosts": "/api/v2/inventories/1/hosts/",
        "instance_groups": "/api/v2/inventories/1/instance_groups/",
        "inventory_sources": "/api/v2/inventories/1/inventory_sources/",
        "job_templates": "/api/v2/inventories/1/job_templates/",
        "object_roles": "/api/v2/inventories/1/object_roles/",
        "organization": "/api/v2/organizations/1/",
        "root_groups": "/api/v2/inventories/1/root_groups/",
        "script": "/api/v2/inventories/1/script/",
        "tree": "/api/v2/inventories/1/tree/",
        "update_inventory_sources": "/api/v2/inventories/1/update_inventory_sources/",
        "variable_data": "/api/v2/inventories/1/variable_data/"
      },
      "summary_fields": {
        "object_roles": {
          "adhoc_role": {
            "description": "May run ad hoc commands on the inventory",
            "id": 16,
            "name": "Ad Hoc"
          },
          "admin_role": {
            "description": "Can manage all aspects of the inventory",
            "id": 14,
            "name": "Admin"
          },
          "read_role": {
            "description": "May view settings for the inventory",
            "id": 18,
            "name": "Read"
          },
          "update_role": {
            "description": "May update the inventory",
            "id": 15,
            "name": "Update"
          },
          "use_role": {
            "description": "Can use the inventory in a job template",
            "id": 17,
            "name": "Use"
          }
        },
        "organization": {
          "description": "test-org-desc",
          "id": 1,
          "name": "test-org"
        },
        "user_capabilities": {
          "adhoc": false,
          "copy": false,
          "delete": false,
          "edit": false
        }
      },
      "total_groups": 0,
      "total_hosts": 0,
      "total_inventory_sources": 0,
      "type": "inventory",
      "url": "/api/v2/inventories/1/",
      "variables": ""
    }
  ]
}