{
  "count": 1,
  "results": [
    {
      "cloud": false,
      "created": "2018-02-01T08:00:00.000000Z",
      "credential_type": 1,
      "description": "",
      "id": 1,
      "inputs": {
        "username": "someusername"
      },
      "kind": "ssh",
      "modified": "2018-02-01T08:00:00.000000Z",
      "name": "Some name",
      "related": {
        "access_list": "/api/v2/credentials/1/access_list/",
        "activity_stream": "/api/v2/credentials/1/activity_stream/",
        "copy": "/api/v2/credentials/1/copy/",
        "credential_type": "/api/v2/credential_types/1/",
        "input_sources": "/api/v2/credentials/1/input_sources/",
        "object_roles": "/api/v2/credentials/1/object_roles/",
        "organization": "/api/v2/organizations/1/",
        "owner_teams": "/api/v2/credentials/1/owner_teams/",
        "owner_users": "/api/v2/credentials/1/owner_users/"
      },
      "summary_fields": {
        "object_roles": {
          "admin_role": {
            "description": "Can manage all aspects of the credential",
            "id": 17,
            "name": "Admin"
          },
          "read_role": {
            "description": "May view settings for the credential",
            "id": 19,
            "name": "Read"
          },
          "use_role": {
            "description": "Can use the credential in a job template",
            "id": 18,
            "name": "Use"
          }
        },
        "organization": {
          "description": "test-org-desc",
          "id": 1,
          "name": "test-org"
        },
        "owners": [
          {
            "description": "test-org-desc",
            "id": 1,
            "name": "test-org",
            "type": "organization",
            "url": "/api/v2/organizations/1/"
          },
          {
            "description": "",
            "id": 1,
            "name": "test-team",
            "type": "team",
            "url": "/api/v2/teams/1/"
          }
        ],
        "user_capabilities": {
          "copy": false,
          "delete": false,
          "edit": false,
          "use": true
        }
      },
      "type": "credential",
      "url": "/api/v2/credentials/1/"
    }
  ]
}