{
  "become_enabled": false,
  "controller_node": "",
  "created": "2018-02-01T08:00:00.000000Z",
  "diff_mode": false,
  "elapsed": 0,
  "event_processing_finished": false,
  "execution_node": "",
  "extra_vars": "",
  "failed": false,
  "forks": 0,
  "host_status_counts": {},
  "id": 4,
  "inventory": 1,
  "job_args": "",
  "job_cwd": "",
  "job_env": {},
  "job_explanation": "",
  "job_type": "run",
  "launch_type": "manual",
  "limit": "",
  "modified": "2018-02-01T08:00:00.000000Z",
  "module_args": "",
  "module_name": "",
  "name": "",
  "related": {
    "activity_stream": "/api/v2/ad_hoc_commands/4/activity_stream/",
    "cancel": "/api/v2/ad_hoc_commands/4/cancel/",
    "events": "/api/v2/ad_hoc_commands/4/events/",
    "inventory": "/api/v2/inventories/1/",
    "notifications": "/api/v2/ad_hoc_commands/4/notifications/",
    "relaunch": "/api/v2/ad_hoc_commands/4/relaunch/",
    "stdout": "/api/v2/ad_hoc_commands/4/stdout/"
  },
  "result_traceback": "",
  "status": "new",
  "summary_fields": {
    "inventory": {
      "description": "",
      "groups_with_active_failures": 0,
      "has_active_failures": false,
      "has_inventory_sources": true,
      "hosts_with_active_failures": 0,
      "id": 1,
      "inventory_sources_with_failures": 0,
      "kind": "",
      "name": "test-inv",
      "organization_id": 1,
      "total_groups": 0,
      "total_hosts": 0,
      "total_inventory_sources": 1
    },
    "user_capabilities": {
      "delete": true,
      "start": true
    }
  },
  "type": "ad_hoc_command",
  "url": "/api/v2/ad_hoc_commands/4/",
  "verbosity": 0
}