{
  "actions": [
    {
      "name": "customInventoryScriptsInventoryScriptsList",
      "protocol": "REST",
      "method": "GET",
      "entitypath": "{base_path}/{version}/api/v2/inventory_scripts/?{query}",
      "requestSchema": "schema.json",
      "responseSchema": "schema.json",
      "timeout": 0,
      "sendEmpty": false,
      "sendGetBody": false,
      "requestDatatype": "JSON",
      "responseDatatype": "JSON",
      "headers": {},
      "responseObjects": [
        {
          "type": "default",
          "key": "",
          "mockFile": ""
        }
      ]
    },
    {
      "name": "customInventoryScriptsInventoryScriptsCreate",
      "protocol": "REST",
      "method": "POST",
      "entitypath": "{base_path}/{version}/api/v2/inventory_scripts/?{query}",
      "requestSchema": "schema.json",
      "responseSchema": "schema.json",
      "timeout": 0,
      "sendEmpty": false,
      "sendGetBody": false,
      "requestDatatype": "JSON",
      "responseDatatype": "JSON",
      "headers": {},
      "responseObjects": [
        {
          "type": "default",
          "key": "",
          "mockFile": ""
        }
      ]
    },
    {
      "name": "customInventoryScriptsInventoryScriptsRead",
      "protocol": "REST",
      "method": "GET",
      "entitypath": "{base_path}/{version}/api/v2/inventory_scripts/{pathv1}/?{query}",
      "requestSchema": "schema.json",
      "responseSchema": "schema.json",
      "timeout": 0,
      "sendEmpty": false,
      "sendGetBody": false,
      "requestDatatype": "JSON",
      "responseDatatype": "JSON",
      "headers": {},
      "responseObjects": [
        {
          "type": "default",
          "key": "",
          "mockFile": ""
        }
      ]
    },
    {
      "name": "customInventoryScriptsInventoryScriptsUpdate",
      "protocol": "REST",
      "method": "PUT",
      "entitypath": "{base_path}/{version}/api/v2/inventory_scripts/{pathv1}/?{query}",
      "requestSchema": "schema.json",
      "responseSchema": "schema.json",
      "timeout": 0,
      "sendEmpty": false,
      "sendGetBody": false,
      "requestDatatype": "JSON",
      "responseDatatype": "JSON",
      "headers": {},
      "responseObjects": [
        {
          "type": "default",
          "key": "",
          "mockFile": ""
        }
      ]
    },
    {
      "name": "customInventoryScriptsInventoryScriptsDelete",
      "protocol": "REST",
      "method": "DELETE",
      "entitypath": "{base_path}/{version}/api/v2/inventory_scripts/{pathv1}/?{query}",
      "requestSchema": "schema.json",
      "responseSchema": "schema.json",
      "timeout": 0,
      "sendEmpty": false,
      "sendGetBody": false,
      "requestDatatype": "JSON",
      "responseDatatype": "JSON",
      "headers": {},
      "responseObjects": [
        {
          "type": "default",
          "key": "",
          "mockFile": ""
        }
      ]
    },
    {
      "name": "customInventoryScriptsInventoryScriptsPartialUpdate",
      "protocol": "REST",
      "method": "PATCH",
      "entitypath": "{base_path}/{version}/api/v2/inventory_scripts/{pathv1}/?{query}",
      "requestSchema": "schema.json",
      "responseSchema": "schema.json",
      "timeout": 0,
      "sendEmpty": false,
      "sendGetBody": false,
      "requestDatatype": "JSON",
      "responseDatatype": "JSON",
      "headers": {},
      "responseObjects": [
        {
          "type": "default",
          "key": "",
          "mockFile": ""
        }
      ]
    },
    {
      "name": "customInventoryScriptsInventoryScriptsCopyList",
      "protocol": "REST",
      "method": "GET",
      "entitypath": "{base_path}/{version}/api/v2/inventory_scripts/{pathv1}/copy/?{query}",
      "requestSchema": "schema.json",
      "responseSchema": "schema.json",
      "timeout": 0,
      "sendEmpty": false,
      "sendGetBody": false,
      "requestDatatype": "JSON",
      "responseDatatype": "JSON",
      "headers": {},
      "responseObjects": [
        {
          "type": "default",
          "key": "",
          "mockFile": ""
        }
      ]
    },
    {
      "name": "customInventoryScriptsInventoryScriptsCopyCreate",
      "protocol": "REST",
      "method": "POST",
      "entitypath": "{base_path}/{version}/api/v2/inventory_scripts/{pathv1}/copy/?{query}",
      "requestSchema": "schema.json",
      "responseSchema": "schema.json",
      "timeout": 0,
      "sendEmpty": false,
      "sendGetBody": false,
      "requestDatatype": "JSON",
      "responseDatatype": "JSON",
      "headers": {},
      "responseObjects": [
        {
          "type": "default",
          "key": "",
          "mockFile": ""
        }
      ]
    },
    {
      "name": "customInventoryScriptsInventoryScriptsObjectRolesList",
      "protocol": "REST",
      "method": "GET",
      "entitypath": "{base_path}/{version}/api/v2/inventory_scripts/{pathv1}/object_roles/?{query}",
      "requestSchema": "schema.json",
      "responseSchema": "schema.json",
      "timeout": 0,
      "sendEmpty": false,
      "sendGetBody": false,
      "requestDatatype": "JSON",
      "responseDatatype": "JSON",
      "headers": {},
      "responseObjects": [
        {
          "type": "default",
          "key": "",
          "mockFile": ""
        }
      ]
    }
  ]
}