{
  "capacity": 0,
  "committed_capacity": 0,
  "consumed_capacity": 0,
  "created": "2018-02-01T08:00:00.000000Z",
  "id": 2,
  "instances": 0,
  "is_controller": false,
  "is_isolated": false,
  "jobs_running": 0,
  "jobs_total": 0,
  "modified": "2018-02-01T08:00:00.000000Z",
  "name": "foobar",
  "percent_capacity_remaining": 0,
  "policy_instance_list": [],
  "policy_instance_minimum": 0,
  "policy_instance_percentage": 0,
  "related": {
    "instances": "/api/v2/instance_groups/2/instances/",
    "jobs": "/api/v2/instance_groups/2/jobs/"
  },
  "type": "instance_group",
  "url": "/api/v2/instance_groups/2/"
}