{
  "created": "2018-02-01T08:00:00.000000Z",
  "credential": 1,
  "description": "",
  "group_by": "",
  "id": 2,
  "instance_filters": "",
  "inventory": 1,
  "last_job_failed": false,
  "last_update_failed": false,
  "modified": "2018-02-01T08:00:00.000000Z",
  "name": "fobar",
  "overwrite": false,
  "overwrite_vars": false,
  "related": {
    "activity_stream": "/api/v2/inventory_sources/2/activity_stream/",
    "credential": "/api/v2/credentials/1/",
    "credentials": "/api/v2/inventory_sources/2/credentials/",
    "groups": "/api/v2/inventory_sources/2/groups/",
    "hosts": "/api/v2/inventory_sources/2/hosts/",
    "inventory": "/api/v2/inventories/1/",
    "inventory_updates": "/api/v2/inventory_sources/2/inventory_updates/",
    "notification_templates_error": "/api/v2/inventory_sources/2/notification_templates_error/",
    "notification_templates_started": "/api/v2/inventory_sources/2/notification_templates_started/",
    "notification_templates_success": "/api/v2/inventory_sources/2/notification_templates_success/",
    "schedules": "/api/v2/inventory_sources/2/schedules/",
    "source_project": "/api/v2/projects/1/",
    "update": "/api/v2/inventory_sources/2/update/"
  },
  "source": "scm",
  "source_path": "",
  "source_project": 1,
  "source_regions": "",
  "source_vars": "",
  "status": "never updated",
  "summary_fields": {
    "credential": {
      "cloud": true,
      "credential_type_id": 1,
      "description": "",
      "id": 1,
      "kind": "openstack",
      "name": "bar"
    },
    "credentials": [
      {
        "cloud": true,
        "credential_type_id": 1,
        "description": "",
        "id": 1,
        "kind": "openstack",
        "name": "bar"
      }
    ],
    "inventory": {
      "description": "",
      "groups_with_active_failures": 0,
      "has_active_failures": false,
      "has_inventory_sources": true,
      "hosts_with_active_failures": 0,
      "id": 1,
      "inventory_sources_with_failures": 0,
      "kind": "",
      "name": "test-inv",
      "organization_id": 1,
      "total_groups": 0,
      "total_hosts": 0,
      "total_inventory_sources": 1
    },
    "source_project": {
      "description": "test-proj-desc",
      "id": 1,
      "name": "test-proj",
      "scm_type": "git",
      "status": "never updated"
    },
    "user_capabilities": {
      "delete": true,
      "edit": true,
      "schedule": true,
      "start": true
    }
  },
  "timeout": 0,
  "type": "inventory_source",
  "update_cache_timeout": 0,
  "update_on_launch": false,
  "update_on_project_update": false,
  "url": "/api/v2/inventory_sources/2/",
  "verbosity": 1
}