{
  "$id": "schema.json",
  "type": "object",
  "schema": "http://json-schema.org/draft-07/schema#",
  "translate": true,
  "dynamicfields": true,
  "properties": {
    "ph_request_type": {
      "type": "string",
      "description": "type of request (internal to adapter)",
      "default": "jobsJobsList",
      "enum": [
        "jobsJobsList",
        "jobsJobsRead0",
        "jobsJobsDelete",
        "jobsJobsActivityStreamList",
        "jobsJobsCancelRead",
        "jobsJobsCancelCreate",
        "jobsJobsCreateScheduleRead",
        "jobsJobsCreateScheduleCreate",
        "jobsJobsCredentialsList",
        "jobsJobsExtraCredentialsList",
        "jobsJobsJobEventsList",
        "jobsJobsJobHostSummariesList",
        "jobsJobsLabelsList",
        "jobsJobsNotificationsList",
        "jobsJobsRelaunchRead",
        "jobsJobsRelaunchCreate",
        "jobsJobsStdoutRead"
      ],
      "external_name": "ph_request_type"
    },
    "pageSize": {
      "type": "number",
      "description": "Number of results to return per page.",
      "parse": false,
      "encode": false,
      "encrypt": {
        "type": "AES",
        "key": ""
      },
      "external_name": "page_size"
    }
  },
  "definitions": {}
}