{
  "authorization_grant_type": "password",
  "client_id": "xxxx",
  "client_secret": "************",
  "client_type": "confidential",
  "created": "2018-02-01T08:00:00.000000Z",
  "description": "",
  "id": 1,
  "modified": "2018-02-01T08:00:00.000000Z",
  "name": "test app",
  "redirect_uris": "",
  "related": {
    "activity_stream": "/api/v2/applications/1/activity_stream/",
    "tokens": "/api/v2/applications/1/tokens/"
  },
  "skip_authorization": false,
  "summary_fields": {
    "tokens": {
      "count": 0,
      "results": []
    },
    "user": {
      "first_name": "",
      "id": 1,
      "last_name": "",
      "username": "admin"
    },
    "user_capabilities": {
      "delete": true,
      "edit": true
    }
  },
  "type": "o_auth2_application",
  "url": "/api/v2/applications/1/"
}