{
  "$id": "schema.json",
  "type": "object",
  "schema": "http://json-schema.org/draft-07/schema#",
  "translate": true,
  "dynamicfields": true,
  "properties": {
    "ph_request_type": {
      "type": "string",
      "description": "type of request (internal to adapter)",
      "default": "workflowJobsWorkflowJobsList",
      "enum": [
        "workflowJobsWorkflowJobsList",
        "workflowJobsWorkflowJobsCreate",
        "workflowJobsWorkflowJobsRead",
        "workflowJobsWorkflowJobsDelete",
        "workflowJobsWorkflowJobsActivityStreamList",
        "workflowJobsWorkflowJobsCancelRead",
        "workflowJobsWorkflowJobsCancelCreate",
        "workflowJobsWorkflowJobsLabelsList",
        "workflowJobsWorkflowJobsNotificationsList",
        "workflowJobsWorkflowJobsRelaunchList",
        "workflowJobsWorkflowJobsRelaunchCreate",
        "workflowJobsWorkflowJobsWorkflowNodesList"
      ],
      "external_name": "ph_request_type"
    },
    "pageSize": {
      "type": "number",
      "description": "Number of results to return per page.",
      "parse": false,
      "encode": false,
      "encrypt": {
        "type": "AES",
        "key": ""
      },
      "external_name": "page_size"
    }
  },
  "definitions": {}
}