{
  "actions": [
    {
      "name": "schedulesSchedulesList",
      "protocol": "REST",
      "method": "GET",
      "entitypath": "{base_path}/{version}/api/v2/schedules/?{query}",
      "requestSchema": "schema.json",
      "responseSchema": "schema.json",
      "timeout": 0,
      "sendEmpty": false,
      "sendGetBody": false,
      "requestDatatype": "JSON",
      "responseDatatype": "JSON",
      "headers": {},
      "responseObjects": [
        {
          "type": "default",
          "key": "",
          "mockFile": ""
        }
      ]
    },
    {
      "name": "schedulesSchedulesCreate",
      "protocol": "REST",
      "method": "POST",
      "entitypath": "{base_path}/{version}/api/v2/schedules/?{query}",
      "requestSchema": "schema.json",
      "responseSchema": "schema.json",
      "timeout": 0,
      "sendEmpty": false,
      "sendGetBody": false,
      "requestDatatype": "JSON",
      "responseDatatype": "JSON",
      "headers": {},
      "responseObjects": [
        {
          "type": "default",
          "key": "",
          "mockFile": ""
        }
      ]
    },
    {
      "name": "schedulesSchedulesPreviewCreate",
      "protocol": "REST",
      "method": "POST",
      "entitypath": "{base_path}/{version}/api/v2/schedules/preview/?{query}",
      "requestSchema": "schema.json",
      "responseSchema": "schema.json",
      "timeout": 0,
      "sendEmpty": false,
      "sendGetBody": false,
      "requestDatatype": "JSON",
      "responseDatatype": "JSON",
      "headers": {},
      "responseObjects": [
        {
          "type": "default",
          "key": "",
          "mockFile": "mockdatafiles/schedulesSchedulesPreviewCreate-default.json"
        }
      ]
    },
    {
      "name": "schedulesSchedulesZoneinfoList",
      "protocol": "REST",
      "method": "GET",
      "entitypath": "{base_path}/{version}/api/v2/schedules/zoneinfo/?{query}",
      "requestSchema": "schema.json",
      "responseSchema": "schema.json",
      "timeout": 0,
      "sendEmpty": false,
      "sendGetBody": false,
      "requestDatatype": "JSON",
      "responseDatatype": "JSON",
      "headers": {},
      "responseObjects": [
        {
          "type": "default",
          "key": "",
          "mockFile": "mockdatafiles/schedulesSchedulesZoneinfoList-default.json"
        }
      ]
    },
    {
      "name": "schedulesSchedulesRead",
      "protocol": "REST",
      "method": "GET",
      "entitypath": "{base_path}/{version}/api/v2/schedules/{pathv1}/?{query}",
      "requestSchema": "schema.json",
      "responseSchema": "schema.json",
      "timeout": 0,
      "sendEmpty": false,
      "sendGetBody": false,
      "requestDatatype": "JSON",
      "responseDatatype": "JSON",
      "headers": {},
      "responseObjects": [
        {
          "type": "default",
          "key": "",
          "mockFile": ""
        }
      ]
    },
    {
      "name": "schedulesSchedulesUpdate",
      "protocol": "REST",
      "method": "PUT",
      "entitypath": "{base_path}/{version}/api/v2/schedules/{pathv1}/?{query}",
      "requestSchema": "schema.json",
      "responseSchema": "schema.json",
      "timeout": 0,
      "sendEmpty": false,
      "sendGetBody": false,
      "requestDatatype": "JSON",
      "responseDatatype": "JSON",
      "headers": {},
      "responseObjects": [
        {
          "type": "default",
          "key": "",
          "mockFile": ""
        }
      ]
    },
    {
      "name": "schedulesSchedulesDelete",
      "protocol": "REST",
      "method": "DELETE",
      "entitypath": "{base_path}/{version}/api/v2/schedules/{pathv1}/?{query}",
      "requestSchema": "schema.json",
      "responseSchema": "schema.json",
      "timeout": 0,
      "sendEmpty": false,
      "sendGetBody": false,
      "requestDatatype": "JSON",
      "responseDatatype": "JSON",
      "headers": {},
      "responseObjects": [
        {
          "type": "default",
          "key": "",
          "mockFile": ""
        }
      ]
    },
    {
      "name": "schedulesSchedulesPartialUpdate",
      "protocol": "REST",
      "method": "PATCH",
      "entitypath": "{base_path}/{version}/api/v2/schedules/{pathv1}/?{query}",
      "requestSchema": "schema.json",
      "responseSchema": "schema.json",
      "timeout": 0,
      "sendEmpty": false,
      "sendGetBody": false,
      "requestDatatype": "JSON",
      "responseDatatype": "JSON",
      "headers": {},
      "responseObjects": [
        {
          "type": "default",
          "key": "",
          "mockFile": "mockdatafiles/schedulesSchedulesPartialUpdate-default.json"
        }
      ]
    },
    {
      "name": "schedulesSchedulesCredentialsList",
      "protocol": "REST",
      "method": "GET",
      "entitypath": "{base_path}/{version}/api/v2/schedules/{pathv1}/credentials/?{query}",
      "requestSchema": "schema.json",
      "responseSchema": "schema.json",
      "timeout": 0,
      "sendEmpty": false,
      "sendGetBody": false,
      "requestDatatype": "JSON",
      "responseDatatype": "JSON",
      "headers": {},
      "responseObjects": [
        {
          "type": "default",
          "key": "",
          "mockFile": ""
        }
      ]
    },
    {
      "name": "schedulesSchedulesCredentialsCreate",
      "protocol": "REST",
      "method": "POST",
      "entitypath": "{base_path}/{version}/api/v2/schedules/{pathv1}/credentials/?{query}",
      "requestSchema": "schema.json",
      "responseSchema": "schema.json",
      "timeout": 0,
      "sendEmpty": false,
      "sendGetBody": false,
      "requestDatatype": "JSON",
      "responseDatatype": "JSON",
      "headers": {},
      "responseObjects": [
        {
          "type": "default",
          "key": "",
          "mockFile": ""
        }
      ]
    },
    {
      "name": "schedulesSchedulesJobsList",
      "protocol": "REST",
      "method": "GET",
      "entitypath": "{base_path}/{version}/api/v2/schedules/{pathv1}/jobs/?{query}",
      "requestSchema": "schema.json",
      "responseSchema": "schema.json",
      "timeout": 0,
      "sendEmpty": false,
      "sendGetBody": false,
      "requestDatatype": "JSON",
      "responseDatatype": "JSON",
      "headers": {},
      "responseObjects": [
        {
          "type": "default",
          "key": "",
          "mockFile": ""
        }
      ]
    }
  ]
}