{
  "name": "adapter-ansible_tower",
  "webName": "Adapter for Integration to Red Hat Ansible Tower",
  "supportLevel": "community",
  "vendor": "Red Hat",
  "product": "Ansible Tower",
  "techAlliance": false,
  "osVersion": [],
  "apiVersions": [],
  "iapVersions": [
    "2021.1.x",
    "2021.2.x",
    "2022.1.x",
    "2023.1.x"
  ],
  "method": "REST",
  "type": "Adapter",
  "domains": [
    "CI/CD"
  ],
  "tags": [
    "CI/CD & Self-Service"
  ],
  "useCases": [
    "CI/CD Pipeline"
  ],
  "deprecated": {
    "isDeprecated": false
  },
  "brokerSince": "",
  "authMethods": [
    {
      "type": "Basic Auth",
      "primary": true
    }
  ],
  "documentation": {
    "storeLink": "",
    "npmLink": "https://www.npmjs.com/package/@itentialopensource/adapter-ansible_tower",
    "repoLink": "https://gitlab.com/itentialopensource/adapters/adapter-ansible_tower",
    "docLink": "https://gitlab.com/itentialopensource/adapters/adapter-ansible_tower/-/blob/master/README.md?ref_type=heads",
    "demoLinks": [
      {
        "title": "Red Hat Ansible Network Automation",
        "link": "https://www.itential.com/solutions/red-hat-ansible-automation/"
      }
    ],
    "trainingLinks": [
      {
        "title": "Itential Academy",
        "link": "https://www.itential.com/itential-academy/"
      }
    ],
    "faqLink": "https://docs.itential.com/opensource/docs/troubleshooting-an-adapter",
    "contributeLink": "https://gitlab.com/itentialopensource/adapters/contributing-guide",
    "issueLink": "https://itential.atlassian.net/servicedesk/customer/portals",
    "webLink": "https://www.itential.com/adapters/red-hat-ansible-tower/",
    "vendorLink": "https://www.redhat.com/en",
    "productLink": "https://www.redhat.com/en/technologies/management/ansible/automation-controller",
    "apiLinks": [
      {
        "title": "Ansible Tower API Guide",
        "link": "https://docs.ansible.com/ansible-tower/latest/html/towerapi/index.html",
        "public": true
      }
    ],
    "workshopLinks": [],
    "workshopHomePage": "https://www.itential.com/get-started/"
  },
  "assets": [],
  "relatedItems": {
    "adapters": [],
    "integrations": [],
    "ecosystemApplications": [],
    "workflowProjects": [],
    "transformationProjects": [],
    "exampleProjects": []
  }
}