{
  "application": 1,
  "created": "2018-02-01T08:00:00.000000Z",
  "description": "",
  "expires": "2018-02-01T08:00:00.000000Z",
  "id": 1,
  "modified": "2018-02-01T08:00:00.000000Z",
  "refresh_token": "************",
  "related": {
    "activity_stream": "/api/v2/tokens/1/activity_stream/",
    "application": "/api/v2/applications/1/",
    "user": "/api/v2/users/1/"
  },
  "scope": "write",
  "summary_fields": {
    "application": {
      "id": 1,
      "name": "test app"
    },
    "user": {
      "first_name": "",
      "id": 1,
      "last_name": "",
      "username": "admin"
    }
  },
  "token": "************",
  "type": "o_auth2_access_token",
  "url": "/api/v2/tokens/1/",
  "user": 1
}