{
  "$id": "schema.json",
  "type": "object",
  "schema": "http://json-schema.org/draft-07/schema#",
  "translate": true,
  "dynamicfields": true,
  "properties": {
    "ph_request_type": {
      "type": "string",
      "description": "type of request (internal to adapter)",
      "default": "credentialInputSourcesCredentialInputSourcesList",
      "enum": [
        "credentialInputSourcesCredentialInputSourcesList",
        "credentialInputSourcesCredentialInputSourcesCreate",
        "credentialInputSourcesCredentialInputSourcesRead",
        "credentialInputSourcesCredentialInputSourcesUpdate",
        "credentialInputSourcesCredentialInputSourcesDelete",
        "credentialInputSourcesCredentialInputSourcesPartialUpdate"
      ],
      "external_name": "ph_request_type"
    },
    "pageSize": {
      "type": "number",
      "description": "Number of results to return per page.",
      "parse": false,
      "encode": false,
      "encrypt": {
        "type": "AES",
        "key": ""
      },
      "external_name": "page_size"
    }
  },
  "definitions": {}
}