{
  "created": "2018-02-01T08:00:00.000000Z",
  "description": "",
  "elapsed": 0,
  "event_processing_finished": false,
  "execution_node": "",
  "failed": false,
  "group_by": "",
  "id": 3,
  "instance_filters": "",
  "inventory_source": 3,
  "job_args": "",
  "job_cwd": "",
  "job_env": {},
  "job_explanation": "",
  "launch_type": "manual",
  "license_error": false,
  "modified": "2018-02-01T08:00:00.000000Z",
  "name": "",
  "org_host_limit_error": false,
  "overwrite": false,
  "overwrite_vars": false,
  "related": {
    "cancel": "/api/v2/inventory_updates/3/cancel/",
    "credentials": "/api/v2/inventory_updates/3/credentials/",
    "events": "/api/v2/inventory_updates/3/events/",
    "inventory_source": "/api/v2/inventory_sources/3/",
    "notifications": "/api/v2/inventory_updates/3/notifications/",
    "stdout": "/api/v2/inventory_updates/3/stdout/",
    "unified_job_template": "/api/v2/inventory_sources/3/"
  },
  "result_traceback": "",
  "source": "",
  "source_path": "",
  "source_regions": "",
  "source_vars": "",
  "status": "new",
  "summary_fields": {
    "credentials": [],
    "inventory_source": {
      "source": "ec2",
      "status": "never updated"
    },
    "unified_job_template": {
      "description": "",
      "id": 3,
      "name": "single-inv-src",
      "unified_job_type": "inventory_update"
    },
    "user_capabilities": {
      "delete": true,
      "start": false
    }
  },
  "timeout": 0,
  "type": "inventory_update",
  "unified_job_template": 3,
  "url": "/api/v2/inventory_updates/3/",
  "verbosity": 1
}