{
  "count": 1,
  "results": [
    {
      "created": "2018-02-01T08:00:00.000000Z",
      "description": "",
      "id": 1,
      "modified": "2018-02-01T08:00:00.000000Z",
      "name": "test-notification_template",
      "notification_configuration": {
        "headers": {
          "Test": "Header"
        },
        "password": "",
        "url": "http://localhost",
        "username": ""
      },
      "notification_type": "webhook",
      "organization": 1,
      "related": {
        "copy": "/api/v2/notification_templates/1/copy/",
        "notifications": "/api/v2/notification_templates/1/notifications/",
        "organization": "/api/v2/organizations/1/",
        "test": "/api/v2/notification_templates/1/test/"
      },
      "summary_fields": {
        "organization": {
          "description": "test-org-desc",
          "id": 1,
          "name": "test-org"
        },
        "recent_notifications": [],
        "user_capabilities": {
          "copy": true,
          "delete": true,
          "edit": true
        }
      },
      "type": "notification_template",
      "url": "/api/v2/notification_templates/1/"
    }
  ]
}