{
  "count": 1,
  "results": [
    {
      "become_enabled": false,
      "controller_node": "",
      "created": "2018-02-01T08:00:00.000000Z",
      "credential": 1,
      "diff_mode": false,
      "elapsed": 0,
      "execution_node": "",
      "extra_vars": "",
      "failed": false,
      "forks": 0,
      "id": 2,
      "inventory": 3,
      "job_explanation": "",
      "job_type": "run",
      "launch_type": "manual",
      "limit": "",
      "modified": "2018-02-01T08:00:00.000000Z",
      "module_args": "uptime",
      "module_name": "command",
      "name": "command",
      "related": {
        "activity_stream": "/api/v2/ad_hoc_commands/2/activity_stream/",
        "cancel": "/api/v2/ad_hoc_commands/2/cancel/",
        "credential": "/api/v2/credentials/1/",
        "events": "/api/v2/ad_hoc_commands/2/events/",
        "inventory": "/api/v2/inventories/3/",
        "notifications": "/api/v2/ad_hoc_commands/2/notifications/",
        "relaunch": "/api/v2/ad_hoc_commands/2/relaunch/",
        "stdout": "/api/v2/ad_hoc_commands/2/stdout/"
      },
      "status": "pending",
      "summary_fields": {
        "credential": {
          "cloud": false,
          "credential_type_id": 1,
          "description": "",
          "id": 1,
          "kind": "ssh",
          "name": "machine-cred"
        },
        "inventory": {
          "description": "",
          "groups_with_active_failures": 0,
          "has_active_failures": false,
          "has_inventory_sources": false,
          "hosts_with_active_failures": 0,
          "id": 3,
          "inventory_sources_with_failures": 0,
          "kind": "",
          "name": "inv2",
          "organization_id": 1,
          "total_groups": 0,
          "total_hosts": 0,
          "total_inventory_sources": 0
        },
        "user_capabilities": {
          "delete": true,
          "start": true
        }
      },
      "type": "ad_hoc_command",
      "url": "/api/v2/ad_hoc_commands/2/",
      "verbosity": 0
    }
  ]
}