{
  "count": 20,
  "next": "/api/v2/hosts/?page=3&page_size=5",
  "previous": "/api/v2/hosts/?page=1&page_size=5",
  "results": [
    {
      "created": "2018-02-01T08:00:00.000000Z",
      "description": "",
      "enabled": true,
      "has_active_failures": false,
      "has_inventory_sources": false,
      "id": 14,
      "instance_id": "",
      "inventory": 1,
      "modified": "2018-02-01T08:00:00.000000Z",
      "name": "host-13",
      "related": {
        "activity_stream": "/api/v2/hosts/14/activity_stream/",
        "ad_hoc_command_events": "/api/v2/hosts/14/ad_hoc_command_events/",
        "ad_hoc_commands": "/api/v2/hosts/14/ad_hoc_commands/",
        "all_groups": "/api/v2/hosts/14/all_groups/",
        "ansible_facts": "/api/v2/hosts/14/ansible_facts/",
        "groups": "/api/v2/hosts/14/groups/",
        "insights": "/api/v2/hosts/14/insights/",
        "inventory": "/api/v2/inventories/1/",
        "inventory_sources": "/api/v2/hosts/14/inventory_sources/",
        "job_events": "/api/v2/hosts/14/job_events/",
        "job_host_summaries": "/api/v2/hosts/14/job_host_summaries/",
        "smart_inventories": "/api/v2/hosts/14/smart_inventories/",
        "variable_data": "/api/v2/hosts/14/variable_data/"
      },
      "summary_fields": {
        "groups": {
          "count": 0,
          "results": []
        },
        "inventory": {
          "description": "",
          "groups_with_active_failures": 0,
          "has_active_failures": false,
          "has_inventory_sources": false,
          "hosts_with_active_failures": 0,
          "id": 1,
          "inventory_sources_with_failures": 0,
          "kind": "",
          "name": "test-inv",
          "organization_id": 1,
          "total_groups": 0,
          "total_hosts": 0,
          "total_inventory_sources": 0
        },
        "recent_jobs": [],
        "user_capabilities": {
          "delete": true,
          "edit": true
        }
      },
      "type": "host",
      "url": "/api/v2/hosts/14/",
      "variables": ""
    },
    {
      "created": "2018-02-01T08:00:00.000000Z",
      "description": "",
      "enabled": true,
      "has_active_failures": false,
      "has_inventory_sources": false,
      "id": 15,
      "instance_id": "",
      "inventory": 1,
      "modified": "2018-02-01T08:00:00.000000Z",
      "name": "host-14",
      "related": {
        "activity_stream": "/api/v2/hosts/15/activity_stream/",
        "ad_hoc_command_events": "/api/v2/hosts/15/ad_hoc_command_events/",
        "ad_hoc_commands": "/api/v2/hosts/15/ad_hoc_commands/",
        "all_groups": "/api/v2/hosts/15/all_groups/",
        "ansible_facts": "/api/v2/hosts/15/ansible_facts/",
        "groups": "/api/v2/hosts/15/groups/",
        "insights": "/api/v2/hosts/15/insights/",
        "inventory": "/api/v2/inventories/1/",
        "inventory_sources": "/api/v2/hosts/15/inventory_sources/",
        "job_events": "/api/v2/hosts/15/job_events/",
        "job_host_summaries": "/api/v2/hosts/15/job_host_summaries/",
        "smart_inventories": "/api/v2/hosts/15/smart_inventories/",
        "variable_data": "/api/v2/hosts/15/variable_data/"
      },
      "summary_fields": {
        "groups": {
          "count": 0,
          "results": []
        },
        "inventory": {
          "description": "",
          "groups_with_active_failures": 0,
          "has_active_failures": false,
          "has_inventory_sources": false,
          "hosts_with_active_failures": 0,
          "id": 1,
          "inventory_sources_with_failures": 0,
          "kind": "",
          "name": "test-inv",
          "organization_id": 1,
          "total_groups": 0,
          "total_hosts": 0,
          "total_inventory_sources": 0
        },
        "recent_jobs": [],
        "user_capabilities": {
          "delete": true,
          "edit": true
        }
      },
      "type": "host",
      "url": "/api/v2/hosts/15/",
      "variables": ""
    },
    {
      "created": "2018-02-01T08:00:00.000000Z",
      "description": "",
      "enabled": true,
      "has_active_failures": false,
      "has_inventory_sources": false,
      "id": 16,
      "instance_id": "",
      "inventory": 1,
      "modified": "2018-02-01T08:00:00.000000Z",
      "name": "host-15",
      "related": {
        "activity_stream": "/api/v2/hosts/16/activity_stream/",
        "ad_hoc_command_events": "/api/v2/hosts/16/ad_hoc_command_events/",
        "ad_hoc_commands": "/api/v2/hosts/16/ad_hoc_commands/",
        "all_groups": "/api/v2/hosts/16/all_groups/",
        "ansible_facts": "/api/v2/hosts/16/ansible_facts/",
        "groups": "/api/v2/hosts/16/groups/",
        "insights": "/api/v2/hosts/16/insights/",
        "inventory": "/api/v2/inventories/1/",
        "inventory_sources": "/api/v2/hosts/16/inventory_sources/",
        "job_events": "/api/v2/hosts/16/job_events/",
        "job_host_summaries": "/api/v2/hosts/16/job_host_summaries/",
        "smart_inventories": "/api/v2/hosts/16/smart_inventories/",
        "variable_data": "/api/v2/hosts/16/variable_data/"
      },
      "summary_fields": {
        "groups": {
          "count": 0,
          "results": []
        },
        "inventory": {
          "description": "",
          "groups_with_active_failures": 0,
          "has_active_failures": false,
          "has_inventory_sources": false,
          "hosts_with_active_failures": 0,
          "id": 1,
          "inventory_sources_with_failures": 0,
          "kind": "",
          "name": "test-inv",
          "organization_id": 1,
          "total_groups": 0,
          "total_hosts": 0,
          "total_inventory_sources": 0
        },
        "recent_jobs": [],
        "user_capabilities": {
          "delete": true,
          "edit": true
        }
      },
      "type": "host",
      "url": "/api/v2/hosts/16/",
      "variables": ""
    },
    {
      "created": "2018-02-01T08:00:00.000000Z",
      "description": "",
      "enabled": true,
      "has_active_failures": false,
      "has_inventory_sources": false,
      "id": 17,
      "instance_id": "",
      "inventory": 1,
      "modified": "2018-02-01T08:00:00.000000Z",
      "name": "host-16",
      "related": {
        "activity_stream": "/api/v2/hosts/17/activity_stream/",
        "ad_hoc_command_events": "/api/v2/hosts/17/ad_hoc_command_events/",
        "ad_hoc_commands": "/api/v2/hosts/17/ad_hoc_commands/",
        "all_groups": "/api/v2/hosts/17/all_groups/",
        "ansible_facts": "/api/v2/hosts/17/ansible_facts/",
        "groups": "/api/v2/hosts/17/groups/",
        "insights": "/api/v2/hosts/17/insights/",
        "inventory": "/api/v2/inventories/1/",
        "inventory_sources": "/api/v2/hosts/17/inventory_sources/",
        "job_events": "/api/v2/hosts/17/job_events/",
        "job_host_summaries": "/api/v2/hosts/17/job_host_summaries/",
        "smart_inventories": "/api/v2/hosts/17/smart_inventories/",
        "variable_data": "/api/v2/hosts/17/variable_data/"
      },
      "summary_fields": {
        "groups": {
          "count": 0,
          "results": []
        },
        "inventory": {
          "description": "",
          "groups_with_active_failures": 0,
          "has_active_failures": false,
          "has_inventory_sources": false,
          "hosts_with_active_failures": 0,
          "id": 1,
          "inventory_sources_with_failures": 0,
          "kind": "",
          "name": "test-inv",
          "organization_id": 1,
          "total_groups": 0,
          "total_hosts": 0,
          "total_inventory_sources": 0
        },
        "recent_jobs": [],
        "user_capabilities": {
          "delete": true,
          "edit": true
        }
      },
      "type": "host",
      "url": "/api/v2/hosts/17/",
      "variables": ""
    },
    {
      "created": "2018-02-01T08:00:00.000000Z",
      "description": "",
      "enabled": true,
      "has_active_failures": false,
      "has_inventory_sources": false,
      "id": 18,
      "instance_id": "",
      "inventory": 1,
      "modified": "2018-02-01T08:00:00.000000Z",
      "name": "host-17",
      "related": {
        "activity_stream": "/api/v2/hosts/18/activity_stream/",
        "ad_hoc_command_events": "/api/v2/hosts/18/ad_hoc_command_events/",
        "ad_hoc_commands": "/api/v2/hosts/18/ad_hoc_commands/",
        "all_groups": "/api/v2/hosts/18/all_groups/",
        "ansible_facts": "/api/v2/hosts/18/ansible_facts/",
        "groups": "/api/v2/hosts/18/groups/",
        "insights": "/api/v2/hosts/18/insights/",
        "inventory": "/api/v2/inventories/1/",
        "inventory_sources": "/api/v2/hosts/18/inventory_sources/",
        "job_events": "/api/v2/hosts/18/job_events/",
        "job_host_summaries": "/api/v2/hosts/18/job_host_summaries/",
        "smart_inventories": "/api/v2/hosts/18/smart_inventories/",
        "variable_data": "/api/v2/hosts/18/variable_data/"
      },
      "summary_fields": {
        "groups": {
          "count": 0,
          "results": []
        },
        "inventory": {
          "description": "",
          "groups_with_active_failures": 0,
          "has_active_failures": false,
          "has_inventory_sources": false,
          "hosts_with_active_failures": 0,
          "id": 1,
          "inventory_sources_with_failures": 0,
          "kind": "",
          "name": "test-inv",
          "organization_id": 1,
          "total_groups": 0,
          "total_hosts": 0,
          "total_inventory_sources": 0
        },
        "recent_jobs": [],
        "user_capabilities": {
          "delete": true,
          "edit": true
        }
      },
      "type": "host",
      "url": "/api/v2/hosts/18/",
      "variables": ""
    }
  ]
}