{
  "count": 5,
  "results": [
    {
      "capacity": 0,
      "committed_capacity": 0,
      "consumed_capacity": 0,
      "created": "2018-02-01T08:00:00.000000Z",
      "id": 3,
      "instances": 0,
      "is_controller": false,
      "is_isolated": false,
      "jobs_running": 0,
      "jobs_total": 0,
      "modified": "2018-02-01T08:00:00.000000Z",
      "name": "iso-3",
      "percent_capacity_remaining": 0,
      "policy_instance_list": [],
      "policy_instance_minimum": 0,
      "policy_instance_percentage": 0,
      "related": {
        "instances": "/api/v2/instance_groups/3/instances/",
        "jobs": "/api/v2/instance_groups/3/jobs/"
      },
      "type": "instance_group",
      "url": "/api/v2/instance_groups/3/"
    },
    {
      "capacity": 0,
      "committed_capacity": 0,
      "consumed_capacity": 0,
      "created": "2018-02-01T08:00:00.000000Z",
      "id": 1,
      "instances": 0,
      "is_controller": false,
      "is_isolated": false,
      "jobs_running": 0,
      "jobs_total": 0,
      "modified": "2018-02-01T08:00:00.000000Z",
      "name": "iso-0",
      "percent_capacity_remaining": 0,
      "policy_instance_list": [],
      "policy_instance_minimum": 0,
      "policy_instance_percentage": 0,
      "related": {
        "instances": "/api/v2/instance_groups/1/instances/",
        "jobs": "/api/v2/instance_groups/1/jobs/"
      },
      "type": "instance_group",
      "url": "/api/v2/instance_groups/1/"
    },
    {
      "capacity": 0,
      "committed_capacity": 0,
      "consumed_capacity": 0,
      "created": "2018-02-01T08:00:00.000000Z",
      "id": 5,
      "instances": 0,
      "is_controller": false,
      "is_isolated": false,
      "jobs_running": 0,
      "jobs_total": 0,
      "modified": "2018-02-01T08:00:00.000000Z",
      "name": "iso-2",
      "percent_capacity_remaining": 0,
      "policy_instance_list": [],
      "policy_instance_minimum": 0,
      "policy_instance_percentage": 0,
      "related": {
        "instances": "/api/v2/instance_groups/5/instances/",
        "jobs": "/api/v2/instance_groups/5/jobs/"
      },
      "type": "instance_group",
      "url": "/api/v2/instance_groups/5/"
    },
    {
      "capacity": 0,
      "committed_capacity": 0,
      "consumed_capacity": 0,
      "created": "2018-02-01T08:00:00.000000Z",
      "id": 2,
      "instances": 0,
      "is_controller": false,
      "is_isolated": false,
      "jobs_running": 0,
      "jobs_total": 0,
      "modified": "2018-02-01T08:00:00.000000Z",
      "name": "iso-1",
      "percent_capacity_remaining": 0,
      "policy_instance_list": [],
      "policy_instance_minimum": 0,
      "policy_instance_percentage": 0,
      "related": {
        "instances": "/api/v2/instance_groups/2/instances/",
        "jobs": "/api/v2/instance_groups/2/jobs/"
      },
      "type": "instance_group",
      "url": "/api/v2/instance_groups/2/"
    },
    {
      "capacity": 0,
      "committed_capacity": 0,
      "consumed_capacity": 0,
      "created": "2018-02-01T08:00:00.000000Z",
      "id": 4,
      "instances": 0,
      "is_controller": false,
      "is_isolated": false,
      "jobs_running": 0,
      "jobs_total": 0,
      "modified": "2018-02-01T08:00:00.000000Z",
      "name": "iso-4",
      "percent_capacity_remaining": 0,
      "policy_instance_list": [],
      "policy_instance_minimum": 0,
      "policy_instance_percentage": 0,
      "related": {
        "instances": "/api/v2/instance_groups/4/instances/",
        "jobs": "/api/v2/instance_groups/4/jobs/"
      },
      "type": "instance_group",
      "url": "/api/v2/instance_groups/4/"
    }
  ]
}