{
  "count": 1,
  "results": [
    {
      "description": "Can manage all aspects of the inventory",
      "id": 17,
      "name": "Admin",
      "related": {
        "inventory": "/api/v2/inventories/1/",
        "teams": "/api/v2/roles/17/teams/",
        "users": "/api/v2/roles/17/users/"
      },
      "summary_fields": {
        "resource_name": "test-inv",
        "resource_type": "inventory",
        "resource_type_display_name": "Inventory",
        "user_capabilities": {
          "unattach": true
        }
      },
      "type": "role",
      "url": "/api/v2/roles/17/"
    }
  ]
}