{
  "allow_override": true,
  "created": "2018-02-01T08:00:00.000000Z",
  "description": "",
  "id": 1,
  "last_job_failed": false,
  "last_update_failed": false,
  "local_path": "",
  "modified": "2018-02-01T08:00:00.000000Z",
  "name": "fooo",
  "organization": 1,
  "related": {
    "access_list": "/api/v2/projects/1/access_list/",
    "activity_stream": "/api/v2/projects/1/activity_stream/",
    "copy": "/api/v2/projects/1/copy/",
    "inventory_files": "/api/v2/projects/1/inventories/",
    "notification_templates_error": "/api/v2/projects/1/notification_templates_error/",
    "notification_templates_started": "/api/v2/projects/1/notification_templates_started/",
    "notification_templates_success": "/api/v2/projects/1/notification_templates_success/",
    "object_roles": "/api/v2/projects/1/object_roles/",
    "organization": "/api/v2/organizations/1/",
    "playbooks": "/api/v2/projects/1/playbooks/",
    "project_updates": "/api/v2/projects/1/project_updates/",
    "schedules": "/api/v2/projects/1/schedules/",
    "scm_inventory_sources": "/api/v2/projects/1/scm_inventory_sources/",
    "teams": "/api/v2/projects/1/teams/",
    "update": "/api/v2/projects/1/update/"
  },
  "scm_branch": "",
  "scm_clean": false,
  "scm_delete_on_update": false,
  "scm_refspec": "",
  "scm_revision": "",
  "scm_type": "",
  "scm_update_cache_timeout": 0,
  "scm_update_on_launch": false,
  "scm_url": "",
  "status": "missing",
  "summary_fields": {
    "object_roles": {
      "admin_role": {
        "description": "Can manage all aspects of the project",
        "id": 14,
        "name": "Admin"
      },
      "read_role": {
        "description": "May view settings for the project",
        "id": 17,
        "name": "Read"
      },
      "update_role": {
        "description": "May update the project",
        "id": 16,
        "name": "Update"
      },
      "use_role": {
        "description": "Can use the project in a job template",
        "id": 15,
        "name": "Use"
      }
    },
    "organization": {
      "description": "test-org-desc",
      "id": 1,
      "name": "test-org"
    },
    "user_capabilities": {
      "copy": false,
      "delete": true,
      "edit": true,
      "schedule": false,
      "start": false
    }
  },
  "timeout": 0,
  "type": "project",
  "url": "/api/v2/projects/1/"
}