{
  "created": "2018-02-01T08:00:00.000000Z",
  "description": "Hello world",
  "groups_with_active_failures": 0,
  "has_active_failures": false,
  "has_inventory_sources": false,
  "hosts_with_active_failures": 0,
  "id": 1,
  "inventory": 1,
  "modified": "2018-02-01T08:00:00.000000Z",
  "name": "New name",
  "related": {
    "activity_stream": "/api/v2/groups/1/activity_stream/",
    "ad_hoc_commands": "/api/v2/groups/1/ad_hoc_commands/",
    "all_hosts": "/api/v2/groups/1/all_hosts/",
    "children": "/api/v2/groups/1/children/",
    "hosts": "/api/v2/groups/1/hosts/",
    "inventory": "/api/v2/inventories/1/",
    "inventory_sources": "/api/v2/groups/1/inventory_sources/",
    "job_events": "/api/v2/groups/1/job_events/",
    "job_host_summaries": "/api/v2/groups/1/job_host_summaries/",
    "potential_children": "/api/v2/groups/1/potential_children/",
    "variable_data": "/api/v2/groups/1/variable_data/"
  },
  "summary_fields": {
    "inventory": {
      "description": "",
      "groups_with_active_failures": 0,
      "has_active_failures": false,
      "has_inventory_sources": false,
      "hosts_with_active_failures": 0,
      "id": 1,
      "inventory_sources_with_failures": 0,
      "kind": "",
      "name": "test-inv",
      "organization_id": 1,
      "total_groups": 0,
      "total_hosts": 0,
      "total_inventory_sources": 0
    },
    "user_capabilities": {
      "copy": true,
      "delete": true,
      "edit": true
    }
  },
  "total_groups": 0,
  "total_hosts": 0,
  "type": "group",
  "url": "/api/v2/groups/1/",
  "variables": ""
}