{
  "count": 1,
  "results": [
    {
      "created": "2018-02-01T08:00:00.000000Z",
      "description": "",
      "expires": "2018-02-01T08:00:00.000000Z",
      "id": 2,
      "modified": "2018-02-01T08:00:00.000000Z",
      "related": {
        "activity_stream": "/api/v2/tokens/2/activity_stream/",
        "user": "/api/v2/users/2/"
      },
      "scope": "read",
      "summary_fields": {
        "user": {
          "first_name": "",
          "id": 2,
          "last_name": "",
          "username": "alice"
        }
      },
      "token": "************",
      "type": "o_auth2_access_token",
      "url": "/api/v2/tokens/2/",
      "user": 2
    }
  ]
}