{
  "$id": "schema.json",
  "type": "object",
  "schema": "http://json-schema.org/draft-07/schema#",
  "translate": true,
  "dynamicfields": true,
  "properties": {
    "ph_request_type": {
      "type": "string",
      "description": "type of request (internal to adapter)",
      "default": "groupsGroupsList",
      "enum": [
        "groupsGroupsList",
        "groupsGroupsCreate",
        "groupsGroupsRead",
        "groupsGroupsUpdate",
        "groupsGroupsDelete",
        "groupsGroupsPartialUpdate",
        "groupsGroupsActivityStreamList",
        "groupsGroupsAdHocCommandsList",
        "groupsGroupsAdHocCommandsCreate",
        "groupsGroupsAllHostsList",
        "groupsGroupsChildrenList",
        "groupsGroupsChildrenCreate",
        "groupsGroupsHostsList",
        "groupsGroupsHostsCreate",
        "groupsGroupsInventorySourcesList",
        "groupsGroupsJobEventsList",
        "groupsGroupsJobHostSummariesList",
        "groupsGroupsPotentialChildrenList",
        "groupsGroupsVariableDataRead",
        "groupsGroupsVariableDataUpdate",
        "groupsGroupsVariableDataPartialUpdate"
      ],
      "external_name": "ph_request_type"
    },
    "pageSize": {
      "type": "number",
      "description": "Number of results to return per page.",
      "parse": false,
      "encode": false,
      "encrypt": {
        "type": "AES",
        "key": ""
      },
      "external_name": "page_size"
    }
  },
  "definitions": {}
}