{
  "created": "2018-02-01T08:00:00.000000Z",
  "description": "",
  "id": 1,
  "input_field_name": "vault_password",
  "metadata": {
    "key": "some_key"
  },
  "modified": "2018-02-01T08:00:00.000000Z",
  "related": {
    "source_credential": "/api/v2/credentials/2/",
    "target_credential": "/api/v2/credentials/1/"
  },
  "source_credential": 2,
  "summary_fields": {
    "source_credential": {
      "cloud": false,
      "credential_type_id": 2,
      "description": "",
      "id": 2,
      "name": "external-cred"
    },
    "target_credential": {
      "cloud": false,
      "credential_type_id": 1,
      "description": "",
      "id": 1,
      "kind": "vault",
      "name": "test-cred"
    },
    "user_capabilities": {
      "delete": true
    }
  },
  "target_credential": 1,
  "type": "credential_input_source",
  "url": "/api/v2/credential_input_sources/1/"
}