{
  "$id": "schema.json",
  "type": "object",
  "schema": "http://json-schema.org/draft-07/schema#",
  "translate": true,
  "dynamicfields": true,
  "properties": {
    "ph_request_type": {
      "type": "string",
      "description": "type of request (internal to adapter)",
      "default": "projectsProjectsList",
      "enum": [
        "projectsProjectsList",
        "projectsProjectsCreate",
        "projectsProjectsRead",
        "projectsProjectsUpdate0",
        "projectsProjectsDelete",
        "projectsProjectsPartialUpdate",
        "projectsProjectsAccessListList",
        "projectsProjectsActivityStreamList",
        "projectsProjectsCopyList",
        "projectsProjectsCopyCreate",
        "projectsProjectsInventoriesRead",
        "projectsProjectsNotificationTemplatesErrorList",
        "projectsProjectsNotificationTemplatesErrorCreate",
        "projectsProjectsNotificationTemplatesStartedList",
        "projectsProjectsNotificationTemplatesStartedCreate",
        "projectsProjectsNotificationTemplatesSuccessList",
        "projectsProjectsNotificationTemplatesSuccessCreate",
        "projectsProjectsObjectRolesList",
        "projectsProjectsPlaybooksRead",
        "projectsProjectsProjectUpdatesList",
        "projectsProjectsSchedulesList",
        "projectsProjectsSchedulesCreate",
        "projectsProjectsScmInventorySourcesList",
        "projectsProjectsTeamsList",
        "projectsProjectsUpdateRead",
        "projectsProjectsUpdateCreate"
      ],
      "external_name": "ph_request_type"
    },
    "pageSize": {
      "type": "number",
      "description": "Number of results to return per page.",
      "parse": false,
      "encode": false,
      "encrypt": {
        "type": "AES",
        "key": ""
      },
      "external_name": "page_size"
    }
  },
  "definitions": {}
}