{
  "authorization_grant_type": "password",
  "client_id": "xxxx",
  "client_secret": "KEuoiuRzGZpWkVG9kbfPNpPRDSo0Nlo9IpJaSxdLsPAAjUIyhBeM8PdRdGVcbM04xvRWhmTTyALBbK0widBNZ3sK3HaqeEPwwn6A89H1Mq8OMTxehZP5piHWEz6dOyiH",
  "client_type": "confidential",
  "created": "2018-02-01T08:00:00.000000Z",
  "description": "",
  "id": 1,
  "modified": "2018-02-01T08:00:00.000000Z",
  "name": "test app",
  "organization": 1,
  "redirect_uris": "",
  "related": {
    "activity_stream": "/api/v2/applications/1/activity_stream/",
    "tokens": "/api/v2/applications/1/tokens/"
  },
  "skip_authorization": false,
  "summary_fields": {
    "organization": {
      "description": "test-org-desc",
      "id": 1,
      "name": "test-org"
    },
    "tokens": {
      "count": 0,
      "results": []
    },
    "user_capabilities": {
      "delete": true,
      "edit": true
    }
  },
  "type": "o_auth2_application",
  "url": "/api/v2/applications/1/"
}