{
  "analytics_status": "off",
  "ansible_version": "2.9.0.dev0",
  "become_methods": [
    [
      "sudo",
      "Sudo"
    ],
    [
      "su",
      "Su"
    ],
    [
      "pbrun",
      "Pbrun"
    ],
    [
      "pfexec",
      "Pfexec"
    ],
    [
      "dzdo",
      "DZDO"
    ],
    [
      "pmrun",
      "Pmrun"
    ],
    [
      "runas",
      "Runas"
    ],
    [
      "enable",
      "Enable"
    ],
    [
      "doas",
      "Doas"
    ],
    [
      "ksu",
      "Ksu"
    ],
    [
      "machinectl",
      "Machinectl"
    ],
    [
      "sesu",
      "Sesu"
    ]
  ],
  "custom_virtualenvs": [
    "/venv/ansible/"
  ],
  "eula": "",
  "license_info": {
    "compliant": true,
    "features": {
      "activity_streams": true,
      "enterprise_auth": true,
      "ha": true,
      "ldap": true,
      "multiple_organizations": true,
      "rebranding": true,
      "surveys": true,
      "system_tracking": true,
      "workflows": true
    },
    "license_key": "OPEN",
    "license_type": "open",
    "valid_key": true
  },
  "project_base_dir": "/projects/",
  "project_local_paths": [],
  "time_zone": "UTC",
  "version": "6.1.0-215-gad17bdc55"
}