{
  "actions": [
    {
      "name": "projectsProjectsList",
      "protocol": "REST",
      "method": "GET",
      "entitypath": "{base_path}/{version}/api/v2/projects/?{query}",
      "requestSchema": "schema.json",
      "responseSchema": "schema.json",
      "timeout": 0,
      "sendEmpty": false,
      "sendGetBody": false,
      "requestDatatype": "JSON",
      "responseDatatype": "JSON",
      "headers": {},
      "responseObjects": [
        {
          "type": "default",
          "key": "",
          "mockFile": ""
        }
      ]
    },
    {
      "name": "projectsProjectsCreate",
      "protocol": "REST",
      "method": "POST",
      "entitypath": "{base_path}/{version}/api/v2/projects/?{query}",
      "requestSchema": "schema.json",
      "responseSchema": "schema.json",
      "timeout": 0,
      "sendEmpty": false,
      "sendGetBody": false,
      "requestDatatype": "JSON",
      "responseDatatype": "JSON",
      "headers": {},
      "responseObjects": [
        {
          "type": "default",
          "key": "",
          "mockFile": "mockdatafiles/projectsProjectsCreate-default.json"
        }
      ]
    },
    {
      "name": "projectsProjectsRead",
      "protocol": "REST",
      "method": "GET",
      "entitypath": "{base_path}/{version}/api/v2/projects/{pathv1}/?{query}",
      "requestSchema": "schema.json",
      "responseSchema": "schema.json",
      "timeout": 0,
      "sendEmpty": false,
      "sendGetBody": false,
      "requestDatatype": "JSON",
      "responseDatatype": "JSON",
      "headers": {},
      "responseObjects": [
        {
          "type": "default",
          "key": "",
          "mockFile": "mockdatafiles/projectsProjectsRead-default.json"
        }
      ]
    },
    {
      "name": "projectsProjectsUpdate0",
      "protocol": "REST",
      "method": "PUT",
      "entitypath": "{base_path}/{version}/api/v2/projects/{pathv1}/?{query}",
      "requestSchema": "schema.json",
      "responseSchema": "schema.json",
      "timeout": 0,
      "sendEmpty": false,
      "sendGetBody": false,
      "requestDatatype": "JSON",
      "responseDatatype": "JSON",
      "headers": {},
      "responseObjects": [
        {
          "type": "default",
          "key": "",
          "mockFile": ""
        }
      ]
    },
    {
      "name": "projectsProjectsDelete",
      "protocol": "REST",
      "method": "DELETE",
      "entitypath": "{base_path}/{version}/api/v2/projects/{pathv1}/?{query}",
      "requestSchema": "schema.json",
      "responseSchema": "schema.json",
      "timeout": 0,
      "sendEmpty": false,
      "sendGetBody": false,
      "requestDatatype": "JSON",
      "responseDatatype": "JSON",
      "headers": {},
      "responseObjects": [
        {
          "type": "default",
          "key": "",
          "mockFile": ""
        }
      ]
    },
    {
      "name": "projectsProjectsPartialUpdate",
      "protocol": "REST",
      "method": "PATCH",
      "entitypath": "{base_path}/{version}/api/v2/projects/{pathv1}/?{query}",
      "requestSchema": "schema.json",
      "responseSchema": "schema.json",
      "timeout": 0,
      "sendEmpty": false,
      "sendGetBody": false,
      "requestDatatype": "JSON",
      "responseDatatype": "JSON",
      "headers": {},
      "responseObjects": [
        {
          "type": "default",
          "key": "",
          "mockFile": "mockdatafiles/projectsProjectsPartialUpdate-default.json"
        }
      ]
    },
    {
      "name": "projectsProjectsAccessListList",
      "protocol": "REST",
      "method": "GET",
      "entitypath": "{base_path}/{version}/api/v2/projects/{pathv1}/access_list/?{query}",
      "requestSchema": "schema.json",
      "responseSchema": "schema.json",
      "timeout": 0,
      "sendEmpty": false,
      "sendGetBody": false,
      "requestDatatype": "JSON",
      "responseDatatype": "JSON",
      "headers": {},
      "responseObjects": [
        {
          "type": "default",
          "key": "",
          "mockFile": "mockdatafiles/projectsProjectsAccessListList-default.json"
        }
      ]
    },
    {
      "name": "projectsProjectsActivityStreamList",
      "protocol": "REST",
      "method": "GET",
      "entitypath": "{base_path}/{version}/api/v2/projects/{pathv1}/activity_stream/?{query}",
      "requestSchema": "schema.json",
      "responseSchema": "schema.json",
      "timeout": 0,
      "sendEmpty": false,
      "sendGetBody": false,
      "requestDatatype": "JSON",
      "responseDatatype": "JSON",
      "headers": {},
      "responseObjects": [
        {
          "type": "default",
          "key": "",
          "mockFile": ""
        }
      ]
    },
    {
      "name": "projectsProjectsCopyList",
      "protocol": "REST",
      "method": "GET",
      "entitypath": "{base_path}/{version}/api/v2/projects/{pathv1}/copy/?{query}",
      "requestSchema": "schema.json",
      "responseSchema": "schema.json",
      "timeout": 0,
      "sendEmpty": false,
      "sendGetBody": false,
      "requestDatatype": "JSON",
      "responseDatatype": "JSON",
      "headers": {},
      "responseObjects": [
        {
          "type": "default",
          "key": "",
          "mockFile": ""
        }
      ]
    },
    {
      "name": "projectsProjectsCopyCreate",
      "protocol": "REST",
      "method": "POST",
      "entitypath": "{base_path}/{version}/api/v2/projects/{pathv1}/copy/?{query}",
      "requestSchema": "schema.json",
      "responseSchema": "schema.json",
      "timeout": 0,
      "sendEmpty": false,
      "sendGetBody": false,
      "requestDatatype": "JSON",
      "responseDatatype": "JSON",
      "headers": {},
      "responseObjects": [
        {
          "type": "default",
          "key": "",
          "mockFile": ""
        }
      ]
    },
    {
      "name": "projectsProjectsInventoriesRead",
      "protocol": "REST",
      "method": "GET",
      "entitypath": "{base_path}/{version}/api/v2/projects/{pathv1}/inventories/?{query}",
      "requestSchema": "schema.json",
      "responseSchema": "schema.json",
      "timeout": 0,
      "sendEmpty": false,
      "sendGetBody": false,
      "requestDatatype": "JSON",
      "responseDatatype": "JSON",
      "headers": {},
      "responseObjects": [
        {
          "type": "default",
          "key": "",
          "mockFile": ""
        }
      ]
    },
    {
      "name": "projectsProjectsNotificationTemplatesErrorList",
      "protocol": "REST",
      "method": "GET",
      "entitypath": "{base_path}/{version}/api/v2/projects/{pathv1}/notification_templates_error/?{query}",
      "requestSchema": "schema.json",
      "responseSchema": "schema.json",
      "timeout": 0,
      "sendEmpty": false,
      "sendGetBody": false,
      "requestDatatype": "JSON",
      "responseDatatype": "JSON",
      "headers": {},
      "responseObjects": [
        {
          "type": "default",
          "key": "",
          "mockFile": ""
        }
      ]
    },
    {
      "name": "projectsProjectsNotificationTemplatesErrorCreate",
      "protocol": "REST",
      "method": "POST",
      "entitypath": "{base_path}/{version}/api/v2/projects/{pathv1}/notification_templates_error/?{query}",
      "requestSchema": "schema.json",
      "responseSchema": "schema.json",
      "timeout": 0,
      "sendEmpty": false,
      "sendGetBody": false,
      "requestDatatype": "JSON",
      "responseDatatype": "JSON",
      "headers": {},
      "responseObjects": [
        {
          "type": "default",
          "key": "",
          "mockFile": ""
        }
      ]
    },
    {
      "name": "projectsProjectsNotificationTemplatesStartedList",
      "protocol": "REST",
      "method": "GET",
      "entitypath": "{base_path}/{version}/api/v2/projects/{pathv1}/notification_templates_started/?{query}",
      "requestSchema": "schema.json",
      "responseSchema": "schema.json",
      "timeout": 0,
      "sendEmpty": false,
      "sendGetBody": false,
      "requestDatatype": "JSON",
      "responseDatatype": "JSON",
      "headers": {},
      "responseObjects": [
        {
          "type": "default",
          "key": "",
          "mockFile": "mockdatafiles/projectsProjectsNotificationTemplatesStartedList-default.json"
        }
      ]
    },
    {
      "name": "projectsProjectsNotificationTemplatesStartedCreate",
      "protocol": "REST",
      "method": "POST",
      "entitypath": "{base_path}/{version}/api/v2/projects/{pathv1}/notification_templates_started/?{query}",
      "requestSchema": "schema.json",
      "responseSchema": "schema.json",
      "timeout": 0,
      "sendEmpty": false,
      "sendGetBody": false,
      "requestDatatype": "JSON",
      "responseDatatype": "JSON",
      "headers": {},
      "responseObjects": [
        {
          "type": "default",
          "key": "",
          "mockFile": ""
        }
      ]
    },
    {
      "name": "projectsProjectsNotificationTemplatesSuccessList",
      "protocol": "REST",
      "method": "GET",
      "entitypath": "{base_path}/{version}/api/v2/projects/{pathv1}/notification_templates_success/?{query}",
      "requestSchema": "schema.json",
      "responseSchema": "schema.json",
      "timeout": 0,
      "sendEmpty": false,
      "sendGetBody": false,
      "requestDatatype": "JSON",
      "responseDatatype": "JSON",
      "headers": {},
      "responseObjects": [
        {
          "type": "default",
          "key": "",
          "mockFile": ""
        }
      ]
    },
    {
      "name": "projectsProjectsNotificationTemplatesSuccessCreate",
      "protocol": "REST",
      "method": "POST",
      "entitypath": "{base_path}/{version}/api/v2/projects/{pathv1}/notification_templates_success/?{query}",
      "requestSchema": "schema.json",
      "responseSchema": "schema.json",
      "timeout": 0,
      "sendEmpty": false,
      "sendGetBody": false,
      "requestDatatype": "JSON",
      "responseDatatype": "JSON",
      "headers": {},
      "responseObjects": [
        {
          "type": "default",
          "key": "",
          "mockFile": ""
        }
      ]
    },
    {
      "name": "projectsProjectsObjectRolesList",
      "protocol": "REST",
      "method": "GET",
      "entitypath": "{base_path}/{version}/api/v2/projects/{pathv1}/object_roles/?{query}",
      "requestSchema": "schema.json",
      "responseSchema": "schema.json",
      "timeout": 0,
      "sendEmpty": false,
      "sendGetBody": false,
      "requestDatatype": "JSON",
      "responseDatatype": "JSON",
      "headers": {},
      "responseObjects": [
        {
          "type": "default",
          "key": "",
          "mockFile": ""
        }
      ]
    },
    {
      "name": "projectsProjectsPlaybooksRead",
      "protocol": "REST",
      "method": "GET",
      "entitypath": "{base_path}/{version}/api/v2/projects/{pathv1}/playbooks/?{query}",
      "requestSchema": "schema.json",
      "responseSchema": "schema.json",
      "timeout": 0,
      "sendEmpty": false,
      "sendGetBody": false,
      "requestDatatype": "JSON",
      "responseDatatype": "JSON",
      "headers": {},
      "responseObjects": [
        {
          "type": "default",
          "key": "",
          "mockFile": ""
        }
      ]
    },
    {
      "name": "projectsProjectsProjectUpdatesList",
      "protocol": "REST",
      "method": "GET",
      "entitypath": "{base_path}/{version}/api/v2/projects/{pathv1}/project_updates/?{query}",
      "requestSchema": "schema.json",
      "responseSchema": "schema.json",
      "timeout": 0,
      "sendEmpty": false,
      "sendGetBody": false,
      "requestDatatype": "JSON",
      "responseDatatype": "JSON",
      "headers": {},
      "responseObjects": [
        {
          "type": "default",
          "key": "",
          "mockFile": ""
        }
      ]
    },
    {
      "name": "projectsProjectsSchedulesList",
      "protocol": "REST",
      "method": "GET",
      "entitypath": "{base_path}/{version}/api/v2/projects/{pathv1}/schedules/?{query}",
      "requestSchema": "schema.json",
      "responseSchema": "schema.json",
      "timeout": 0,
      "sendEmpty": false,
      "sendGetBody": false,
      "requestDatatype": "JSON",
      "responseDatatype": "JSON",
      "headers": {},
      "responseObjects": [
        {
          "type": "default",
          "key": "",
          "mockFile": ""
        }
      ]
    },
    {
      "name": "projectsProjectsSchedulesCreate",
      "protocol": "REST",
      "method": "POST",
      "entitypath": "{base_path}/{version}/api/v2/projects/{pathv1}/schedules/?{query}",
      "requestSchema": "schema.json",
      "responseSchema": "schema.json",
      "timeout": 0,
      "sendEmpty": false,
      "sendGetBody": false,
      "requestDatatype": "JSON",
      "responseDatatype": "JSON",
      "headers": {},
      "responseObjects": [
        {
          "type": "default",
          "key": "",
          "mockFile": ""
        }
      ]
    },
    {
      "name": "projectsProjectsScmInventorySourcesList",
      "protocol": "REST",
      "method": "GET",
      "entitypath": "{base_path}/{version}/api/v2/projects/{pathv1}/scm_inventory_sources/?{query}",
      "requestSchema": "schema.json",
      "responseSchema": "schema.json",
      "timeout": 0,
      "sendEmpty": false,
      "sendGetBody": false,
      "requestDatatype": "JSON",
      "responseDatatype": "JSON",
      "headers": {},
      "responseObjects": [
        {
          "type": "default",
          "key": "",
          "mockFile": ""
        }
      ]
    },
    {
      "name": "projectsProjectsTeamsList",
      "protocol": "REST",
      "method": "GET",
      "entitypath": "{base_path}/{version}/api/v2/projects/{pathv1}/teams/?{query}",
      "requestSchema": "schema.json",
      "responseSchema": "schema.json",
      "timeout": 0,
      "sendEmpty": false,
      "sendGetBody": false,
      "requestDatatype": "JSON",
      "responseDatatype": "JSON",
      "headers": {},
      "responseObjects": [
        {
          "type": "default",
          "key": "",
          "mockFile": ""
        }
      ]
    },
    {
      "name": "projectsProjectsUpdateRead",
      "protocol": "REST",
      "method": "GET",
      "entitypath": "{base_path}/{version}/api/v2/projects/{pathv1}/update/?{query}",
      "requestSchema": "schema.json",
      "responseSchema": "schema.json",
      "timeout": 0,
      "sendEmpty": false,
      "sendGetBody": false,
      "requestDatatype": "JSON",
      "responseDatatype": "JSON",
      "headers": {},
      "responseObjects": [
        {
          "type": "default",
          "key": "",
          "mockFile": ""
        }
      ]
    },
    {
      "name": "projectsProjectsUpdateCreate",
      "protocol": "REST",
      "method": "POST",
      "entitypath": "{base_path}/{version}/api/v2/projects/{pathv1}/update/?{query}",
      "requestSchema": "schema.json",
      "responseSchema": "schema.json",
      "timeout": 0,
      "sendEmpty": false,
      "sendGetBody": false,
      "requestDatatype": "JSON",
      "responseDatatype": "JSON",
      "headers": {},
      "responseObjects": [
        {
          "type": "default",
          "key": "",
          "mockFile": ""
        }
      ]
    }
  ]
}