{
  "payloadData": [
    "string",
    "string",
    "string"
  ],
  "listHeatParameters": [
    {
      "uniqueId": "string",
      "name": "string",
      "type": "string",
      "description": "string",
      "currentValue": "string",
      "defaultValue": "string",
      "empty": false,
      "ownerId": "string"
    }
  ],
  "creationDate": 7,
  "timeout": 6,
  "esId": "string",
  "description": "string",
  "artifactLabel": "string",
  "artifactUUID": "string",
  "artifactVersion": "string",
  "heatParameters": [
    {
      "uniqueId": "string",
      "name": "string",
      "type": "string",
      "description": "string",
      "currentValue": "string",
      "defaultValue": "string",
      "empty": true,
      "ownerId": "string"
    },
    {
      "uniqueId": "string",
      "name": "string",
      "type": "string",
      "description": "string",
      "currentValue": "string",
      "defaultValue": "string",
      "empty": true,
      "ownerId": "string"
    },
    {
      "uniqueId": "string",
      "name": "string",
      "type": "string",
      "description": "string",
      "currentValue": "string",
      "defaultValue": "string",
      "empty": true,
      "ownerId": "string"
    },
    {
      "uniqueId": "string",
      "name": "string",
      "type": "string",
      "description": "string",
      "currentValue": "string",
      "defaultValue": "string",
      "empty": true,
      "ownerId": "string"
    },
    {
      "uniqueId": "string",
      "name": "string",
      "type": "string",
      "description": "string",
      "currentValue": "string",
      "defaultValue": "string",
      "empty": true,
      "ownerId": "string"
    },
    {
      "uniqueId": "string",
      "name": "string",
      "type": "string",
      "description": "string",
      "currentValue": "string",
      "defaultValue": "string",
      "empty": false,
      "ownerId": "string"
    },
    {
      "uniqueId": "string",
      "name": "string",
      "type": "string",
      "description": "string",
      "currentValue": "string",
      "defaultValue": "string",
      "empty": true,
      "ownerId": "string"
    },
    {
      "uniqueId": "string",
      "name": "string",
      "type": "string",
      "description": "string",
      "currentValue": "string",
      "defaultValue": "string",
      "empty": true,
      "ownerId": "string"
    }
  ],
  "artifactGroupType": "OTHER",
  "heatParamsUpdateDate": 5,
  "artifactChecksum": "string",
  "generatedFromId": "string",
  "mandatory": true,
  "serviceApi": false,
  "payloadUpdateDate": 8,
  "artifactName": "string",
  "artifactType": "string",
  "artifactRef": "string",
  "apiUrl": "string",
  "artifactRepository": "string",
  "userIdCreator": "string",
  "artifactCreator": "string",
  "userIdLastUpdater": "string",
  "updaterFullName": "string",
  "isFromCsar": true,
  "requiredArtifacts": [
    "string",
    "string",
    "string",
    "string",
    "string"
  ],
  "creatorFullName": "string",
  "artifactDisplayName": "string",
  "uniqueId": "string",
  "generated": true,
  "duplicated": false,
  "lastUpdateDate": 3,
  "empty": false,
  "ownerId": "string"
}