{
  "parent_rack_type": {
    "href": "string"
  },
  "name": "string",
  "rack_units_capacity": 2,
  "rack_position_order": 1,
  "physical_height": 8,
  "physical_width": 5,
  "x": 7,
  "y": 3,
  "width": 3,
  "height": 7,
  "href": "string"
}