{
  "parent_diagram": {
    "href": "string"
  },
  "creator": {
    "href": "string"
  },
  "master_free_text": {
    "href": "string"
  },
  "value": "string",
  "displayed_value": "string",
  "x": 1,
  "y": 3,
  "z_order": 1,
  "is_alias": true,
  "font_size": 1,
  "color": "string",
  "background_color": "string",
  "justification": 3,
  "can_move": true,
  "angle": 9,
  "is_displayed": false,
  "is_bold": true,
  "is_italic": false,
  "is_underline": true,
  "font_family": "string",
  "align": 8,
  "href": "string"
}