{
  "parent_type": {
    "href": "string"
  },
  "name": "string",
  "x": 6,
  "y": 2,
  "width": 8,
  "height": 4,
  "angle": 1,
  "slot_mapping": {
    "href": "string"
  },
  "slot_fields": {
    "href": "string"
  },
  "href": "string"
}