{
  "parent_port_representation": {
    "href": "string"
  },
  "is_reference_port": true,
  "node_type_property": {
    "href": "string"
  },
  "name": "string",
  "value": "string",
  "text_justification": 0,
  "text_align": 2,
  "font_family": 0,
  "font_size": 8,
  "font_color": "string",
  "fill_color": "string",
  "offset_x": 8,
  "offset_y": 6,
  "angle": 7,
  "is_bold": false,
  "is_italic": false,
  "is_underlined": false,
  "is_displayed": true,
  "href": "string"
}