{
  "actions": [
    {
      "name": "rESTfulRackContainerDesignsGet",
      "protocol": "REST",
      "method": "GET",
      "entitypath": "{base_path}/{version}/wapi/v1/rack_container_designs?{query}",
      "requestSchema": "schema.json",
      "responseSchema": "schema.json",
      "timeout": 0,
      "sendEmpty": false,
      "sendGetBody": false,
      "requestDatatype": "JSON",
      "responseDatatype": "JSON",
      "headers": {},
      "responseObjects": [
        {
          "type": "default",
          "key": "",
          "mockFile": "mockdatafiles/rESTfulRackContainerDesignsGet-default.json"
        }
      ]
    },
    {
      "name": "rESTfulRackContainerDesignsPut",
      "protocol": "REST",
      "method": "PUT",
      "entitypath": "{base_path}/{version}/wapi/v1/rack_container_designs?{query}",
      "requestSchema": "schema.json",
      "responseSchema": "schema.json",
      "timeout": 0,
      "sendEmpty": false,
      "requestDatatype": "JSON",
      "responseDatatype": "JSON",
      "headers": {},
      "responseObjects": [
        {
          "type": "default",
          "key": "",
          "mockFile": ""
        }
      ]
    },
    {
      "name": "rESTfulRackContainerDesignsPost",
      "protocol": "REST",
      "method": "POST",
      "entitypath": "{base_path}/{version}/wapi/v1/rack_container_designs?{query}",
      "requestSchema": "schema.json",
      "responseSchema": "schema.json",
      "timeout": 0,
      "sendEmpty": false,
      "requestDatatype": "JSON",
      "responseDatatype": "JSON",
      "headers": {},
      "responseObjects": [
        {
          "type": "default",
          "key": "",
          "mockFile": ""
        }
      ]
    },
    {
      "name": "rESTfulRackContainerDesignsGetById",
      "protocol": "REST",
      "method": "GET",
      "entitypath": "{base_path}/{version}/wapi/v1/rack_container_designs/{pathv1}?{query}",
      "requestSchema": "schema.json",
      "responseSchema": "schema.json",
      "timeout": 0,
      "sendEmpty": false,
      "sendGetBody": false,
      "requestDatatype": "JSON",
      "responseDatatype": "JSON",
      "headers": {},
      "responseObjects": [
        {
          "type": "default",
          "key": "",
          "mockFile": "mockdatafiles/rESTfulRackContainerDesignsGetById-default.json"
        }
      ]
    },
    {
      "name": "getWapiV1RackTypesRackTypeIdRackContainerDesigns",
      "protocol": "REST",
      "method": "GET",
      "entitypath": "{base_path}/{version}/wapi/v1/rack_types/{pathv1}/rack_container_designs?{query}",
      "requestSchema": "schema.json",
      "responseSchema": "schema.json",
      "timeout": 0,
      "sendEmpty": false,
      "sendGetBody": false,
      "requestDatatype": "JSON",
      "responseDatatype": "JSON",
      "headers": {},
      "responseObjects": [
        {
          "type": "default",
          "key": "",
          "mockFile": "mockdatafiles/getWapiV1RackTypesRackTypeIdRackContainerDesigns-default.json"
        }
      ]
    },
    {
      "name": "postWapiV1RackTypesRackTypeIdRackContainerDesigns",
      "protocol": "REST",
      "method": "POST",
      "entitypath": "{base_path}/{version}/wapi/v1/rack_types/{pathv1}/rack_container_designs?{query}",
      "requestSchema": "schema.json",
      "responseSchema": "schema.json",
      "timeout": 0,
      "sendEmpty": false,
      "requestDatatype": "JSON",
      "responseDatatype": "JSON",
      "headers": {},
      "responseObjects": [
        {
          "type": "default",
          "key": "",
          "mockFile": ""
        }
      ]
    },
    {
      "name": "getWapiV1RackTypesRackTypeIdRackContainerDesignsId",
      "protocol": "REST",
      "method": "GET",
      "entitypath": "{base_path}/{version}/wapi/v1/rack_types/{pathv1}/rack_container_designs/{pathv2}?{query}",
      "requestSchema": "schema.json",
      "responseSchema": "schema.json",
      "timeout": 0,
      "sendEmpty": false,
      "sendGetBody": false,
      "requestDatatype": "JSON",
      "responseDatatype": "JSON",
      "headers": {},
      "responseObjects": [
        {
          "type": "default",
          "key": "",
          "mockFile": "mockdatafiles/getWapiV1RackTypesRackTypeIdRackContainerDesignsId-default.json"
        }
      ]
    },
    {
      "name": "putWapiV1RackTypesRackTypeIdRackContainerDesignsId",
      "protocol": "REST",
      "method": "PUT",
      "entitypath": "{base_path}/{version}/wapi/v1/rack_types/{pathv1}/rack_container_designs/{pathv2}?{query}",
      "requestSchema": "schema.json",
      "responseSchema": "schema.json",
      "timeout": 0,
      "sendEmpty": false,
      "requestDatatype": "JSON",
      "responseDatatype": "JSON",
      "headers": {},
      "responseObjects": [
        {
          "type": "default",
          "key": "",
          "mockFile": ""
        }
      ]
    },
    {
      "name": "rESTfulRackContainerDesignsDelete",
      "protocol": "REST",
      "method": "DELETE",
      "entitypath": "{base_path}/{version}/wapi/v1/rack_types/{pathv1}/rack_container_designs/{pathv2}?{query}",
      "requestSchema": "schema.json",
      "responseSchema": "schema.json",
      "timeout": 0,
      "sendEmpty": false,
      "requestDatatype": "JSON",
      "responseDatatype": "JSON",
      "headers": {},
      "responseObjects": [
        {
          "type": "default",
          "key": "",
          "mockFile": ""
        }
      ]
    }
  ]
}