{
  "name": "string",
  "parent_link_type": {
    "href": "string"
  },
  "link_overrides": {
    "href": "string"
  },
  "is_system": false,
  "default_value": "string",
  "position": 1,
  "is_mandatory": false,
  "is_displayed": false,
  "is_in_properties": true,
  "text_justification": 1,
  "text_align": 1,
  "font_family": 12,
  "font_size": 8,
  "font_color": "string",
  "fill_color": "string",
  "offset_x": 4,
  "offset_y": 10,
  "angle": 9,
  "is_bold": true,
  "is_italic": false,
  "is_underlined": true,
  "is_lock_list": true,
  "is_type_field": false,
  "is_unique_for_this_type": false,
  "is_unique_for_all_types": false,
  "is_upright_alignment": true,
  "anchor": 1,
  "href": "string"
}