{
  "actions": [
    {
      "name": "rESTfulCircuitPropertyValuesGet",
      "protocol": "REST",
      "method": "GET",
      "entitypath": "{base_path}/{version}/wapi/v1/circuit_property_values?{query}",
      "requestSchema": "schema.json",
      "responseSchema": "schema.json",
      "timeout": 0,
      "sendEmpty": false,
      "sendGetBody": false,
      "requestDatatype": "JSON",
      "responseDatatype": "JSON",
      "headers": {},
      "responseObjects": [
        {
          "type": "default",
          "key": "",
          "mockFile": "mockdatafiles/rESTfulCircuitPropertyValuesGet-default.json"
        }
      ]
    },
    {
      "name": "getWapiV1CircuitsCircuitIdCircuitPropertyValues",
      "protocol": "REST",
      "method": "GET",
      "entitypath": "{base_path}/{version}/wapi/v1/circuits/{pathv1}/circuit_property_values?{query}",
      "requestSchema": "schema.json",
      "responseSchema": "schema.json",
      "timeout": 0,
      "sendEmpty": false,
      "sendGetBody": false,
      "requestDatatype": "JSON",
      "responseDatatype": "JSON",
      "headers": {},
      "responseObjects": [
        {
          "type": "default",
          "key": "",
          "mockFile": "mockdatafiles/getWapiV1CircuitsCircuitIdCircuitPropertyValues-default.json"
        }
      ]
    },
    {
      "name": "rESTfulCircuitPropertyValuesPut",
      "protocol": "REST",
      "method": "PUT",
      "entitypath": "{base_path}/{version}/wapi/v1/circuits/{pathv1}/circuit_property_values?{query}",
      "requestSchema": "schema.json",
      "responseSchema": "schema.json",
      "timeout": 0,
      "sendEmpty": false,
      "requestDatatype": "JSON",
      "responseDatatype": "JSON",
      "headers": {},
      "responseObjects": [
        {
          "type": "default",
          "key": "",
          "mockFile": ""
        }
      ]
    },
    {
      "name": "rESTfulCircuitPropertyValuesGetById",
      "protocol": "REST",
      "method": "GET",
      "entitypath": "{base_path}/{version}/wapi/v1/circuits/{pathv1}/circuit_property_values/{pathv2}?{query}",
      "requestSchema": "schema.json",
      "responseSchema": "schema.json",
      "timeout": 0,
      "sendEmpty": false,
      "sendGetBody": false,
      "requestDatatype": "JSON",
      "responseDatatype": "JSON",
      "headers": {},
      "responseObjects": [
        {
          "type": "default",
          "key": "",
          "mockFile": "mockdatafiles/rESTfulCircuitPropertyValuesGetById-default.json"
        }
      ]
    },
    {
      "name": "rESTfulCircuitPropertyValuesInitAbsentValues",
      "protocol": "REST",
      "method": "POST",
      "entitypath": "{base_path}/{version}/wapi/v1/circuits/{pathv1}/circuit_property_values/init_absent_values?{query}",
      "requestSchema": "schema.json",
      "responseSchema": "schema.json",
      "timeout": 0,
      "sendEmpty": false,
      "requestDatatype": "JSON",
      "responseDatatype": "JSON",
      "headers": {},
      "responseObjects": [
        {
          "type": "default",
          "key": "",
          "mockFile": ""
        }
      ]
    }
  ]
}