{
  "parent_vis_link": {
    "href": "string"
  },
  "parent_link_property_value": {
    "href": "string"
  },
  "offset_x": 6,
  "offset_y": 2,
  "anchor": 6,
  "upright_alignment": false,
  "font_size": 4,
  "color": "string",
  "background_color": "string",
  "justification": 9,
  "can_move": true,
  "angle": 2,
  "is_displayed": true,
  "is_bold": true,
  "is_italic": true,
  "is_underline": true,
  "font_family": "string",
  "align": 9,
  "href": "string"
}