{
  "system_object_id": "string",
  "in_stock": 10,
  "base_node_type": {
    "href": "string"
  },
  "name": "string",
  "background": "string",
  "peak_power": 6,
  "weight": 5,
  "physical_height": 8,
  "physical_width": 1,
  "vendor": {
    "href": "string"
  },
  "port_representations": {
    "href": "string"
  },
  "slot_representations": {
    "href": "string"
  },
  "href": "string"
}