{
  "actions": [
    {
      "name": "rESTfulHierarchyGet",
      "protocol": "REST",
      "method": "GET",
      "entitypath": "{base_path}/{version}/wapi/v1/hierarchy?{query}",
      "requestSchema": "schema.json",
      "responseSchema": "schema.json",
      "timeout": 0,
      "sendEmpty": false,
      "sendGetBody": false,
      "requestDatatype": "JSON",
      "responseDatatype": "JSON",
      "headers": {},
      "responseObjects": [
        {
          "type": "default",
          "key": "",
          "mockFile": "mockdatafiles/rESTfulHierarchyGet-default.json"
        }
      ]
    },
    {
      "name": "rESTfulHierarchyGetById",
      "protocol": "REST",
      "method": "GET",
      "entitypath": "{base_path}/{version}/wapi/v1/hierarchy/{pathv1}?{query}",
      "requestSchema": "schema.json",
      "responseSchema": "schema.json",
      "timeout": 0,
      "sendEmpty": false,
      "sendGetBody": false,
      "requestDatatype": "JSON",
      "responseDatatype": "JSON",
      "headers": {},
      "responseObjects": [
        {
          "type": "default",
          "key": "",
          "mockFile": "mockdatafiles/rESTfulHierarchyGetById-default.json"
        }
      ]
    }
  ]
}