{
  "actions": [
    {
      "name": "rESTfulCardsGet",
      "protocol": "REST",
      "method": "GET",
      "entitypath": "{base_path}/{version}/wapi/v1/{pathv1}/{pathv2}/cards?{query}",
      "requestSchema": "schema.json",
      "responseSchema": "schema.json",
      "timeout": 0,
      "sendEmpty": false,
      "sendGetBody": false,
      "requestDatatype": "JSON",
      "responseDatatype": "JSON",
      "headers": {},
      "responseObjects": [
        {
          "type": "default",
          "key": "",
          "mockFile": "mockdatafiles/rESTfulCardsGet-default.json"
        }
      ]
    },
    {
      "name": "getWapiV1Cards",
      "protocol": "REST",
      "method": "GET",
      "entitypath": "{base_path}/{version}/wapi/v1/cards?{query}",
      "requestSchema": "schema.json",
      "responseSchema": "schema.json",
      "timeout": 0,
      "sendEmpty": false,
      "sendGetBody": false,
      "requestDatatype": "JSON",
      "responseDatatype": "JSON",
      "headers": {},
      "responseObjects": [
        {
          "type": "default",
          "key": "",
          "mockFile": "mockdatafiles/getWapiV1Cards-default.json"
        }
      ]
    },
    {
      "name": "rESTfulCardsGetById",
      "protocol": "REST",
      "method": "GET",
      "entitypath": "{base_path}/{version}/wapi/v1/cards/{pathv1}?{query}",
      "requestSchema": "schema.json",
      "responseSchema": "schema.json",
      "timeout": 0,
      "sendEmpty": false,
      "sendGetBody": false,
      "requestDatatype": "JSON",
      "responseDatatype": "JSON",
      "headers": {},
      "responseObjects": [
        {
          "type": "default",
          "key": "",
          "mockFile": "mockdatafiles/rESTfulCardsGetById-default.json"
        }
      ]
    },
    {
      "name": "rESTfulCardsPut",
      "protocol": "REST",
      "method": "PUT",
      "entitypath": "{base_path}/{version}/wapi/v1/cards/{pathv1}?{query}",
      "requestSchema": "schema.json",
      "responseSchema": "schema.json",
      "timeout": 0,
      "sendEmpty": false,
      "requestDatatype": "JSON",
      "responseDatatype": "JSON",
      "headers": {},
      "responseObjects": [
        {
          "type": "default",
          "key": "",
          "mockFile": ""
        }
      ]
    },
    {
      "name": "rESTfulCardsDelete",
      "protocol": "REST",
      "method": "DELETE",
      "entitypath": "{base_path}/{version}/wapi/v1/cards/{pathv1}?{query}",
      "requestSchema": "schema.json",
      "responseSchema": "schema.json",
      "timeout": 0,
      "sendEmpty": false,
      "requestDatatype": "JSON",
      "responseDatatype": "JSON",
      "headers": {},
      "responseObjects": [
        {
          "type": "default",
          "key": "",
          "mockFile": ""
        }
      ]
    }
  ]
}