{
  "actions": [
    {
      "name": "rESTfulLinkOverridesGet",
      "protocol": "REST",
      "method": "GET",
      "entitypath": "{base_path}/{version}/wapi/v1/link_overrides?{query}",
      "requestSchema": "schema.json",
      "responseSchema": "schema.json",
      "timeout": 0,
      "sendEmpty": false,
      "sendGetBody": false,
      "requestDatatype": "JSON",
      "responseDatatype": "JSON",
      "headers": {},
      "responseObjects": [
        {
          "type": "default",
          "key": "",
          "mockFile": "mockdatafiles/rESTfulLinkOverridesGet-default.json"
        }
      ]
    },
    {
      "name": "rESTfulLinkOverridesPut",
      "protocol": "REST",
      "method": "PUT",
      "entitypath": "{base_path}/{version}/wapi/v1/link_overrides?{query}",
      "requestSchema": "schema.json",
      "responseSchema": "schema.json",
      "timeout": 0,
      "sendEmpty": false,
      "requestDatatype": "JSON",
      "responseDatatype": "JSON",
      "headers": {},
      "responseObjects": [
        {
          "type": "default",
          "key": "",
          "mockFile": ""
        }
      ]
    },
    {
      "name": "rESTfulLinkOverridesPost",
      "protocol": "REST",
      "method": "POST",
      "entitypath": "{base_path}/{version}/wapi/v1/link_overrides?{query}",
      "requestSchema": "schema.json",
      "responseSchema": "schema.json",
      "timeout": 0,
      "sendEmpty": false,
      "requestDatatype": "JSON",
      "responseDatatype": "JSON",
      "headers": {},
      "responseObjects": [
        {
          "type": "default",
          "key": "",
          "mockFile": ""
        }
      ]
    },
    {
      "name": "rESTfulLinkOverridesGetById",
      "protocol": "REST",
      "method": "GET",
      "entitypath": "{base_path}/{version}/wapi/v1/link_overrides/{pathv1}?{query}",
      "requestSchema": "schema.json",
      "responseSchema": "schema.json",
      "timeout": 0,
      "sendEmpty": false,
      "sendGetBody": false,
      "requestDatatype": "JSON",
      "responseDatatype": "JSON",
      "headers": {},
      "responseObjects": [
        {
          "type": "default",
          "key": "",
          "mockFile": "mockdatafiles/rESTfulLinkOverridesGetById-default.json"
        }
      ]
    },
    {
      "name": "getWapiV1LinkTypePropertiesLinkTypePropertyIdLinkOverrides",
      "protocol": "REST",
      "method": "GET",
      "entitypath": "{base_path}/{version}/wapi/v1/link_type_properties/{pathv1}/link_overrides?{query}",
      "requestSchema": "schema.json",
      "responseSchema": "schema.json",
      "timeout": 0,
      "sendEmpty": false,
      "sendGetBody": false,
      "requestDatatype": "JSON",
      "responseDatatype": "JSON",
      "headers": {},
      "responseObjects": [
        {
          "type": "default",
          "key": "",
          "mockFile": "mockdatafiles/getWapiV1LinkTypePropertiesLinkTypePropertyIdLinkOverrides-default.json"
        }
      ]
    },
    {
      "name": "getWapiV1LinkTypePropertiesLinkTypePropertyIdLinkOverridesId",
      "protocol": "REST",
      "method": "GET",
      "entitypath": "{base_path}/{version}/wapi/v1/link_type_properties/{pathv1}/link_overrides/{pathv2}?{query}",
      "requestSchema": "schema.json",
      "responseSchema": "schema.json",
      "timeout": 0,
      "sendEmpty": false,
      "sendGetBody": false,
      "requestDatatype": "JSON",
      "responseDatatype": "JSON",
      "headers": {},
      "responseObjects": [
        {
          "type": "default",
          "key": "",
          "mockFile": "mockdatafiles/getWapiV1LinkTypePropertiesLinkTypePropertyIdLinkOverridesId-default.json"
        }
      ]
    },
    {
      "name": "getWapiV1LinkTypesLinkTypeIdLinkTypePropertiesLinkTypePropertyIdLinkOverrides",
      "protocol": "REST",
      "method": "GET",
      "entitypath": "{base_path}/{version}/wapi/v1/link_types/{pathv1}/link_type_properties/{pathv2}/link_overrides?{query}",
      "requestSchema": "schema.json",
      "responseSchema": "schema.json",
      "timeout": 0,
      "sendEmpty": false,
      "sendGetBody": false,
      "requestDatatype": "JSON",
      "responseDatatype": "JSON",
      "headers": {},
      "responseObjects": [
        {
          "type": "default",
          "key": "",
          "mockFile": "mockdatafiles/getWapiV1LinkTypesLinkTypeIdLinkTypePropertiesLinkTypePropertyIdLinkOverrides-default.json"
        }
      ]
    },
    {
      "name": "postWapiV1LinkTypesLinkTypeIdLinkTypePropertiesLinkTypePropertyIdLinkOverrides",
      "protocol": "REST",
      "method": "POST",
      "entitypath": "{base_path}/{version}/wapi/v1/link_types/{pathv1}/link_type_properties/{pathv2}/link_overrides?{query}",
      "requestSchema": "schema.json",
      "responseSchema": "schema.json",
      "timeout": 0,
      "sendEmpty": false,
      "requestDatatype": "JSON",
      "responseDatatype": "JSON",
      "headers": {},
      "responseObjects": [
        {
          "type": "default",
          "key": "",
          "mockFile": ""
        }
      ]
    },
    {
      "name": "getWapiV1LinkTypesLinkTypeIdLinkTypePropertiesLinkTypePropertyIdLinkOverridesId",
      "protocol": "REST",
      "method": "GET",
      "entitypath": "{base_path}/{version}/wapi/v1/link_types/{pathv1}/link_type_properties/{pathv2}/link_overrides/{pathv3}?{query}",
      "requestSchema": "schema.json",
      "responseSchema": "schema.json",
      "timeout": 0,
      "sendEmpty": false,
      "sendGetBody": false,
      "requestDatatype": "JSON",
      "responseDatatype": "JSON",
      "headers": {},
      "responseObjects": [
        {
          "type": "default",
          "key": "",
          "mockFile": "mockdatafiles/getWapiV1LinkTypesLinkTypeIdLinkTypePropertiesLinkTypePropertyIdLinkOverridesId-default.json"
        }
      ]
    },
    {
      "name": "putWapiV1LinkTypesLinkTypeIdLinkTypePropertiesLinkTypePropertyIdLinkOverridesId",
      "protocol": "REST",
      "method": "PUT",
      "entitypath": "{base_path}/{version}/wapi/v1/link_types/{pathv1}/link_type_properties/{pathv2}/link_overrides/{pathv3}?{query}",
      "requestSchema": "schema.json",
      "responseSchema": "schema.json",
      "timeout": 0,
      "sendEmpty": false,
      "requestDatatype": "JSON",
      "responseDatatype": "JSON",
      "headers": {},
      "responseObjects": [
        {
          "type": "default",
          "key": "",
          "mockFile": ""
        }
      ]
    },
    {
      "name": "rESTfulLinkOverridesDelete",
      "protocol": "REST",
      "method": "DELETE",
      "entitypath": "{base_path}/{version}/wapi/v1/link_types/{pathv1}/link_type_properties/{pathv2}/link_overrides/{pathv3}?{query}",
      "requestSchema": "schema.json",
      "responseSchema": "schema.json",
      "timeout": 0,
      "sendEmpty": false,
      "requestDatatype": "JSON",
      "responseDatatype": "JSON",
      "headers": {},
      "responseObjects": [
        {
          "type": "default",
          "key": "",
          "mockFile": ""
        }
      ]
    }
  ]
}