{
  "parent_diagram": {
    "href": "string"
  },
  "displayed_fields": {
    "href": "string"
  },
  "visual_override": {
    "href": "string"
  },
  "is_reference_node": true,
  "x": 3,
  "y": 3,
  "width": 9,
  "height": 4,
  "image_override": "string",
  "is_keep_aspect_ratio": false,
  "can_move": false,
  "can_resize": true,
  "can_rotate": true,
  "can_delete": false,
  "is_hidden": true,
  "z_order": 3,
  "angle": 6,
  "href": "string"
}