{
  "$id": "schema.json",
  "type": "object",
  "schema": "http://json-schema.org/draft-07/schema#",
  "translate": true,
  "dynamicfields": true,
  "properties": {
    "ph_request_type": {
      "type": "string",
      "description": "type of request (internal to adapter)",
      "default": "rESTfulVisNodeDisplayedFieldsGet",
      "enum": [
        "rESTfulVisNodeDisplayedFieldsGet",
        "rESTfulVisNodeDisplayedFieldsPut",
        "rESTfulVisNodeDisplayedFieldsPost",
        "rESTfulVisNodeDisplayedFieldsGetById"
      ],
      "external_name": "ph_request_type"
    },
    "visNodeId": {
      "type": "number",
      "description": "Vis node id.",
      "parse": false,
      "encode": false,
      "encrypt": {
        "type": "AES",
        "key": ""
      },
      "external_name": "vis_node_id"
    },
    "perPage": {
      "type": "number",
      "description": "Resources per page.",
      "parse": false,
      "encode": false,
      "encrypt": {
        "type": "AES",
        "key": ""
      },
      "external_name": "per_page"
    },
    "showChildCollections": {
      "type": "boolean",
      "description": "If unset or set to false all unexpanded child\r\n            collections contain just a single &#34;href&#34; link. Otherwise they also contain basic collection\r\n            info.",
      "parse": false,
      "encode": false,
      "encrypt": {
        "type": "AES",
        "key": ""
      },
      "external_name": "show_child_collections"
    },
    "nodePropertyValueId": {
      "type": "number",
      "description": "Node property value id.",
      "parse": false,
      "encode": false,
      "encrypt": {
        "type": "AES",
        "key": ""
      },
      "external_name": "node_property_value_id"
    }
  },
  "definitions": {}
}