{
  "name": "string",
  "parent_diagram": {
    "href": "string"
  },
  "node_type": {
    "href": "string"
  },
  "creator": {
    "href": "string"
  },
  "master_node": {
    "href": "string"
  },
  "diagram_settings": {
    "href": "string"
  },
  "node_property_values": {
    "href": "string"
  },
  "vis_nodes": {
    "href": "string"
  },
  "map_coordinates": {
    "href": "string"
  },
  "aliases": {
    "href": "string"
  },
  "double_click_behavior": "string",
  "is_alias": false,
  "breadcrumbs": "string",
  "href": "string"
}