{
  "name": "adapter-incognito_soap",
  "webName": "Adapter for Integration to Incognito",
  "supportLevel": "community",
  "vendor": "Incognito",
  "product": "Incognito",
  "techAlliance": false,
  "osVersion": [],
  "apiVersions": [],
  "iapVersions": [
    "2021.1.x",
    "2021.2.x",
    "2022.1.x",
    "2023.1.x"
  ],
  "method": "SOAP",
  "type": "Adapter",
  "domains": [
    "Data Center",
    "Network Services"
  ],
  "tags": [
    "Configuration & Compliance",
    "Network Infrastructure Changes",
    "Software Upgrades & Device Maintenance"
  ],
  "useCases": [
    "Device Onboarding",
    "Router configuration backup or restore",
    "Run network compliance checks and remediation",
    "Determine configuration drift",
    "Golden Configuration",
    "Port/VLAN Configuration",
    "EVPN & VXLAN",
    "Port Turn-up",
    "Assign Network & IP",
    "Cloud Managed Networks",
    "Software Upgrade"
  ],
  "deprecated": {
    "isDeprecated": false
  },
  "brokerSince": "",
  "authMethods": [
    {
      "type": "Custom",
      "primary": true
    }
  ],
  "documentation": {
    "storeLink": "",
    "npmLink": "https://www.npmjs.com/package/@itentialopensource/adapter-incognito_soap",
    "repoLink": "https://gitlab.com/itentialopensource/adapters/adapter-incognito_soap",
    "docLink": "https://gitlab.com/itentialopensource/adapters/adapter-incognito_soap/-/blob/master/README.md?ref_type=heads",
    "demoLinks": [],
    "trainingLinks": [
      {
        "title": "Itential Academy",
        "link": "https://www.itential.com/itential-academy/"
      }
    ],
    "faqLink": "https://docs.itential.com/opensource/docs/troubleshooting-an-adapter",
    "contributeLink": "https://gitlab.com/itentialopensource/adapters/contributing-guide",
    "issueLink": "https://itential.atlassian.net/servicedesk/customer/portals",
    "webLink": "https://www.itential.com/adapters/incognito-soap/",
    "vendorLink": "https://www.incognito.com/",
    "productLink": "https://www.incognito.com/",
    "apiLinks": [],
    "workshopLinks": [],
    "workshopHomePage": "https://www.itential.com/get-started/"
  },
  "assets": [],
  "relatedItems": {
    "adapters": [],
    "integrations": [],
    "ecosystemApplications": [],
    "workflowProjects": [],
    "transformationProjects": [],
    "exampleProjects": []
  }
}