{
  "config": "string",
  "containerCount": 9,
  "dateTimeInLongFormat": 6,
  "factoryId": 1,
  "id": 5,
  "isAutoBuilder": "string",
  "isDefault": "string",
  "isDraft": true,
  "key": "string",
  "name": "string",
  "netElementCount": 8,
  "note": "string",
  "reconciled": true,
  "type": "string",
  "user": "string"
}