{
  "containerList": [
    {},
    {},
    {},
    {},
    {},
    {},
    {},
    {},
    {},
    {}
  ],
  "keywordList": [
    "string",
    "string",
    "string",
    "string",
    "string"
  ],
  "netElementContainerList": [
    {},
    {}
  ],
  "netElementList": [
    {},
    {},
    {},
    {},
    {},
    {},
    {},
    {},
    {},
    {}
  ],
  "total": 8
}