{
  "configs": [
    {},
    {},
    {},
    {},
    {},
    {},
    {}
  ],
  "designedConfig": [
    {},
    {},
    {},
    {},
    {},
    {},
    {},
    {},
    {}
  ],
  "errors": "string",
  "isReconcileInvoked": true,
  "mismatch": 4,
  "new": 8,
  "reconcile": 8,
  "reconciledConfig": "string",
  "runningConfig": [
    {},
    {},
    {},
    {},
    {},
    {}
  ],
  "targetIpAddress": "string",
  "total": 8,
  "warning": [
    "string",
    "string",
    "string",
    "string",
    "string",
    "string",
    "string",
    "string"
  ]
}