{
  "name": "adapter-cvp",
  "webName": "Adapter for Integration to Arista Networks Cloud Vision Portal",
  "supportLevel": "community",
  "vendor": "Arista Networks",
  "product": "CloudVision Portal",
  "techAlliance": true,
  "osVersion": [],
  "apiVersions": [],
  "iapVersions": [
    "2021.1.x",
    "2021.2.x",
    "2022.1.x",
    "2023.1.x"
  ],
  "method": "REST",
  "type": "Adapter",
  "domains": [
    "Data Center",
    "Network Services"
  ],
  "tags": [
    "Configuration & Compliance",
    "Network Infrastructure Changes",
    "Software Upgrades & Device Maintenance"
  ],
  "useCases": [
    "Device Onboarding",
    "Router configuration backup or restore",
    "Run network compliance checks and remediation",
    "Determine configuration drift",
    "Golden Configuration",
    "Port/VLAN Configuration",
    "EVPN & VXLAN",
    "Port Turn-up",
    "Assign Network & IP",
    "Cloud Managed Networks",
    "Software Upgrade"
  ],
  "deprecated": {
    "isDeprecated": false
  },
  "brokerSince": "",
  "authMethods": [
    {
      "type": "API Key",
      "primary": true
    },
    {
      "type": "Token",
      "primary": false
    }
  ],
  "documentation": {
    "storeLink": "",
    "npmLink": "https://www.npmjs.com/package/@itentialopensource/adapter-cvp",
    "repoLink": "https://gitlab.com/itentialopensource/adapters/adapter-cvp",
    "docLink": "https://gitlab.com/itentialopensource/adapters/adapter-cvp/-/blob/master/README.md?ref_type=heads",
    "demoLinks": [],
    "trainingLinks": [
      {
        "title": "Itential Academy",
        "link": "https://www.itential.com/itential-academy/"
      }
    ],
    "faqLink": "https://docs.itential.com/opensource/docs/troubleshooting-an-adapter",
    "contributeLink": "https://gitlab.com/itentialopensource/adapters/contributing-guide",
    "issueLink": "https://itential.atlassian.net/servicedesk/customer/portals",
    "webLink": "https://www.itential.com/adapters/cloud-vision-portal/",
    "vendorLink": "https://www.arista.com/en/",
    "productLink": "https://www.arista.com/en/cg-cv/cv-cloudvision-portal-cvp-overview",
    "apiLinks": [
      {
        "title": "Understanding CloudVIsion APIs and accessing NetDB data",
        "link": "https://arista.my.site.com/AristaCommunity/s/article/Understanding-CloudVIsion-APIs-and-accessing-NetDB-data",
        "public": true
      }
    ],
    "workshopLinks": [],
    "workshopHomePage": "https://www.itential.com/get-started/"
  },
  "assets": [],
  "relatedItems": {
    "adapters": [],
    "integrations": [],
    "ecosystemApplications": [],
    "workflowProjects": [],
    "transformationProjects": [],
    "exampleProjects": []
  }
}