{
  "commandList": [
    "string",
    "string",
    "string",
    "string",
    "string",
    "string"
  ],
  "deviceList": [
    "string",
    "string",
    "string",
    "string",
    "string",
    "string",
    "string",
    "string",
    "string",
    "string"
  ],
  "frequency": 6,
  "key": "string",
  "lastUpdatedBy": "string",
  "name": "string"
}