{
   "items":[
      {
         "expiration_date":"2018-11-24T00:00:00.000Z",
         "cloudify_version":"4.6",
         "license_edition":"Spire",
         "capabilities":[
            "Mock1",
            "Mock2"
         ],
         "trial":false,
         "customer_id":"CloudifyMock",
         "expired":true
      }
   ],
   "metadata":{
      "pagination":{
         "total":1,
         "offset":0,
         "size":1000
      }
   }
}
