{
  "items": [
    {"deployment_id": "s", "nodes": 1},
    {"deployment_id": "s2", "nodes": 1},
    {"deployment_id": "s3", "nodes": 1},
    {"deployment_id": "s4", "nodes": 1},
    {"deployment_id": "s5", "nodes": 1},
    {"deployment_id": "sga", "nodes": 5},
    {"deployment_id": "sga2", "nodes": 5}
  ],
  "metadata": {
    "pagination": {
      "offset": 0,
      "size": 1000,
      "total": 7
    }
  }
}
