{
  "actions": [
    {
      "name": "getBlueprints",
      "protocol": "REST",
      "method": "GET",
      "entitypath": "{base_path}/{version}/blueprints?{query}",
      "requestSchema": "schema.json",
      "responseSchema": "schema.json",
      "timeout": 0,
      "sendEmpty": false,
      "sendGetBody": false,
      "requestDatatype": "JSON",
      "responseDatatype": "JSON",
      "headers": {},
      "responseObjects": [
        {
          "type": "default",
          "key": "",
          "mockFile": "mockdatafiles/getBlueprints-default.json"
        }
      ]
    },
    {
      "name": "updateBlueprint",
      "protocol": "REST",
      "method": "PUT",
      "entitypath": "{base_path}/{version}/blueprints/{pathv1}?{query}",
      "requestSchema": "schema.json",
      "responseSchema": "schema.json",
      "timeout": 0,
      "sendEmpty": false,
      "sendGetBody": false,
      "requestDatatype": "JSON",
      "responseDatatype": "JSON",
      "headers": {},
      "responseObjects": [
        {
          "type": "default",
          "key": "",
          "mockFile": "mockdatafiles/uploadBlueprint-default.json"
        }
      ]
    },
    {
      "name": "deleteBlueprint",
      "protocol": "REST",
      "method": "DELETE",
      "entitypath": "{base_path}/{version}/blueprints/{pathv1}?{query}",
      "requestSchema": "schema.json",
      "responseSchema": "schema.json",
      "timeout": 0,
      "sendEmpty": false,
      "sendGetBody": false,
      "requestDatatype": "JSON",
      "responseDatatype": "JSON",
      "headers": {},
      "responseObjects": [
        {
          "type": "default",
          "key": "",
          "mockFile": "mockdatafiles/deleteBlueprint-default.json"
        }
      ]
    },
    {
      "name": "setGlobalBlueprint",
      "protocol": "REST",
      "method": "PATCH",
      "entitypath": "{base_path}/{version}/blueprints/{pathv1}/set-global?{query}",
      "requestSchema": "schema.json",
      "responseSchema": "schema.json",
      "timeout": 0,
      "sendEmpty": false,
      "sendGetBody": false,
      "requestDatatype": "JSON",
      "responseDatatype": "JSON",
      "headers": {},
      "responseObjects": [
        {
          "type": "default",
          "key": "",
          "mockFile": "mockdatafiles/setGlobalBlueprint-default.json"
        }
      ]
    },
    {
      "name": "setBlueprintVisibility",
      "protocol": "REST",
      "method": "PATCH",
      "entitypath": "{base_path}/{version}/blueprints/{pathv1}/set-visibility?{query}",
      "requestSchema": "schema.json",
      "responseSchema": "schema.json",
      "timeout": 0,
      "sendEmpty": false,
      "sendGetBody": false,
      "requestDatatype": "JSON",
      "responseDatatype": "JSON",
      "headers": {},
      "responseObjects": [
        {
          "type": "default",
          "key": "",
          "mockFile": "mockdatafiles/setBlueprintVisibility-default.json"
        }
      ]
    },
    {
      "name": "summarizeBluepriints",
      "protocol": "REST",
      "method": "GET",
      "entitypath": "{base_path}/{version}/summary/blueprints?{query}",
      "requestSchema": "schema.json",
      "responseSchema": "schema.json",
      "timeout": 0,
      "sendEmpty": false,
      "sendGetBody": false,
      "requestDatatype": "JSON",
      "responseDatatype": "JSON",
      "headers": {},
      "responseObjects": [
        {
          "type": "default",
          "key": "",
          "mockFile": "mockdatafiles/summarizeBlueprints-default.json"
        }
      ]
    }
  ]
}