{
    "items": [
        {
            "created_at": "2019-06-12T10:52:45.858Z",
            "created_by": "admin",
            "location": "41.8333925, -88.0121478",
            "name": "Chicago",
            "visibility": "tenant",
            "tenant_name": "default_tenant"
        },
        {
            "created_at": "2019-06-12T10:53:06.968Z",
            "created_by": "admin",
            "location": "25.7823404, -80.3695441",
            "name": "Chicago",
            "visibility": "tenant",
            "tenant_name": "default_tenant"
        },
        {
            "created_at": "2019-06-12T10:53:32.838Z",
            "created_by": "admin",
            "location": "32.080327, 34.767420",
            "name": "Tel-Aviv",
            "visibility": "tenant",
            "tenant_name": "default_tenant"
        }
    ],
    "metadata": {
        "pagination": {
            "offset": 0,
            "size": 1000,
            "total": 3
        }
    }
}
