{
  "$id": "schema.json",
  "type": "object",
  "schema": "http://json-schema.org/draft-07/schema#",
  "translate": true,
  "dynamicfields": true,
  "properties": {
    "ph_request_type": {
      "type": "string",
      "description": "type of request (internal to adapter)",
      "default": "listSnapshots",
      "enum": [
        "listSnapshots",
        "createSnapshot",
        "deleteSnapshot",
        "restoreSnapshot",
        "uploadSnapshot",
        "snapshotRestoreStatus"
      ],
      "external_name": "ph_request_type"
    },
    "include": {
      "type": "string",
      "description": "",
      "parse": false,
      "encode": false,
      "encrypt": {
        "type": "AES",
        "key": ""
      },
      "external_name": "_include"
    },
    "snapshotArchiveUrl": {
      "type": "string",
      "description": "",
      "parse": false,
      "encode": false,
      "encrypt": {
        "type": "AES",
        "key": ""
      },
      "external_name": "snapshot_archive_url"
    }
  },
  "definitions": {}
}