{
  "main_file_name": "singlehost-blueprint.yaml",
  "description": "This blueprint installs a simple web server on the manager VM using Cloudify's script plugin.\n",
  "tenant_name": "default_tenant",
  "created_at": "2017-04-19T10:56:06.267Z",
  "updated_at": "2017-04-19T10:56:06.267Z",
  "created_by": "admin",
  "private_resource": false,
  "visibility": "global",
  "plan": {},
  "id": "hello-world"
}
