{
  "errors": [],
  "statistics": [
    {
      "owner": "errorJson",
      "description": "New adapter errors available for use",
      "addedErrors": 0
    },
    {
      "owner": "errorJson",
      "description": "Adapter errors no longer available for use",
      "removedErrors": 0
    },
    {
      "owner": "errorJson",
      "description": "Adapter errors that have been updated (e.g. recommendation changes)",
      "updatedErrors": 29
    },
    {
      "owner": "packageJson",
      "description": "Number of production dependencies",
      "numberDependencies": 6
    },
    {
      "owner": "packageJson",
      "description": "Number of development dependencies",
      "numberDevDependencies": 9
    },
    {
      "owner": "packageJson",
      "description": "Number of npm scripts",
      "numberScripts": 9
    },
    {
      "owner": "packageJson",
      "description": "Runtime Library dependency",
      "runtimeLibrary": "^4.8.4"
    },
    {
      "owner": "propertiesSchemaJson",
      "description": "Adapter properties defined in the propertiesSchema file",
      "definedProperties": 47
    },
    {
      "owner": "readmeMd",
      "description": "Number of lines in the README.md",
      "readmeLines": 450
    },
    {
      "owner": "unitTestJS",
      "description": "Number of lines of code in unit tests",
      "unitTestCodeLines": 2857
    },
    {
      "owner": "unitTestJS",
      "description": "Number of unit tests",
      "unitTests": 259
    },
    {
      "owner": "integrationTestJS",
      "description": "Number of lines of code in integration tests",
      "integrationTestCodeLines": 3017
    },
    {
      "owner": "integrationTestJS",
      "description": "Number of integration tests",
      "integrationTests": 100
    },
    {
      "owner": "Overall",
      "description": "Total lines of Code (excludes adapter.js since not updated)",
      "totalCodeLines": 6358
    },
    {
      "owner": "Overall",
      "description": "Total Tests",
      "totalTests": 359
    },
    {
      "owner": "staticFile",
      "description": "Number of lines of code in adapterBase.js",
      "totalBaseCodeLines": 484
    },
    {
      "owner": "staticFile",
      "description": "Number of static files added",
      "totalStaticFiles": 18
    }
  ]
}