{
  "actions": [
    {
      "name": "postVcenterdatacenter",
      "protocol": "REST",
      "method": "POST",
      "entitypath": "{base_path}/{version}/vcenter/datacenter?{query}",
      "requestSchema": "schema.json",
      "responseSchema": "schema.json",
      "timeout": 0,
      "sendEmpty": false,
      "sendGetBody": false,
      "requestDatatype": "JSON",
      "responseDatatype": "JSON",
      "headers": {},
      "responseObjects": [
        {
          "type": "default",
          "key": "",
          "mockFile": ""
        }
      ]
    },
    {
      "name": "getVcenterdatacenter",
      "protocol": "REST",
      "method": "GET",
      "entitypath": "{base_path}/{version}/vcenter/datacenter?{query}",
      "requestSchema": "schema.json",
      "responseSchema": "schema.json",
      "timeout": 0,
      "sendEmpty": false,
      "sendGetBody": false,
      "requestDatatype": "JSON",
      "responseDatatype": "JSON",
      "headers": {},
      "responseObjects": [
        {
          "type": "default",
          "key": "",
          "mockFile": "mockdatafiles/getVcenterdatacenter-default.json"
        }
      ]
    },
    {
      "name": "getVcenterdatacenterdatacenter",
      "protocol": "REST",
      "method": "GET",
      "entitypath": "{base_path}/{version}/vcenter/datacenter/{pathv1}?{query}",
      "requestSchema": "schema.json",
      "responseSchema": "schema.json",
      "timeout": 0,
      "sendEmpty": false,
      "sendGetBody": false,
      "requestDatatype": "JSON",
      "responseDatatype": "JSON",
      "headers": {},
      "responseObjects": [
        {
          "type": "default",
          "key": "",
          "mockFile": "mockdatafiles/getVcenterdatacenterdatacenter-default.json"
        }
      ]
    },
    {
      "name": "deleteVcenterdatacenterdatacenter",
      "protocol": "REST",
      "method": "DELETE",
      "entitypath": "{base_path}/{version}/vcenter/datacenter/{pathv1}?{query}",
      "requestSchema": "schema.json",
      "responseSchema": "schema.json",
      "timeout": 0,
      "sendEmpty": false,
      "sendGetBody": false,
      "requestDatatype": "JSON",
      "responseDatatype": "JSON",
      "headers": {},
      "responseObjects": [
        {
          "type": "default",
          "key": "",
          "mockFile": ""
        }
      ]
    }
  ]
}