{
  "actions": [
    {
      "name": "postVcentervmvmhardwareethernet",
      "protocol": "REST",
      "method": "POST",
      "entitypath": "{base_path}/{version}/vcenter/vm/{pathv1}/hardware/ethernet?{query}",
      "requestSchema": "schema.json",
      "responseSchema": "schema.json",
      "timeout": 0,
      "sendEmpty": false,
      "sendGetBody": false,
      "requestDatatype": "JSON",
      "responseDatatype": "JSON",
      "headers": {},
      "responseObjects": [
        {
          "type": "default",
          "key": "",
          "mockFile": ""
        }
      ]
    },
    {
      "name": "getVcentervmvmhardwareethernet",
      "protocol": "REST",
      "method": "GET",
      "entitypath": "{base_path}/{version}/vcenter/vm/{pathv1}/hardware/ethernet?{query}",
      "requestSchema": "schema.json",
      "responseSchema": "schema.json",
      "timeout": 0,
      "sendEmpty": false,
      "sendGetBody": false,
      "requestDatatype": "JSON",
      "responseDatatype": "JSON",
      "headers": {},
      "responseObjects": [
        {
          "type": "default",
          "key": "",
          "mockFile": "mockdatafiles/getVcentervmvmhardwareethernet-default.json"
        }
      ]
    },
    {
      "name": "patchVcentervmvmhardwareethernetnic",
      "protocol": "REST",
      "method": "PATCH",
      "entitypath": "{base_path}/{version}/vcenter/vm/{pathv1}/hardware/ethernet/{pathv2}?{query}",
      "requestSchema": "schema.json",
      "responseSchema": "schema.json",
      "timeout": 0,
      "sendEmpty": false,
      "sendGetBody": false,
      "requestDatatype": "JSON",
      "responseDatatype": "JSON",
      "headers": {},
      "responseObjects": [
        {
          "type": "default",
          "key": "",
          "mockFile": ""
        }
      ]
    },
    {
      "name": "getVcentervmvmhardwareethernetnic",
      "protocol": "REST",
      "method": "GET",
      "entitypath": "{base_path}/{version}/vcenter/vm/{pathv1}/hardware/ethernet/{pathv2}?{query}",
      "requestSchema": "schema.json",
      "responseSchema": "schema.json",
      "timeout": 0,
      "sendEmpty": false,
      "sendGetBody": false,
      "requestDatatype": "JSON",
      "responseDatatype": "JSON",
      "headers": {},
      "responseObjects": [
        {
          "type": "default",
          "key": "",
          "mockFile": "mockdatafiles/getVcentervmvmhardwareethernetnic-default.json"
        }
      ]
    },
    {
      "name": "deleteVcentervmvmhardwareethernetnic",
      "protocol": "REST",
      "method": "DELETE",
      "entitypath": "{base_path}/{version}/vcenter/vm/{pathv1}/hardware/ethernet/{pathv2}?{query}",
      "requestSchema": "schema.json",
      "responseSchema": "schema.json",
      "timeout": 0,
      "sendEmpty": false,
      "sendGetBody": false,
      "requestDatatype": "JSON",
      "responseDatatype": "JSON",
      "headers": {},
      "responseObjects": [
        {
          "type": "default",
          "key": "",
          "mockFile": ""
        }
      ]
    },
    {
      "name": "postVcentervmvmhardwareethernetnicconnect",
      "protocol": "REST",
      "method": "POST",
      "entitypath": "{base_path}/{version}/vcenter/vm/{pathv1}/hardware/ethernet/{pathv2}/connect?{query}",
      "requestSchema": "schema.json",
      "responseSchema": "schema.json",
      "timeout": 0,
      "sendEmpty": false,
      "sendGetBody": false,
      "requestDatatype": "JSON",
      "responseDatatype": "JSON",
      "headers": {},
      "responseObjects": [
        {
          "type": "default",
          "key": "",
          "mockFile": ""
        }
      ]
    },
    {
      "name": "postVcentervmvmhardwareethernetnicdisconnect",
      "protocol": "REST",
      "method": "POST",
      "entitypath": "{base_path}/{version}/vcenter/vm/{pathv1}/hardware/ethernet/{pathv2}/disconnect?{query}",
      "requestSchema": "schema.json",
      "responseSchema": "schema.json",
      "timeout": 0,
      "sendEmpty": false,
      "sendGetBody": false,
      "requestDatatype": "JSON",
      "responseDatatype": "JSON",
      "headers": {},
      "responseObjects": [
        {
          "type": "default",
          "key": "",
          "mockFile": ""
        }
      ]
    }
  ]
}