{
  "backing": {
    "host_device": "string",
    "image_file": "string",
    "type": "IMAGE_FILE",
    "auto_detect": false
  },
  "state": "CONNECTED",
  "start_connected": true,
  "allow_guest_control": false,
  "label": "string"
}