{
  "actions": [
    {
      "name": "getList123456789101112",
      "protocol": "REST",
      "method": "GET",
      "entitypath": "{base_path}/{version}/api/orgs/{pathv1}/sddcs/{pathv2}/networks/4.0/edges/{pathv3}/firewall/config?{query}",
      "requestSchema": "schema.json",
      "responseSchema": "schema.json",
      "timeout": 0,
      "sendEmpty": false,
      "sendGetBody": false,
      "requestDatatype": "JSON",
      "responseDatatype": "JSON",
      "headers": {},
      "responseObjects": [
        {
          "type": "default",
          "key": "",
          "mockFile": ""
        }
      ]
    },
    {
      "name": "putUpdate12345",
      "protocol": "REST",
      "method": "PUT",
      "entitypath": "{base_path}/{version}/api/orgs/{pathv1}/sddcs/{pathv2}/networks/4.0/edges/{pathv3}/firewall/config?{query}",
      "requestSchema": "schema.json",
      "responseSchema": "schema.json",
      "timeout": 0,
      "sendEmpty": false,
      "requestDatatype": "JSON",
      "responseDatatype": "JSON",
      "headers": {},
      "responseObjects": [
        {
          "type": "default",
          "key": "",
          "mockFile": ""
        }
      ]
    },
    {
      "name": "delete12345678",
      "protocol": "REST",
      "method": "DELETE",
      "entitypath": "{base_path}/{version}/api/orgs/{pathv1}/sddcs/{pathv2}/networks/4.0/edges/{pathv3}/firewall/config?{query}",
      "requestSchema": "schema.json",
      "responseSchema": "schema.json",
      "timeout": 0,
      "sendEmpty": false,
      "requestDatatype": "JSON",
      "responseDatatype": "JSON",
      "headers": {},
      "responseObjects": [
        {
          "type": "default",
          "key": "",
          "mockFile": ""
        }
      ]
    }
  ]
}