{
  "$id": "schema.json",
  "type": "object",
  "schema": "http://json-schema.org/draft-07/schema#",
  "translate": false,
  "dynamicfields": true,
  "properties": {
    "ph_request_type": {
      "type": "string",
      "description": "type of request (internal to adapter)",
      "default": "delete12345",
      "enum": [
        "delete12345",
        "patchUpdate1",
        "getDetails1234567",
        "postCreate1234",
        "getList12345678910",
        "convert"
      ],
      "external_name": "ph_request_type"
    }
  },
  "definitions": {}
}