{
  "$id": "schema.json",
  "type": "object",
  "schema": "http://json-schema.org/draft-07/schema#",
  "translate": true,
  "dynamicfields": true,
  "properties": {
    "ph_request_type": {
      "type": "string",
      "description": "type of request (internal to adapter)",
      "default": "createStateVersion",
      "enum": [
        "createStateVersion",
        "listStateVersions",
        "fetchCurrentStateVersionForWorkspace",
        "showStateVersion"
      ],
      "external_name": "ph_request_type"
    },
    "workspaceId": {
      "type": "string",
      "description": "The ID for the workspace whose current state version you want to fetch. Obtain this from the workspace settings or the Show Workspace endpoint.",
      "parse": false,
      "encode": false,
      "encrypt": {
        "type": "AES",
        "key": ""
      },
      "external_name": "workspace_id"
    },
    "filterWorkspaceName": {
      "type": "string",
      "description": "Required The name of one workspace to list versions for.",
      "parse": false,
      "encode": false,
      "encrypt": {
        "type": "AES",
        "key": ""
      },
      "external_name": "filter[workspace][name]"
    },
    "filterOrganizationName": {
      "type": "string",
      "description": "Required The name of the organization that owns the desired workspace.",
      "parse": false,
      "encode": false,
      "encrypt": {
        "type": "AES",
        "key": ""
      },
      "external_name": "filter[organization][name]"
    },
    "pageNumber": {
      "type": "string",
      "description": "Optional. If omitted, the endpoint will return the first page.",
      "parse": false,
      "encode": false,
      "encrypt": {
        "type": "AES",
        "key": ""
      },
      "external_name": "page[number]"
    },
    "pageSize": {
      "type": "string",
      "description": "Optional. If omitted, the endpoint will return 20 state versions per page.",
      "parse": false,
      "encode": false,
      "encrypt": {
        "type": "AES",
        "key": ""
      },
      "external_name": "page[size]"
    },
    "stateVersionId": {
      "type": "string",
      "description": "The ID of the desired state version.",
      "parse": false,
      "encode": false,
      "encrypt": {
        "type": "AES",
        "key": ""
      },
      "external_name": "state_version_id"
    }
  },
  "definitions": {}
}