{
  "$id": "schema.json",
  "type": "object",
  "schema": "http://json-schema.org/draft-07/schema#",
  "translate": true,
  "dynamicfields": true,
  "properties": {
    "ph_request_type": {
      "type": "string",
      "description": "type of request (internal to adapter)",
      "default": "createPolicySet",
      "enum": [
        "createPolicySet",
        "listPolicySets",
        "showPolicySet",
        "updatePolicySet",
        "deletePolicySet",
        "addPoliciesToPolicySet",
        "removePoliciesFromThePolicySet",
        "attachPolicySetToWorkspaces",
        "detachthePolicySetFromWorkspaces",
        "createPolicySetVersion",
        "showPolicySetVersion"
      ],
      "external_name": "ph_request_type"
    },
    "organizationName": {
      "type": "string",
      "description": "The organization to list policy sets for.",
      "parse": false,
      "encode": false,
      "encrypt": {
        "type": "AES",
        "key": ""
      },
      "external_name": "organization_name"
    },
    "filterVersioned": {
      "type": "string",
      "description": "Optional. Allows filtering policy sets based on whether they are versioned (VCS-managed or API-managed), or use individual policy relationships. Accepts a boolean true/fa...(description truncated)",
      "parse": false,
      "encode": false,
      "encrypt": {
        "type": "AES",
        "key": ""
      },
      "external_name": "filter[versioned]"
    },
    "pageNumber": {
      "type": "string",
      "description": "Optional. If omitted, the endpoint will return the first page.",
      "parse": false,
      "encode": false,
      "encrypt": {
        "type": "AES",
        "key": ""
      },
      "external_name": "page[number]"
    },
    "pageSize": {
      "type": "string",
      "description": "Optional. If omitted, the endpoint will return 20 policy sets per page.",
      "parse": false,
      "encode": false,
      "encrypt": {
        "type": "AES",
        "key": ""
      },
      "external_name": "page[size]"
    },
    "searchName": {
      "type": "string",
      "description": "Optional. Allows searching the organization&#39;s policy sets by name.",
      "parse": false,
      "encode": false,
      "encrypt": {
        "type": "AES",
        "key": ""
      },
      "external_name": "search[name]"
    }
  },
  "definitions": {}
}